lucene-dev mailing list archives

Site index · List index
Message view « Date » · « Thread »
Top « Date » · « Thread »
From Shalin Shekhar Mangar <sha...@apache.org>
Subject Re: [JENKINS] Lucene-Solr-trunk-Linux (32bit/jdk1.8.0_20-ea-b21) - Build # 10800 - Failure!
Date Sat, 12 Jul 2014 23:53:03 GMT
This was due to SOLR-6240. I committed a fix.


On Sun, Jul 13, 2014 at 3:56 AM, Policeman Jenkins Server <
jenkins@thetaphi.de> wrote:

> Build: http://jenkins.thetaphi.de/job/Lucene-Solr-trunk-Linux/10800/
> Java: 32bit/jdk1.8.0_20-ea-b21 -server -XX:+UseParallelGC
>
> 6 tests failed.
> REGRESSION:  org.apache.solr.cloud.CustomCollectionTest.testDistribSearch
>
> Error Message:
> expected:<3> but was:<6>
>
> Stack Trace:
> java.lang.AssertionError: expected:<3> but was:<6>
>         at
> __randomizedtesting.SeedInfo.seed([AE3C63646FD894D0:2FDAED7C1887F4EC]:0)
>         at org.junit.Assert.fail(Assert.java:93)
>         at org.junit.Assert.failNotEquals(Assert.java:647)
>         at org.junit.Assert.assertEquals(Assert.java:128)
>         at org.junit.Assert.assertEquals(Assert.java:472)
>         at org.junit.Assert.assertEquals(Assert.java:456)
>         at
> org.apache.solr.cloud.CustomCollectionTest.testCustomCollectionsAPI(CustomCollectionTest.java:263)
>         at
> org.apache.solr.cloud.CustomCollectionTest.doTest(CustomCollectionTest.java:127)
>         at
> org.apache.solr.BaseDistributedSearchTestCase.testDistribSearch(BaseDistributedSearchTestCase.java:863)
>         at sun.reflect.NativeMethodAccessorImpl.invoke0(Native Method)
>         at
> sun.reflect.NativeMethodAccessorImpl.invoke(NativeMethodAccessorImpl.java:62)
>         at
> sun.reflect.DelegatingMethodAccessorImpl.invoke(DelegatingMethodAccessorImpl.java:43)
>         at java.lang.reflect.Method.invoke(Method.java:483)
>         at
> com.carrotsearch.randomizedtesting.RandomizedRunner.invoke(RandomizedRunner.java:1618)
>         at
> com.carrotsearch.randomizedtesting.RandomizedRunner$6.evaluate(RandomizedRunner.java:827)
>         at
> com.carrotsearch.randomizedtesting.RandomizedRunner$7.evaluate(RandomizedRunner.java:863)
>         at
> com.carrotsearch.randomizedtesting.RandomizedRunner$8.evaluate(RandomizedRunner.java:877)
>         at
> com.carrotsearch.randomizedtesting.rules.SystemPropertiesRestoreRule$1.evaluate(SystemPropertiesRestoreRule.java:53)
>         at
> org.apache.lucene.util.TestRuleSetupTeardownChained$1.evaluate(TestRuleSetupTeardownChained.java:50)
>         at
> org.apache.lucene.util.AbstractBeforeAfterRule$1.evaluate(AbstractBeforeAfterRule.java:46)
>         at
> com.carrotsearch.randomizedtesting.rules.SystemPropertiesInvariantRule$1.evaluate(SystemPropertiesInvariantRule.java:55)
>         at
> org.apache.lucene.util.TestRuleThreadAndTestName$1.evaluate(TestRuleThreadAndTestName.java:49)
>         at
> org.apache.lucene.util.TestRuleIgnoreAfterMaxFailures$1.evaluate(TestRuleIgnoreAfterMaxFailures.java:65)
>         at
> org.apache.lucene.util.TestRuleMarkFailure$1.evaluate(TestRuleMarkFailure.java:48)
>         at
> com.carrotsearch.randomizedtesting.rules.StatementAdapter.evaluate(StatementAdapter.java:36)
>         at
> com.carrotsearch.randomizedtesting.ThreadLeakControl$StatementRunner.run(ThreadLeakControl.java:365)
>         at
> com.carrotsearch.randomizedtesting.ThreadLeakControl.forkTimeoutingTask(ThreadLeakControl.java:798)
>         at
> com.carrotsearch.randomizedtesting.ThreadLeakControl$3.evaluate(ThreadLeakControl.java:458)
>         at
> com.carrotsearch.randomizedtesting.RandomizedRunner.runSingleTest(RandomizedRunner.java:836)
>         at
> com.carrotsearch.randomizedtesting.RandomizedRunner$3.evaluate(RandomizedRunner.java:738)
>         at
> com.carrotsearch.randomizedtesting.RandomizedRunner$4.evaluate(RandomizedRunner.java:772)
>         at
> com.carrotsearch.randomizedtesting.RandomizedRunner$5.evaluate(RandomizedRunner.java:783)
>         at
> com.carrotsearch.randomizedtesting.rules.StatementAdapter.evaluate(StatementAdapter.java:36)
>         at
> com.carrotsearch.randomizedtesting.rules.SystemPropertiesRestoreRule$1.evaluate(SystemPropertiesRestoreRule.java:53)
>         at
> org.apache.lucene.util.AbstractBeforeAfterRule$1.evaluate(AbstractBeforeAfterRule.java:46)
>         at
> org.apache.lucene.util.TestRuleStoreClassName$1.evaluate(TestRuleStoreClassName.java:42)
>         at
> com.carrotsearch.randomizedtesting.rules.SystemPropertiesInvariantRule$1.evaluate(SystemPropertiesInvariantRule.java:55)
>         at
> com.carrotsearch.randomizedtesting.rules.NoShadowingOrOverridesOnMethodsRule$1.evaluate(NoShadowingOrOverridesOnMethodsRule.java:39)
>         at
> com.carrotsearch.randomizedtesting.rules.NoShadowingOrOverridesOnMethodsRule$1.evaluate(NoShadowingOrOverridesOnMethodsRule.java:39)
>         at
> com.carrotsearch.randomizedtesting.rules.StatementAdapter.evaluate(StatementAdapter.java:36)
>         at
> com.carrotsearch.randomizedtesting.rules.StatementAdapter.evaluate(StatementAdapter.java:36)
>         at
> com.carrotsearch.randomizedtesting.rules.StatementAdapter.evaluate(StatementAdapter.java:36)
>         at
> org.apache.lucene.util.TestRuleAssertionsRequired$1.evaluate(TestRuleAssertionsRequired.java:43)
>         at
> org.apache.lucene.util.TestRuleMarkFailure$1.evaluate(TestRuleMarkFailure.java:48)
>         at
> org.apache.lucene.util.TestRuleIgnoreAfterMaxFailures$1.evaluate(TestRuleIgnoreAfterMaxFailures.java:65)
>         at
> org.apache.lucene.util.TestRuleIgnoreTestSuites$1.evaluate(TestRuleIgnoreTestSuites.java:55)
>         at
> com.carrotsearch.randomizedtesting.rules.StatementAdapter.evaluate(StatementAdapter.java:36)
>         at
> com.carrotsearch.randomizedtesting.ThreadLeakControl$StatementRunner.run(ThreadLeakControl.java:365)
>         at java.lang.Thread.run(Thread.java:745)
>
>
> REGRESSION:
>  org.apache.solr.cloud.DistribCursorPagingTest.testDistribSearch
>
> Error Message:
> .response.numFound:10!=9
>
> Stack Trace:
> junit.framework.AssertionFailedError: .response.numFound:10!=9
>         at
> __randomizedtesting.SeedInfo.seed([AE3C63646FD894D0:2FDAED7C1887F4EC]:0)
>         at junit.framework.Assert.fail(Assert.java:50)
>         at
> org.apache.solr.BaseDistributedSearchTestCase.compareSolrResponses(BaseDistributedSearchTestCase.java:836)
>         at
> org.apache.solr.BaseDistributedSearchTestCase.compareResponses(BaseDistributedSearchTestCase.java:855)
>         at
> org.apache.solr.BaseDistributedSearchTestCase.query(BaseDistributedSearchTestCase.java:558)
>         at
> org.apache.solr.BaseDistributedSearchTestCase.query(BaseDistributedSearchTestCase.java:525)
>         at
> org.apache.solr.cloud.DistribCursorPagingTest.doSimpleTest(DistribCursorPagingTest.java:479)
>         at
> org.apache.solr.cloud.DistribCursorPagingTest.doTest(DistribCursorPagingTest.java:86)
>         at
> org.apache.solr.BaseDistributedSearchTestCase.testDistribSearch(BaseDistributedSearchTestCase.java:863)
>         at sun.reflect.GeneratedMethodAccessor37.invoke(Unknown Source)
>         at
> sun.reflect.DelegatingMethodAccessorImpl.invoke(DelegatingMethodAccessorImpl.java:43)
>         at java.lang.reflect.Method.invoke(Method.java:483)
>         at
> com.carrotsearch.randomizedtesting.RandomizedRunner.invoke(RandomizedRunner.java:1618)
>         at
> com.carrotsearch.randomizedtesting.RandomizedRunner$6.evaluate(RandomizedRunner.java:827)
>         at
> com.carrotsearch.randomizedtesting.RandomizedRunner$7.evaluate(RandomizedRunner.java:863)
>         at
> com.carrotsearch.randomizedtesting.RandomizedRunner$8.evaluate(RandomizedRunner.java:877)
>         at
> com.carrotsearch.randomizedtesting.rules.SystemPropertiesRestoreRule$1.evaluate(SystemPropertiesRestoreRule.java:53)
>         at
> org.apache.lucene.util.TestRuleSetupTeardownChained$1.evaluate(TestRuleSetupTeardownChained.java:50)
>         at
> org.apache.lucene.util.AbstractBeforeAfterRule$1.evaluate(AbstractBeforeAfterRule.java:46)
>         at
> com.carrotsearch.randomizedtesting.rules.SystemPropertiesInvariantRule$1.evaluate(SystemPropertiesInvariantRule.java:55)
>         at
> org.apache.lucene.util.TestRuleThreadAndTestName$1.evaluate(TestRuleThreadAndTestName.java:49)
>         at
> org.apache.lucene.util.TestRuleIgnoreAfterMaxFailures$1.evaluate(TestRuleIgnoreAfterMaxFailures.java:65)
>         at
> org.apache.lucene.util.TestRuleMarkFailure$1.evaluate(TestRuleMarkFailure.java:48)
>         at
> com.carrotsearch.randomizedtesting.rules.StatementAdapter.evaluate(StatementAdapter.java:36)
>         at
> com.carrotsearch.randomizedtesting.ThreadLeakControl$StatementRunner.run(ThreadLeakControl.java:365)
>         at
> com.carrotsearch.randomizedtesting.ThreadLeakControl.forkTimeoutingTask(ThreadLeakControl.java:798)
>         at
> com.carrotsearch.randomizedtesting.ThreadLeakControl$3.evaluate(ThreadLeakControl.java:458)
>         at
> com.carrotsearch.randomizedtesting.RandomizedRunner.runSingleTest(RandomizedRunner.java:836)
>         at
> com.carrotsearch.randomizedtesting.RandomizedRunner$3.evaluate(RandomizedRunner.java:738)
>         at
> com.carrotsearch.randomizedtesting.RandomizedRunner$4.evaluate(RandomizedRunner.java:772)
>         at
> com.carrotsearch.randomizedtesting.RandomizedRunner$5.evaluate(RandomizedRunner.java:783)
>         at
> com.carrotsearch.randomizedtesting.rules.StatementAdapter.evaluate(StatementAdapter.java:36)
>         at
> com.carrotsearch.randomizedtesting.rules.SystemPropertiesRestoreRule$1.evaluate(SystemPropertiesRestoreRule.java:53)
>         at
> org.apache.lucene.util.AbstractBeforeAfterRule$1.evaluate(AbstractBeforeAfterRule.java:46)
>         at
> org.apache.lucene.util.TestRuleStoreClassName$1.evaluate(TestRuleStoreClassName.java:42)
>         at
> com.carrotsearch.randomizedtesting.rules.SystemPropertiesInvariantRule$1.evaluate(SystemPropertiesInvariantRule.java:55)
>         at
> com.carrotsearch.randomizedtesting.rules.NoShadowingOrOverridesOnMethodsRule$1.evaluate(NoShadowingOrOverridesOnMethodsRule.java:39)
>         at
> com.carrotsearch.randomizedtesting.rules.NoShadowingOrOverridesOnMethodsRule$1.evaluate(NoShadowingOrOverridesOnMethodsRule.java:39)
>         at
> com.carrotsearch.randomizedtesting.rules.StatementAdapter.evaluate(StatementAdapter.java:36)
>         at
> com.carrotsearch.randomizedtesting.rules.StatementAdapter.evaluate(StatementAdapter.java:36)
>         at
> com.carrotsearch.randomizedtesting.rules.StatementAdapter.evaluate(StatementAdapter.java:36)
>         at
> org.apache.lucene.util.TestRuleAssertionsRequired$1.evaluate(TestRuleAssertionsRequired.java:43)
>         at
> org.apache.lucene.util.TestRuleMarkFailure$1.evaluate(TestRuleMarkFailure.java:48)
>         at
> org.apache.lucene.util.TestRuleIgnoreAfterMaxFailures$1.evaluate(TestRuleIgnoreAfterMaxFailures.java:65)
>         at
> org.apache.lucene.util.TestRuleIgnoreTestSuites$1.evaluate(TestRuleIgnoreTestSuites.java:55)
>         at
> com.carrotsearch.randomizedtesting.rules.StatementAdapter.evaluate(StatementAdapter.java:36)
>         at
> com.carrotsearch.randomizedtesting.ThreadLeakControl$StatementRunner.run(ThreadLeakControl.java:365)
>         at java.lang.Thread.run(Thread.java:745)
>
>
> REGRESSION:
>  org.apache.solr.cloud.FullSolrCloudDistribCmdsTest.testDistribSearch
>
> Error Message:
> shard2 is not consistent.  Got 20 from
> http://127.0.0.1:33895/cy_/tl/collection1lastClient and got 1333 from
> http://127.0.0.1:38866/cy_/tl/collection1
>
> Stack Trace:
> java.lang.AssertionError: shard2 is not consistent.  Got 20 from
> http://127.0.0.1:33895/cy_/tl/collection1lastClient and got 1333 from
> http://127.0.0.1:38866/cy_/tl/collection1
>         at
> __randomizedtesting.SeedInfo.seed([AE3C63646FD894D0:2FDAED7C1887F4EC]:0)
>         at org.junit.Assert.fail(Assert.java:93)
>         at
> org.apache.solr.cloud.AbstractFullDistribZkTestBase.checkShardConsistency(AbstractFullDistribZkTestBase.java:1132)
>         at
> org.apache.solr.cloud.AbstractFullDistribZkTestBase.checkShardConsistency(AbstractFullDistribZkTestBase.java:1111)
>         at
> org.apache.solr.cloud.AbstractFullDistribZkTestBase.checkShardConsistency(AbstractFullDistribZkTestBase.java:1103)
>         at
> org.apache.solr.cloud.FullSolrCloudDistribCmdsTest.testIndexingDocPerRequestWithHttpSolrServer(FullSolrCloudDistribCmdsTest.java:333)
>         at
> org.apache.solr.cloud.FullSolrCloudDistribCmdsTest.doTest(FullSolrCloudDistribCmdsTest.java:134)
>         at
> org.apache.solr.BaseDistributedSearchTestCase.testDistribSearch(BaseDistributedSearchTestCase.java:863)
>         at sun.reflect.GeneratedMethodAccessor37.invoke(Unknown Source)
>         at
> sun.reflect.DelegatingMethodAccessorImpl.invoke(DelegatingMethodAccessorImpl.java:43)
>         at java.lang.reflect.Method.invoke(Method.java:483)
>         at
> com.carrotsearch.randomizedtesting.RandomizedRunner.invoke(RandomizedRunner.java:1618)
>         at
> com.carrotsearch.randomizedtesting.RandomizedRunner$6.evaluate(RandomizedRunner.java:827)
>         at
> com.carrotsearch.randomizedtesting.RandomizedRunner$7.evaluate(RandomizedRunner.java:863)
>         at
> com.carrotsearch.randomizedtesting.RandomizedRunner$8.evaluate(RandomizedRunner.java:877)
>         at
> com.carrotsearch.randomizedtesting.rules.SystemPropertiesRestoreRule$1.evaluate(SystemPropertiesRestoreRule.java:53)
>         at
> org.apache.lucene.util.TestRuleSetupTeardownChained$1.evaluate(TestRuleSetupTeardownChained.java:50)
>         at
> org.apache.lucene.util.AbstractBeforeAfterRule$1.evaluate(AbstractBeforeAfterRule.java:46)
>         at
> com.carrotsearch.randomizedtesting.rules.SystemPropertiesInvariantRule$1.evaluate(SystemPropertiesInvariantRule.java:55)
>         at
> org.apache.lucene.util.TestRuleThreadAndTestName$1.evaluate(TestRuleThreadAndTestName.java:49)
>         at
> org.apache.lucene.util.TestRuleIgnoreAfterMaxFailures$1.evaluate(TestRuleIgnoreAfterMaxFailures.java:65)
>         at
> org.apache.lucene.util.TestRuleMarkFailure$1.evaluate(TestRuleMarkFailure.java:48)
>         at
> com.carrotsearch.randomizedtesting.rules.StatementAdapter.evaluate(StatementAdapter.java:36)
>         at
> com.carrotsearch.randomizedtesting.ThreadLeakControl$StatementRunner.run(ThreadLeakControl.java:365)
>         at
> com.carrotsearch.randomizedtesting.ThreadLeakControl.forkTimeoutingTask(ThreadLeakControl.java:798)
>         at
> com.carrotsearch.randomizedtesting.ThreadLeakControl$3.evaluate(ThreadLeakControl.java:458)
>         at
> com.carrotsearch.randomizedtesting.RandomizedRunner.runSingleTest(RandomizedRunner.java:836)
>         at
> com.carrotsearch.randomizedtesting.RandomizedRunner$3.evaluate(RandomizedRunner.java:738)
>         at
> com.carrotsearch.randomizedtesting.RandomizedRunner$4.evaluate(RandomizedRunner.java:772)
>         at
> com.carrotsearch.randomizedtesting.RandomizedRunner$5.evaluate(RandomizedRunner.java:783)
>         at
> com.carrotsearch.randomizedtesting.rules.StatementAdapter.evaluate(StatementAdapter.java:36)
>         at
> com.carrotsearch.randomizedtesting.rules.SystemPropertiesRestoreRule$1.evaluate(SystemPropertiesRestoreRule.java:53)
>         at
> org.apache.lucene.util.AbstractBeforeAfterRule$1.evaluate(AbstractBeforeAfterRule.java:46)
>         at
> org.apache.lucene.util.TestRuleStoreClassName$1.evaluate(TestRuleStoreClassName.java:42)
>         at
> com.carrotsearch.randomizedtesting.rules.SystemPropertiesInvariantRule$1.evaluate(SystemPropertiesInvariantRule.java:55)
>         at
> com.carrotsearch.randomizedtesting.rules.NoShadowingOrOverridesOnMethodsRule$1.evaluate(NoShadowingOrOverridesOnMethodsRule.java:39)
>         at
> com.carrotsearch.randomizedtesting.rules.NoShadowingOrOverridesOnMethodsRule$1.evaluate(NoShadowingOrOverridesOnMethodsRule.java:39)
>         at
> com.carrotsearch.randomizedtesting.rules.StatementAdapter.evaluate(StatementAdapter.java:36)
>         at
> com.carrotsearch.randomizedtesting.rules.StatementAdapter.evaluate(StatementAdapter.java:36)
>         at
> com.carrotsearch.randomizedtesting.rules.StatementAdapter.evaluate(StatementAdapter.java:36)
>         at
> org.apache.lucene.util.TestRuleAssertionsRequired$1.evaluate(TestRuleAssertionsRequired.java:43)
>         at
> org.apache.lucene.util.TestRuleMarkFailure$1.evaluate(TestRuleMarkFailure.java:48)
>         at
> org.apache.lucene.util.TestRuleIgnoreAfterMaxFailures$1.evaluate(TestRuleIgnoreAfterMaxFailures.java:65)
>         at
> org.apache.lucene.util.TestRuleIgnoreTestSuites$1.evaluate(TestRuleIgnoreTestSuites.java:55)
>         at
> com.carrotsearch.randomizedtesting.rules.StatementAdapter.evaluate(StatementAdapter.java:36)
>         at
> com.carrotsearch.randomizedtesting.ThreadLeakControl$StatementRunner.run(ThreadLeakControl.java:365)
>         at java.lang.Thread.run(Thread.java:745)
>
>
> REGRESSION:  org.apache.solr.cloud.OverseerTest.testOverseerFailure
>
> Error Message:
> Could not register as the leader because creating the ephemeral
> registration node in ZooKeeper failed
>
> Stack Trace:
> org.apache.solr.common.SolrException: Could not register as the leader
> because creating the ephemeral registration node in ZooKeeper failed
>         at
> __randomizedtesting.SeedInfo.seed([AE3C63646FD894D0:AA34EC977D7D7BF1]:0)
>         at
> org.apache.solr.cloud.ShardLeaderElectionContextBase.runLeaderProcess(ElectionContext.java:143)
>         at
> org.apache.solr.cloud.LeaderElector.runIamLeaderProcess(LeaderElector.java:163)
>         at
> org.apache.solr.cloud.LeaderElector.checkIfIamLeader(LeaderElector.java:125)
>         at
> org.apache.solr.cloud.LeaderElector.checkIfIamLeader(LeaderElector.java:155)
>         at
> org.apache.solr.cloud.LeaderElector.checkIfIamLeader(LeaderElector.java:155)
>         at
> org.apache.solr.cloud.LeaderElector.joinElection(LeaderElector.java:314)
>         at
> org.apache.solr.cloud.LeaderElector.joinElection(LeaderElector.java:221)
>         at
> org.apache.solr.cloud.OverseerTest$MockZKController.publishState(OverseerTest.java:155)
>         at
> org.apache.solr.cloud.OverseerTest.testOverseerFailure(OverseerTest.java:660)
>         at sun.reflect.NativeMethodAccessorImpl.invoke0(Native Method)
>         at
> sun.reflect.NativeMethodAccessorImpl.invoke(NativeMethodAccessorImpl.java:62)
>         at
> sun.reflect.DelegatingMethodAccessorImpl.invoke(DelegatingMethodAccessorImpl.java:43)
>         at java.lang.reflect.Method.invoke(Method.java:483)
>         at
> com.carrotsearch.randomizedtesting.RandomizedRunner.invoke(RandomizedRunner.java:1618)
>         at
> com.carrotsearch.randomizedtesting.RandomizedRunner$6.evaluate(RandomizedRunner.java:827)
>         at
> com.carrotsearch.randomizedtesting.RandomizedRunner$7.evaluate(RandomizedRunner.java:863)
>         at
> com.carrotsearch.randomizedtesting.RandomizedRunner$8.evaluate(RandomizedRunner.java:877)
>         at
> com.carrotsearch.randomizedtesting.rules.SystemPropertiesRestoreRule$1.evaluate(SystemPropertiesRestoreRule.java:53)
>         at
> org.apache.lucene.util.TestRuleSetupTeardownChained$1.evaluate(TestRuleSetupTeardownChained.java:50)
>         at
> org.apache.lucene.util.AbstractBeforeAfterRule$1.evaluate(AbstractBeforeAfterRule.java:46)
>         at
> com.carrotsearch.randomizedtesting.rules.SystemPropertiesInvariantRule$1.evaluate(SystemPropertiesInvariantRule.java:55)
>         at
> org.apache.lucene.util.TestRuleThreadAndTestName$1.evaluate(TestRuleThreadAndTestName.java:49)
>         at
> org.apache.lucene.util.TestRuleIgnoreAfterMaxFailures$1.evaluate(TestRuleIgnoreAfterMaxFailures.java:65)
>         at
> org.apache.lucene.util.TestRuleMarkFailure$1.evaluate(TestRuleMarkFailure.java:48)
>         at
> com.carrotsearch.randomizedtesting.rules.StatementAdapter.evaluate(StatementAdapter.java:36)
>         at
> com.carrotsearch.randomizedtesting.ThreadLeakControl$StatementRunner.run(ThreadLeakControl.java:365)
>         at
> com.carrotsearch.randomizedtesting.ThreadLeakControl.forkTimeoutingTask(ThreadLeakControl.java:798)
>         at
> com.carrotsearch.randomizedtesting.ThreadLeakControl$3.evaluate(ThreadLeakControl.java:458)
>         at
> com.carrotsearch.randomizedtesting.RandomizedRunner.runSingleTest(RandomizedRunner.java:836)
>         at
> com.carrotsearch.randomizedtesting.RandomizedRunner$3.evaluate(RandomizedRunner.java:738)
>         at
> com.carrotsearch.randomizedtesting.RandomizedRunner$4.evaluate(RandomizedRunner.java:772)
>         at
> com.carrotsearch.randomizedtesting.RandomizedRunner$5.evaluate(RandomizedRunner.java:783)
>         at
> com.carrotsearch.randomizedtesting.rules.StatementAdapter.evaluate(StatementAdapter.java:36)
>         at
> com.carrotsearch.randomizedtesting.rules.SystemPropertiesRestoreRule$1.evaluate(SystemPropertiesRestoreRule.java:53)
>         at
> org.apache.lucene.util.AbstractBeforeAfterRule$1.evaluate(AbstractBeforeAfterRule.java:46)
>         at
> org.apache.lucene.util.TestRuleStoreClassName$1.evaluate(TestRuleStoreClassName.java:42)
>         at
> com.carrotsearch.randomizedtesting.rules.SystemPropertiesInvariantRule$1.evaluate(SystemPropertiesInvariantRule.java:55)
>         at
> com.carrotsearch.randomizedtesting.rules.NoShadowingOrOverridesOnMethodsRule$1.evaluate(NoShadowingOrOverridesOnMethodsRule.java:39)
>         at
> com.carrotsearch.randomizedtesting.rules.NoShadowingOrOverridesOnMethodsRule$1.evaluate(NoShadowingOrOverridesOnMethodsRule.java:39)
>         at
> com.carrotsearch.randomizedtesting.rules.StatementAdapter.evaluate(StatementAdapter.java:36)
>         at
> com.carrotsearch.randomizedtesting.rules.StatementAdapter.evaluate(StatementAdapter.java:36)
>         at
> com.carrotsearch.randomizedtesting.rules.StatementAdapter.evaluate(StatementAdapter.java:36)
>         at
> org.apache.lucene.util.TestRuleAssertionsRequired$1.evaluate(TestRuleAssertionsRequired.java:43)
>         at
> org.apache.lucene.util.TestRuleMarkFailure$1.evaluate(TestRuleMarkFailure.java:48)
>         at
> org.apache.lucene.util.TestRuleIgnoreAfterMaxFailures$1.evaluate(TestRuleIgnoreAfterMaxFailures.java:65)
>         at
> org.apache.lucene.util.TestRuleIgnoreTestSuites$1.evaluate(TestRuleIgnoreTestSuites.java:55)
>         at
> com.carrotsearch.randomizedtesting.rules.StatementAdapter.evaluate(StatementAdapter.java:36)
>         at
> com.carrotsearch.randomizedtesting.ThreadLeakControl$StatementRunner.run(ThreadLeakControl.java:365)
>         at java.lang.Thread.run(Thread.java:745)
> Caused by: org.apache.zookeeper.KeeperException$NodeExistsException:
> KeeperErrorCode = NodeExists for /collections/collection1/leaders/shard1
>         at
> org.apache.zookeeper.KeeperException.create(KeeperException.java:119)
>         at
> org.apache.zookeeper.KeeperException.create(KeeperException.java:51)
>         at org.apache.zookeeper.ZooKeeper.create(ZooKeeper.java:783)
>         at
> org.apache.solr.common.cloud.SolrZkClient$10.execute(SolrZkClient.java:432)
>         at
> org.apache.solr.common.cloud.ZkCmdExecutor.retryOperation(ZkCmdExecutor.java:73)
>         at
> org.apache.solr.common.cloud.SolrZkClient.makePath(SolrZkClient.java:429)
>         at
> org.apache.solr.common.cloud.SolrZkClient.makePath(SolrZkClient.java:386)
>         at
> org.apache.solr.common.cloud.SolrZkClient.makePath(SolrZkClient.java:373)
>         at
> org.apache.solr.cloud.ShardLeaderElectionContextBase$1.execute(ElectionContext.java:135)
>         at
> org.apache.solr.common.util.RetryUtil.retryOnThrowable(RetryUtil.java:31)
>         at
> org.apache.solr.cloud.ShardLeaderElectionContextBase.runLeaderProcess(ElectionContext.java:130)
>         ... 48 more
>
>
> REGRESSION:  org.apache.solr.cloud.ShardRoutingTest.testDistribSearch
>
> Error Message:
> expected:<[e!doc4, b!doc1, d!doc3, f1!f2!doc5]> but was:<[e!doc4,
> f1!f2!doc5/5, b!doc1, d!doc3, f1!f2!doc5]>
>
> Stack Trace:
> java.lang.AssertionError: expected:<[e!doc4, b!doc1, d!doc3, f1!f2!doc5]>
> but was:<[e!doc4, f1!f2!doc5/5, b!doc1, d!doc3, f1!f2!doc5]>
>         at
> __randomizedtesting.SeedInfo.seed([AE3C63646FD894D0:2FDAED7C1887F4EC]:0)
>         at org.junit.Assert.fail(Assert.java:93)
>         at org.junit.Assert.failNotEquals(Assert.java:647)
>         at org.junit.Assert.assertEquals(Assert.java:128)
>         at org.junit.Assert.assertEquals(Assert.java:147)
>         at
> org.apache.solr.cloud.AbstractFullDistribZkTestBase.doQuery(AbstractFullDistribZkTestBase.java:1407)
>         at
> org.apache.solr.cloud.ShardRoutingTest.doHashingTest(ShardRoutingTest.java:207)
>         at
> org.apache.solr.cloud.ShardRoutingTest.doTest(ShardRoutingTest.java:123)
>         at
> org.apache.solr.BaseDistributedSearchTestCase.testDistribSearch(BaseDistributedSearchTestCase.java:863)
>         at sun.reflect.NativeMethodAccessorImpl.invoke0(Native Method)
>         at
> sun.reflect.NativeMethodAccessorImpl.invoke(NativeMethodAccessorImpl.java:62)
>         at
> sun.reflect.DelegatingMethodAccessorImpl.invoke(DelegatingMethodAccessorImpl.java:43)
>         at java.lang.reflect.Method.invoke(Method.java:483)
>         at
> com.carrotsearch.randomizedtesting.RandomizedRunner.invoke(RandomizedRunner.java:1618)
>         at
> com.carrotsearch.randomizedtesting.RandomizedRunner$6.evaluate(RandomizedRunner.java:827)
>         at
> com.carrotsearch.randomizedtesting.RandomizedRunner$7.evaluate(RandomizedRunner.java:863)
>         at
> com.carrotsearch.randomizedtesting.RandomizedRunner$8.evaluate(RandomizedRunner.java:877)
>         at
> com.carrotsearch.randomizedtesting.rules.SystemPropertiesRestoreRule$1.evaluate(SystemPropertiesRestoreRule.java:53)
>         at
> org.apache.lucene.util.TestRuleSetupTeardownChained$1.evaluate(TestRuleSetupTeardownChained.java:50)
>         at
> org.apache.lucene.util.AbstractBeforeAfterRule$1.evaluate(AbstractBeforeAfterRule.java:46)
>         at
> com.carrotsearch.randomizedtesting.rules.SystemPropertiesInvariantRule$1.evaluate(SystemPropertiesInvariantRule.java:55)
>         at
> org.apache.lucene.util.TestRuleThreadAndTestName$1.evaluate(TestRuleThreadAndTestName.java:49)
>         at
> org.apache.lucene.util.TestRuleIgnoreAfterMaxFailures$1.evaluate(TestRuleIgnoreAfterMaxFailures.java:65)
>         at
> org.apache.lucene.util.TestRuleMarkFailure$1.evaluate(TestRuleMarkFailure.java:48)
>         at
> com.carrotsearch.randomizedtesting.rules.StatementAdapter.evaluate(StatementAdapter.java:36)
>         at
> com.carrotsearch.randomizedtesting.ThreadLeakControl$StatementRunner.run(ThreadLeakControl.java:365)
>         at
> com.carrotsearch.randomizedtesting.ThreadLeakControl.forkTimeoutingTask(ThreadLeakControl.java:798)
>         at
> com.carrotsearch.randomizedtesting.ThreadLeakControl$3.evaluate(ThreadLeakControl.java:458)
>         at
> com.carrotsearch.randomizedtesting.RandomizedRunner.runSingleTest(RandomizedRunner.java:836)
>         at
> com.carrotsearch.randomizedtesting.RandomizedRunner$3.evaluate(RandomizedRunner.java:738)
>         at
> com.carrotsearch.randomizedtesting.RandomizedRunner$4.evaluate(RandomizedRunner.java:772)
>         at
> com.carrotsearch.randomizedtesting.RandomizedRunner$5.evaluate(RandomizedRunner.java:783)
>         at
> com.carrotsearch.randomizedtesting.rules.StatementAdapter.evaluate(StatementAdapter.java:36)
>         at
> com.carrotsearch.randomizedtesting.rules.SystemPropertiesRestoreRule$1.evaluate(SystemPropertiesRestoreRule.java:53)
>         at
> org.apache.lucene.util.AbstractBeforeAfterRule$1.evaluate(AbstractBeforeAfterRule.java:46)
>         at
> org.apache.lucene.util.TestRuleStoreClassName$1.evaluate(TestRuleStoreClassName.java:42)
>         at
> com.carrotsearch.randomizedtesting.rules.SystemPropertiesInvariantRule$1.evaluate(SystemPropertiesInvariantRule.java:55)
>         at
> com.carrotsearch.randomizedtesting.rules.NoShadowingOrOverridesOnMethodsRule$1.evaluate(NoShadowingOrOverridesOnMethodsRule.java:39)
>         at
> com.carrotsearch.randomizedtesting.rules.NoShadowingOrOverridesOnMethodsRule$1.evaluate(NoShadowingOrOverridesOnMethodsRule.java:39)
>         at
> com.carrotsearch.randomizedtesting.rules.StatementAdapter.evaluate(StatementAdapter.java:36)
>         at
> com.carrotsearch.randomizedtesting.rules.StatementAdapter.evaluate(StatementAdapter.java:36)
>         at
> com.carrotsearch.randomizedtesting.rules.StatementAdapter.evaluate(StatementAdapter.java:36)
>         at
> org.apache.lucene.util.TestRuleAssertionsRequired$1.evaluate(TestRuleAssertionsRequired.java:43)
>         at
> org.apache.lucene.util.TestRuleMarkFailure$1.evaluate(TestRuleMarkFailure.java:48)
>         at
> org.apache.lucene.util.TestRuleIgnoreAfterMaxFailures$1.evaluate(TestRuleIgnoreAfterMaxFailures.java:65)
>         at
> org.apache.lucene.util.TestRuleIgnoreTestSuites$1.evaluate(TestRuleIgnoreTestSuites.java:55)
>         at
> com.carrotsearch.randomizedtesting.rules.StatementAdapter.evaluate(StatementAdapter.java:36)
>         at
> com.carrotsearch.randomizedtesting.ThreadLeakControl$StatementRunner.run(ThreadLeakControl.java:365)
>         at java.lang.Thread.run(Thread.java:745)
>
>
> REGRESSION:  org.apache.solr.cloud.SyncSliceTest.testDistribSearch
>
> Error Message:
> shard1 is not consistent.  Got 4 from
> https://127.0.0.1:59679/hvft/pc/collection1lastClient and got 2 from
> https://127.0.0.1:57711/hvft/pc/collection1
>
> Stack Trace:
> java.lang.AssertionError: shard1 is not consistent.  Got 4 from
> https://127.0.0.1:59679/hvft/pc/collection1lastClient and got 2 from
> https://127.0.0.1:57711/hvft/pc/collection1
>         at
> __randomizedtesting.SeedInfo.seed([AE3C63646FD894D0:2FDAED7C1887F4EC]:0)
>         at org.junit.Assert.fail(Assert.java:93)
>         at
> org.apache.solr.cloud.AbstractFullDistribZkTestBase.checkShardConsistency(AbstractFullDistribZkTestBase.java:1132)
>         at
> org.apache.solr.cloud.AbstractFullDistribZkTestBase.checkShardConsistency(AbstractFullDistribZkTestBase.java:1111)
>         at
> org.apache.solr.cloud.SyncSliceTest.doTest(SyncSliceTest.java:145)
>         at
> org.apache.solr.BaseDistributedSearchTestCase.testDistribSearch(BaseDistributedSearchTestCase.java:863)
>         at sun.reflect.NativeMethodAccessorImpl.invoke0(Native Method)
>         at
> sun.reflect.NativeMethodAccessorImpl.invoke(NativeMethodAccessorImpl.java:62)
>         at
> sun.reflect.DelegatingMethodAccessorImpl.invoke(DelegatingMethodAccessorImpl.java:43)
>         at java.lang.reflect.Method.invoke(Method.java:483)
>         at
> com.carrotsearch.randomizedtesting.RandomizedRunner.invoke(RandomizedRunner.java:1618)
>         at
> com.carrotsearch.randomizedtesting.RandomizedRunner$6.evaluate(RandomizedRunner.java:827)
>         at
> com.carrotsearch.randomizedtesting.RandomizedRunner$7.evaluate(RandomizedRunner.java:863)
>         at
> com.carrotsearch.randomizedtesting.RandomizedRunner$8.evaluate(RandomizedRunner.java:877)
>         at
> com.carrotsearch.randomizedtesting.rules.SystemPropertiesRestoreRule$1.evaluate(SystemPropertiesRestoreRule.java:53)
>         at
> org.apache.lucene.util.TestRuleSetupTeardownChained$1.evaluate(TestRuleSetupTeardownChained.java:50)
>         at
> org.apache.lucene.util.AbstractBeforeAfterRule$1.evaluate(AbstractBeforeAfterRule.java:46)
>         at
> com.carrotsearch.randomizedtesting.rules.SystemPropertiesInvariantRule$1.evaluate(SystemPropertiesInvariantRule.java:55)
>         at
> org.apache.lucene.util.TestRuleThreadAndTestName$1.evaluate(TestRuleThreadAndTestName.java:49)
>         at
> org.apache.lucene.util.TestRuleIgnoreAfterMaxFailures$1.evaluate(TestRuleIgnoreAfterMaxFailures.java:65)
>         at
> org.apache.lucene.util.TestRuleMarkFailure$1.evaluate(TestRuleMarkFailure.java:48)
>         at
> com.carrotsearch.randomizedtesting.rules.StatementAdapter.evaluate(StatementAdapter.java:36)
>         at
> com.carrotsearch.randomizedtesting.ThreadLeakControl$StatementRunner.run(ThreadLeakControl.java:365)
>         at
> com.carrotsearch.randomizedtesting.ThreadLeakControl.forkTimeoutingTask(ThreadLeakControl.java:798)
>         at
> com.carrotsearch.randomizedtesting.ThreadLeakControl$3.evaluate(ThreadLeakControl.java:458)
>         at
> com.carrotsearch.randomizedtesting.RandomizedRunner.runSingleTest(RandomizedRunner.java:836)
>         at
> com.carrotsearch.randomizedtesting.RandomizedRunner$3.evaluate(RandomizedRunner.java:738)
>         at
> com.carrotsearch.randomizedtesting.RandomizedRunner$4.evaluate(RandomizedRunner.java:772)
>         at
> com.carrotsearch.randomizedtesting.RandomizedRunner$5.evaluate(RandomizedRunner.java:783)
>         at
> com.carrotsearch.randomizedtesting.rules.StatementAdapter.evaluate(StatementAdapter.java:36)
>         at
> com.carrotsearch.randomizedtesting.rules.SystemPropertiesRestoreRule$1.evaluate(SystemPropertiesRestoreRule.java:53)
>         at
> org.apache.lucene.util.AbstractBeforeAfterRule$1.evaluate(AbstractBeforeAfterRule.java:46)
>         at
> org.apache.lucene.util.TestRuleStoreClassName$1.evaluate(TestRuleStoreClassName.java:42)
>         at
> com.carrotsearch.randomizedtesting.rules.SystemPropertiesInvariantRule$1.evaluate(SystemPropertiesInvariantRule.java:55)
>         at
> com.carrotsearch.randomizedtesting.rules.NoShadowingOrOverridesOnMethodsRule$1.evaluate(NoShadowingOrOverridesOnMethodsRule.java:39)
>         at
> com.carrotsearch.randomizedtesting.rules.NoShadowingOrOverridesOnMethodsRule$1.evaluate(NoShadowingOrOverridesOnMethodsRule.java:39)
>         at
> com.carrotsearch.randomizedtesting.rules.StatementAdapter.evaluate(StatementAdapter.java:36)
>         at
> com.carrotsearch.randomizedtesting.rules.StatementAdapter.evaluate(StatementAdapter.java:36)
>         at
> com.carrotsearch.randomizedtesting.rules.StatementAdapter.evaluate(StatementAdapter.java:36)
>         at
> org.apache.lucene.util.TestRuleAssertionsRequired$1.evaluate(TestRuleAssertionsRequired.java:43)
>         at
> org.apache.lucene.util.TestRuleMarkFailure$1.evaluate(TestRuleMarkFailure.java:48)
>         at
> org.apache.lucene.util.TestRuleIgnoreAfterMaxFailures$1.evaluate(TestRuleIgnoreAfterMaxFailures.java:65)
>         at
> org.apache.lucene.util.TestRuleIgnoreTestSuites$1.evaluate(TestRuleIgnoreTestSuites.java:55)
>         at
> com.carrotsearch.randomizedtesting.rules.StatementAdapter.evaluate(StatementAdapter.java:36)
>         at
> com.carrotsearch.randomizedtesting.ThreadLeakControl$StatementRunner.run(ThreadLeakControl.java:365)
>         at java.lang.Thread.run(Thread.java:745)
>
>
>
>
> Build Log:
> [...truncated 11063 lines...]
>    [junit4] Suite: org.apache.solr.cloud.SyncSliceTest
>    [junit4]   2> Creating dataDir:
> /mnt/ssd/jenkins/workspace/Lucene-Solr-trunk-Linux/solr/build/solr-core/test/J0/./temp/solr.cloud.SyncSliceTest-AE3C63646FD894D0-001/init-core-data-001
>    [junit4]   2> 391098 T1920 oas.SolrTestCaseJ4.buildSSLConfig Randomized
> ssl (true) and clientAuth (false)
>    [junit4]   2> 391098 T1920
> oas.BaseDistributedSearchTestCase.initHostContext Setting hostContext
> system property: /hvft/pc
>    [junit4]   2> 391102 T1920 oas.SolrTestCaseJ4.setUp ###Starting
> testDistribSearch
>    [junit4]   2> 391102 T1920 oasc.ZkTestServer.run STARTING ZK TEST SERVER
>    [junit4]   1> client port:0.0.0.0/0.0.0.0:0
>    [junit4]   2> 391103 T1921 oasc.ZkTestServer$ZKServerMain.runFromConfig
> Starting server
>    [junit4]   2> 391203 T1920 oasc.ZkTestServer.run start zk server on
> port:37318
>    [junit4]   2> 391205 T1920 oascc.ConnectionManager.waitForConnected
> Waiting for client to connect to ZooKeeper
>    [junit4]   2> 391209 T1927 oascc.ConnectionManager.process Watcher
> org.apache.solr.common.cloud.ConnectionManager@f6b3c6
> name:ZooKeeperConnection Watcher:127.0.0.1:37318 got event WatchedEvent
> state:SyncConnected type:None path:null path:null type:None
>    [junit4]   2> 391210 T1920 oascc.ConnectionManager.waitForConnected
> Client is connected to ZooKeeper
>    [junit4]   2> 391210 T1920 oascc.SolrZkClient.makePath makePath: /solr
>    [junit4]   2> 391218 T1920 oascc.ConnectionManager.waitForConnected
> Waiting for client to connect to ZooKeeper
>    [junit4]   2> 391219 T1929 oascc.ConnectionManager.process Watcher
> org.apache.solr.common.cloud.ConnectionManager@1877d88
> name:ZooKeeperConnection Watcher:127.0.0.1:37318/solr got event
> WatchedEvent state:SyncConnected type:None path:null path:null type:None
>    [junit4]   2> 391219 T1920 oascc.ConnectionManager.waitForConnected
> Client is connected to ZooKeeper
>    [junit4]   2> 391220 T1920 oascc.SolrZkClient.makePath makePath:
> /collections/collection1
>    [junit4]   2> 391223 T1920 oascc.SolrZkClient.makePath makePath:
> /collections/collection1/shards
>    [junit4]   2> 391226 T1920 oascc.SolrZkClient.makePath makePath:
> /collections/control_collection
>    [junit4]   2> 391228 T1920 oascc.SolrZkClient.makePath makePath:
> /collections/control_collection/shards
>    [junit4]   2> 391231 T1920 oasc.AbstractZkTestCase.putConfig put
> /mnt/ssd/jenkins/workspace/Lucene-Solr-trunk-Linux/solr/core/src/test-files/solr/collection1/conf/solrconfig-tlog.xml
> to /configs/conf1/solrconfig.xml
>    [junit4]   2> 391232 T1920 oascc.SolrZkClient.makePath makePath:
> /configs/conf1/solrconfig.xml
>    [junit4]   2> 391236 T1920 oasc.AbstractZkTestCase.putConfig put
> /mnt/ssd/jenkins/workspace/Lucene-Solr-trunk-Linux/solr/core/src/test-files/solr/collection1/conf/schema.xml
> to /configs/conf1/schema.xml
>    [junit4]   2> 391236 T1920 oascc.SolrZkClient.makePath makePath:
> /configs/conf1/schema.xml
>    [junit4]   2> 391243 T1920 oasc.AbstractZkTestCase.putConfig put
> /mnt/ssd/jenkins/workspace/Lucene-Solr-trunk-Linux/solr/core/src/test-files/solr/collection1/conf/solrconfig.snippet.randomindexconfig.xml
> to /configs/conf1/solrconfig.snippet.randomindexconfig.xml
>    [junit4]   2> 391244 T1920 oascc.SolrZkClient.makePath makePath:
> /configs/conf1/solrconfig.snippet.randomindexconfig.xml
>    [junit4]   2> 391247 T1920 oasc.AbstractZkTestCase.putConfig put
> /mnt/ssd/jenkins/workspace/Lucene-Solr-trunk-Linux/solr/core/src/test-files/solr/collection1/conf/stopwords.txt
> to /configs/conf1/stopwords.txt
>    [junit4]   2> 391248 T1920 oascc.SolrZkClient.makePath makePath:
> /configs/conf1/stopwords.txt
>    [junit4]   2> 391251 T1920 oasc.AbstractZkTestCase.putConfig put
> /mnt/ssd/jenkins/workspace/Lucene-Solr-trunk-Linux/solr/core/src/test-files/solr/collection1/conf/protwords.txt
> to /configs/conf1/protwords.txt
>    [junit4]   2> 391252 T1920 oascc.SolrZkClient.makePath makePath:
> /configs/conf1/protwords.txt
>    [junit4]   2> 391254 T1920 oasc.AbstractZkTestCase.putConfig put
> /mnt/ssd/jenkins/workspace/Lucene-Solr-trunk-Linux/solr/core/src/test-files/solr/collection1/conf/currency.xml
> to /configs/conf1/currency.xml
>    [junit4]   2> 391255 T1920 oascc.SolrZkClient.makePath makePath:
> /configs/conf1/currency.xml
>    [junit4]   2> 391258 T1920 oasc.AbstractZkTestCase.putConfig put
> /mnt/ssd/jenkins/workspace/Lucene-Solr-trunk-Linux/solr/core/src/test-files/solr/collection1/conf/enumsConfig.xml
> to /configs/conf1/enumsConfig.xml
>    [junit4]   2> 391259 T1920 oascc.SolrZkClient.makePath makePath:
> /configs/conf1/enumsConfig.xml
>    [junit4]   2> 391261 T1920 oasc.AbstractZkTestCase.putConfig put
> /mnt/ssd/jenkins/workspace/Lucene-Solr-trunk-Linux/solr/core/src/test-files/solr/collection1/conf/open-exchange-rates.json
> to /configs/conf1/open-exchange-rates.json
>    [junit4]   2> 391262 T1920 oascc.SolrZkClient.makePath makePath:
> /configs/conf1/open-exchange-rates.json
>    [junit4]   2> 391265 T1920 oasc.AbstractZkTestCase.putConfig put
> /mnt/ssd/jenkins/workspace/Lucene-Solr-trunk-Linux/solr/core/src/test-files/solr/collection1/conf/mapping-ISOLatin1Accent.txt
> to /configs/conf1/mapping-ISOLatin1Accent.txt
>    [junit4]   2> 391265 T1920 oascc.SolrZkClient.makePath makePath:
> /configs/conf1/mapping-ISOLatin1Accent.txt
>    [junit4]   2> 391268 T1920 oasc.AbstractZkTestCase.putConfig put
> /mnt/ssd/jenkins/workspace/Lucene-Solr-trunk-Linux/solr/core/src/test-files/solr/collection1/conf/old_synonyms.txt
> to /configs/conf1/old_synonyms.txt
>    [junit4]   2> 391269 T1920 oascc.SolrZkClient.makePath makePath:
> /configs/conf1/old_synonyms.txt
>    [junit4]   2> 391273 T1920 oasc.AbstractZkTestCase.putConfig put
> /mnt/ssd/jenkins/workspace/Lucene-Solr-trunk-Linux/solr/core/src/test-files/solr/collection1/conf/synonyms.txt
> to /configs/conf1/synonyms.txt
>    [junit4]   2> 391274 T1920 oascc.SolrZkClient.makePath makePath:
> /configs/conf1/synonyms.txt
>    [junit4]   2> 391277 T1920 oascc.ConnectionManager.waitForConnected
> Waiting for client to connect to ZooKeeper
>    [junit4]   2> 391278 T1931 oascc.ConnectionManager.process Watcher
> org.apache.solr.common.cloud.ConnectionManager@49468c
> name:ZooKeeperConnection Watcher:127.0.0.1:37318/solr got event
> WatchedEvent state:SyncConnected type:None path:null path:null type:None
>    [junit4]   2> 391279 T1920 oascc.ConnectionManager.waitForConnected
> Client is connected to ZooKeeper
>    [junit4]   2> 391563 T1920 oejs.Server.doStart jetty-8.1.10.v20130312
>    [junit4]   2> 391566 T1920 oejus.SslContextFactory.doStart Enabled
> Protocols [SSLv2Hello, SSLv3, TLSv1, TLSv1.1, TLSv1.2] of [SSLv2Hello,
> SSLv3, TLSv1, TLSv1.1, TLSv1.2]
>    [junit4]   2> 391571 T1920 oejs.AbstractConnector.doStart Started
> SslSelectChannelConnector@127.0.0.1:46199
>    [junit4]   2> 391573 T1920 oass.SolrDispatchFilter.init
> SolrDispatchFilter.init()
>    [junit4]   2> 391573 T1920 oasc.SolrResourceLoader.locateSolrHome JNDI
> not configured for solr (NoInitialContextEx)
>    [junit4]   2> 391574 T1920 oasc.SolrResourceLoader.locateSolrHome using
> system property solr.solr.home:
> /mnt/ssd/jenkins/workspace/Lucene-Solr-trunk-Linux/solr/build/solr-core/test/J0/./temp/solr.cloud.SyncSliceTest-AE3C63646FD894D0-001/tempDir-002
>    [junit4]   2> 391574 T1920 oasc.SolrResourceLoader.<init> new
> SolrResourceLoader for directory:
> '/mnt/ssd/jenkins/workspace/Lucene-Solr-trunk-Linux/solr/build/solr-core/test/J0/./temp/solr.cloud.SyncSliceTest-AE3C63646FD894D0-001/tempDir-002/'
>    [junit4]   2> 391593 T1920 oasc.ConfigSolr.fromFile Loading container
> configuration from
> /mnt/ssd/jenkins/workspace/Lucene-Solr-trunk-Linux/solr/build/solr-core/test/J0/./temp/solr.cloud.SyncSliceTest-AE3C63646FD894D0-001/tempDir-002/solr.xml
>    [junit4]   2> 391603 T1920 oasc.CoreContainer.<init> New CoreContainer
> 21524406
>    [junit4]   2> 391603 T1920 oasc.CoreContainer.load Loading cores into
> CoreContainer
> [instanceDir=/mnt/ssd/jenkins/workspace/Lucene-Solr-trunk-Linux/solr/build/solr-core/test/J0/./temp/solr.cloud.SyncSliceTest-AE3C63646FD894D0-001/tempDir-002/]
>    [junit4]   2> 391604 T1920 oashc.HttpShardHandlerFactory.getParameter
> Setting socketTimeout to: 90000
>    [junit4]   2> 391604 T1920 oashc.HttpShardHandlerFactory.getParameter
> Setting urlScheme to:
>    [junit4]   2> 391605 T1920 oashc.HttpShardHandlerFactory.getParameter
> Setting connTimeout to: 15000
>    [junit4]   2> 391605 T1920 oashc.HttpShardHandlerFactory.getParameter
> Setting maxConnectionsPerHost to: 20
>    [junit4]   2> 391605 T1920 oashc.HttpShardHandlerFactory.getParameter
> Setting corePoolSize to: 0
>    [junit4]   2> 391605 T1920 oashc.HttpShardHandlerFactory.getParameter
> Setting maximumPoolSize to: 2147483647
>    [junit4]   2> 391606 T1920 oashc.HttpShardHandlerFactory.getParameter
> Setting maxThreadIdleTime to: 5
>    [junit4]   2> 391606 T1920 oashc.HttpShardHandlerFactory.getParameter
> Setting sizeOfQueue to: -1
>    [junit4]   2> 391606 T1920 oashc.HttpShardHandlerFactory.getParameter
> Setting fairnessPolicy to: false
>    [junit4]   2> 391609 T1920 oasl.LogWatcher.createWatcher SLF4J impl is
> org.slf4j.impl.Log4jLoggerFactory
>    [junit4]   2> 391609 T1920 oasl.LogWatcher.newRegisteredLogWatcher
> Registering Log Listener [Log4j (org.slf4j.impl.Log4jLoggerFactory)]
>    [junit4]   2> 391609 T1920 oasc.CoreContainer.load Host Name: 127.0.0.1
>    [junit4]   2> 391610 T1920 oasc.ZkContainer.initZooKeeper Zookeeper
> client=127.0.0.1:37318/solr
>    [junit4]   2> 391610 T1920 oasc.ZkController.checkChrootPath zkHost
> includes chroot
>    [junit4]   2> 391611 T1920 oascc.ConnectionManager.waitForConnected
> Waiting for client to connect to ZooKeeper
>    [junit4]   2> 391613 T1942 oascc.ConnectionManager.process Watcher
> org.apache.solr.common.cloud.ConnectionManager@1672295
> name:ZooKeeperConnection Watcher:127.0.0.1:37318 got event WatchedEvent
> state:SyncConnected type:None path:null path:null type:None
>    [junit4]   2> 391613 T1920 oascc.ConnectionManager.waitForConnected
> Client is connected to ZooKeeper
>    [junit4]   2> 391616 T1920 oascc.ConnectionManager.waitForConnected
> Waiting for client to connect to ZooKeeper
>    [junit4]   2> 391616 T1944 oascc.ConnectionManager.process Watcher
> org.apache.solr.common.cloud.ConnectionManager@711d62
> name:ZooKeeperConnection Watcher:127.0.0.1:37318/solr got event
> WatchedEvent state:SyncConnected type:None path:null path:null type:None
>    [junit4]   2> 391617 T1920 oascc.ConnectionManager.waitForConnected
> Client is connected to ZooKeeper
>    [junit4]   2> 391618 T1920 oascc.SolrZkClient.makePath makePath:
> /overseer/queue
>    [junit4]   2> 391621 T1920 oascc.SolrZkClient.makePath makePath:
> /overseer/collection-queue-work
>    [junit4]   2> 391625 T1920 oascc.SolrZkClient.makePath makePath:
> /overseer/collection-map-running
>    [junit4]   2> 391626 T1920 oascc.SolrZkClient.makePath makePath:
> /overseer/collection-map-completed
>    [junit4]   2> 391628 T1920 oascc.SolrZkClient.makePath makePath:
> /overseer/collection-map-failure
>    [junit4]   2> 391633 T1920 oascc.SolrZkClient.makePath makePath:
> /live_nodes
>    [junit4]   2> 391635 T1920 oasc.ZkController.createEphemeralLiveNode
> Register node as live in ZooKeeper:/live_nodes/127.0.0.1:46199_hvft%2Fpc
>    [junit4]   2> 391637 T1920 oascc.SolrZkClient.makePath makePath:
> /live_nodes/127.0.0.1:46199_hvft%2Fpc
>    [junit4]   2> 391640 T1920 oascc.SolrZkClient.makePath makePath:
> /overseer_elect
>    [junit4]   2> 391641 T1920 oascc.SolrZkClient.makePath makePath:
> /overseer_elect/election
>    [junit4]   2> 391646 T1920
> oasc.OverseerElectionContext.runLeaderProcess I am going to be the leader
> 127.0.0.1:46199_hvft%2Fpc
>    [junit4]   2> 391647 T1920 oascc.SolrZkClient.makePath makePath:
> /overseer_elect/leader
>    [junit4]   2> 391648 T1920 oasc.Overseer.start Overseer
> (id=92091368848097284-127.0.0.1:46199_hvft%2Fpc-n_0000000000) starting
>    [junit4]   2> 391650 T1920 oascc.SolrZkClient.makePath makePath:
> /overseer/queue-work
>    [junit4]   2> 391656 T1946 oasc.OverseerCollectionProcessor.run Process
> current queue of collection creations
>    [junit4]   2> 391656 T1920 oascc.SolrZkClient.makePath makePath:
> /clusterstate.json
>    [junit4]   2> 391659 T1920 oascc.SolrZkClient.makePath makePath:
> /aliases.json
>    [junit4]   2> 391660 T1920
> oascc.ZkStateReader.createClusterStateWatchersAndUpdate Updating cluster
> state from ZooKeeper...
>    [junit4]   2> 391662 T1945 oasc.Overseer$ClusterStateUpdater.run
> Starting to work on the main queue
>    [junit4]   2> 391666 T1947 oasc.ZkController.publish publishing
> core=collection1 state=down collection=control_collection
>    [junit4]   2> 391666 T1947 oasc.ZkController.publish numShards not
> found on descriptor - reading it from system property
>    [junit4]   2> 391667 T1944
> oasc.DistributedQueue$LatchChildWatcher.process LatchChildWatcher fired on
> path: /overseer/queue state: SyncConnected type NodeChildrenChanged
>    [junit4]   2> 391667 T1947 oasc.ZkController.waitForCoreNodeName look
> for our core node name
>    [junit4]   2> 391672 T1945 oascc.ZkStateReader.updateClusterState
> Updating cloud state from ZooKeeper...
>    [junit4]   2> 391673 T1945
> oasc.Overseer$ClusterStateUpdater.updateState Update state numShards=1
> message={
>    [junit4]   2>          "operation":"state",
>    [junit4]   2>          "state":"down",
>    [junit4]   2>          "base_url":"https://127.0.0.1:46199/hvft/pc",
>    [junit4]   2>          "core":"collection1",
>    [junit4]   2>          "roles":null,
>    [junit4]   2>          "node_name":"127.0.0.1:46199_hvft%2Fpc",
>    [junit4]   2>          "shard":null,
>    [junit4]   2>          "collection":"control_collection",
>    [junit4]   2>          "numShards":"1",
>    [junit4]   2>          "core_node_name":null}
>    [junit4]   2> 391673 T1945
> oasc.Overseer$ClusterStateUpdater.createCollection Create collection
> control_collection with shards [shard1]
>    [junit4]   2> 391673 T1945
> oasc.Overseer$ClusterStateUpdater.updateState Assigning new node to shard
> shard=shard1
>    [junit4]   2> 391680 T1944
> oasc.DistributedQueue$LatchChildWatcher.process LatchChildWatcher fired on
> path: /overseer/queue state: SyncConnected type NodeChildrenChanged
>    [junit4]   2> 391680 T1944 oascc.ZkStateReader$2.process A cluster
> state change: WatchedEvent state:SyncConnected type:NodeDataChanged
> path:/clusterstate.json, has occurred - updating... (live nodes size: 1)
>    [junit4]   2> 392667 T1947 oasc.ZkController.waitForShardId waiting to
> find shard id in clusterstate for collection1
>    [junit4]   2> 392667 T1947 oasc.ZkController.createCollectionZkNode
> Check for collection zkNode:control_collection
>    [junit4]   2> 392668 T1947 oasc.ZkController.createCollectionZkNode
> Collection zkNode exists
>    [junit4]   2> 392668 T1947 oascc.ZkStateReader.readConfigName Load
> collection config from:/collections/control_collection
>    [junit4]   2> 392669 T1947 oascc.ZkStateReader.readConfigName
> path=/collections/control_collection configName=conf1 specified config
> exists in ZooKeeper
>    [junit4]   2> 392669 T1947 oasc.SolrResourceLoader.<init> new
> SolrResourceLoader for directory:
> '/mnt/ssd/jenkins/workspace/Lucene-Solr-trunk-Linux/solr/build/solr-core/test/J0/./temp/solr.cloud.SyncSliceTest-AE3C63646FD894D0-001/tempDir-002/collection1/'
>    [junit4]   2> 392669 T1947 oasc.SolrResourceLoader.replaceClassLoader
> Adding
> 'file:/mnt/ssd/jenkins/workspace/Lucene-Solr-trunk-Linux/solr/build/solr-core/test/J0/temp/solr.cloud.SyncSliceTest-AE3C63646FD894D0-001/tempDir-002/collection1/lib/.svn/'
> to classloader
>    [junit4]   2> 392670 T1947 oasc.SolrResourceLoader.replaceClassLoader
> Adding
> 'file:/mnt/ssd/jenkins/workspace/Lucene-Solr-trunk-Linux/solr/build/solr-core/test/J0/temp/solr.cloud.SyncSliceTest-AE3C63646FD894D0-001/tempDir-002/collection1/lib/classes/'
> to classloader
>    [junit4]   2> 392670 T1947 oasc.SolrResourceLoader.replaceClassLoader
> Adding
> 'file:/mnt/ssd/jenkins/workspace/Lucene-Solr-trunk-Linux/solr/build/solr-core/test/J0/temp/solr.cloud.SyncSliceTest-AE3C63646FD894D0-001/tempDir-002/collection1/lib/README'
> to classloader
>    [junit4]   2> 392692 T1947 oasc.SolrConfig.<init> Using Lucene
> MatchVersion: LUCENE_5_0
>    [junit4]   2> 392705 T1947 oasc.SolrConfig.<init> Loaded SolrConfig:
> solrconfig.xml
>    [junit4]   2> 392706 T1947 oass.IndexSchema.readSchema Reading Solr
> Schema from schema.xml
>    [junit4]   2> 392718 T1947 oass.IndexSchema.readSchema [collection1]
> Schema name=test
>    [junit4]   2> 392831 T1947 oass.OpenExchangeRatesOrgProvider.init
> Initialized with rates=open-exchange-rates.json, refreshInterval=1440.
>    [junit4]   2> 392835 T1947 oass.IndexSchema.readSchema default search
> field in schema is text
>    [junit4]   2> 392836 T1947 oass.IndexSchema.readSchema unique key
> field: id
>    [junit4]   2> 392846 T1947 oass.FileExchangeRateProvider.reload
> Reloading exchange rates from file currency.xml
>    [junit4]   2> 392848 T1947 oass.FileExchangeRateProvider.reload
> Reloading exchange rates from file currency.xml
>    [junit4]   2> 392851 T1947 oass.OpenExchangeRatesOrgProvider.reload
> Reloading exchange rates from open-exchange-rates.json
>    [junit4]   2> 392852 T1947
> oass.OpenExchangeRatesOrgProvider$OpenExchangeRates.<init> WARN Unknown key
> IMPORTANT NOTE
>    [junit4]   2> 392852 T1947
> oass.OpenExchangeRatesOrgProvider$OpenExchangeRates.<init> WARN Expected
> key, got STRING
>    [junit4]   2> 392852 T1947 oass.OpenExchangeRatesOrgProvider.reload
> Reloading exchange rates from open-exchange-rates.json
>    [junit4]   2> 392853 T1947
> oass.OpenExchangeRatesOrgProvider$OpenExchangeRates.<init> WARN Unknown key
> IMPORTANT NOTE
>    [junit4]   2> 392853 T1947
> oass.OpenExchangeRatesOrgProvider$OpenExchangeRates.<init> WARN Expected
> key, got STRING
>    [junit4]   2> 392853 T1947 oasc.CoreContainer.create Creating SolrCore
> 'collection1' using configuration from collection control_collection
>    [junit4]   2> 392853 T1947 oasc.SolrCore.initDirectoryFactory
> org.apache.solr.core.MockDirectoryFactory
>    [junit4]   2> 392854 T1947 oasc.SolrCore.<init> [collection1] Opening
> new SolrCore at
> /mnt/ssd/jenkins/workspace/Lucene-Solr-trunk-Linux/solr/build/solr-core/test/J0/./temp/solr.cloud.SyncSliceTest-AE3C63646FD894D0-001/tempDir-002/collection1/,
> dataDir=/mnt/ssd/jenkins/workspace/Lucene-Solr-trunk-Linux/solr/build/solr-core/test/J0/./temp/solr.cloud.SyncSliceTest-AE3C63646FD894D0-001/tempDir-001/control/data/
>    [junit4]   2> 392854 T1947 oasc.JmxMonitoredMap.<init> JMX monitoring
> is enabled. Adding Solr mbeans to JMX Server:
> com.sun.jmx.mbeanserver.JmxMBeanServer@c3eeec
>    [junit4]   2> 392855 T1947 oasc.CachingDirectoryFactory.get return new
> directory for
> /mnt/ssd/jenkins/workspace/Lucene-Solr-trunk-Linux/solr/build/solr-core/test/J0/./temp/solr.cloud.SyncSliceTest-AE3C63646FD894D0-001/tempDir-001/control/data
>    [junit4]   2> 392855 T1947 oasc.SolrCore.getNewIndexDir New index
> directory detected: old=null
> new=/mnt/ssd/jenkins/workspace/Lucene-Solr-trunk-Linux/solr/build/solr-core/test/J0/./temp/solr.cloud.SyncSliceTest-AE3C63646FD894D0-001/tempDir-001/control/data/index/
>    [junit4]   2> 392855 T1947 oasc.SolrCore.initIndex WARN [collection1]
> Solr index directory
> '/mnt/ssd/jenkins/workspace/Lucene-Solr-trunk-Linux/solr/build/solr-core/test/J0/./temp/solr.cloud.SyncSliceTest-AE3C63646FD894D0-001/tempDir-001/control/data/index'
> doesn't exist. Creating new index...
>    [junit4]   2> 392856 T1947 oasc.CachingDirectoryFactory.get return new
> directory for
> /mnt/ssd/jenkins/workspace/Lucene-Solr-trunk-Linux/solr/build/solr-core/test/J0/./temp/solr.cloud.SyncSliceTest-AE3C63646FD894D0-001/tempDir-001/control/data/index
>    [junit4]   2> 392856 T1947 oasu.RandomMergePolicy.<init>
> RandomMergePolicy wrapping class
> org.apache.lucene.index.LogByteSizeMergePolicy: [LogByteSizeMergePolicy:
> minMergeSize=1677721, mergeFactor=38, maxMergeSize=2147483648,
> maxMergeSizeForForcedMerge=9223372036854775807,
> calibrateSizeByDeletes=true, maxMergeDocs=2147483647,
> maxCFSSegmentSizeMB=8.796093022207999E12, noCFSRatio=0.4735666359161278]
>    [junit4]   2> 392857 T1947 oasc.SolrDeletionPolicy.onCommit
> SolrDeletionPolicy.onCommit: commits: num=1
>    [junit4]   2>
>  commit{dir=MockDirectoryWrapper(RAMDirectory@c3356f
> lockFactory=org.apache.lucene.store.SingleInstanceLockFactory@15522d2
> ),segFN=segments_1,generation=1}
>    [junit4]   2> 392857 T1947 oasc.SolrDeletionPolicy.updateCommits newest
> commit generation = 1
>    [junit4]   2> 392860 T1947 oasup.UpdateRequestProcessorChain.init
> creating updateRequestProcessorChain "nodistrib"
>    [junit4]   2> 392860 T1947 oasup.UpdateRequestProcessorChain.init
> creating updateRequestProcessorChain "dedupe"
>    [junit4]   2> 392860 T1947 oasup.UpdateRequestProcessorChain.init
> inserting DistributedUpdateProcessorFactory into
> updateRequestProcessorChain "dedupe"
>    [junit4]   2> 392861 T1947 oasup.UpdateRequestProcessorChain.init
> creating updateRequestProcessorChain "stored_sig"
>    [junit4]   2> 392861 T1947 oasup.UpdateRequestProcessorChain.init
> inserting DistributedUpdateProcessorFactory into
> updateRequestProcessorChain "stored_sig"
>    [junit4]   2> 392861 T1947 oasup.UpdateRequestProcessorChain.init
> creating updateRequestProcessorChain "distrib-dup-test-chain-explicit"
>    [junit4]   2> 392862 T1947 oasup.UpdateRequestProcessorChain.init
> creating updateRequestProcessorChain "distrib-dup-test-chain-implicit"
>    [junit4]   2> 392862 T1947 oasup.UpdateRequestProcessorChain.init
> inserting DistributedUpdateProcessorFactory into
> updateRequestProcessorChain "distrib-dup-test-chain-implicit"
>    [junit4]   2> 392862 T1947 oasc.SolrCore.loadUpdateProcessorChains no
> updateRequestProcessorChain defined as default, creating implicit default
>    [junit4]   2> 392862 T1947 oasc.RequestHandlers.initHandlersFromConfig
> created standard: solr.StandardRequestHandler
>    [junit4]   2> 392863 T1947 oasc.RequestHandlers.initHandlersFromConfig
> created /get: solr.RealTimeGetHandler
>    [junit4]   2> 392863 T1947 oasc.RequestHandlers.initHandlersFromConfig
> adding lazy requestHandler: solr.ReplicationHandler
>    [junit4]   2> 392863 T1947 oasc.RequestHandlers.initHandlersFromConfig
> created /replication: solr.ReplicationHandler
>    [junit4]   2> 392864 T1947 oasc.RequestHandlers.initHandlersFromConfig
> created /update: solr.UpdateRequestHandler
>    [junit4]   2> 392864 T1947 oasc.RequestHandlers.initHandlersFromConfig
> created /admin/: org.apache.solr.handler.admin.AdminHandlers
>    [junit4]   2> 392864 T1947 oasc.RequestHandlers.initHandlersFromConfig
> created /admin/file: solr.admin.ShowFileRequestHandler
>    [junit4]   2> 392865 T1947 oasc.RequestHandlers.initHandlersFromConfig
> created /admin/fileedit: solr.admin.EditFileRequestHandler
>    [junit4]   2> 392867 T1947 oashl.XMLLoader.init
> xsltCacheLifetimeSeconds=60
>    [junit4]   2> 392869 T1947 oasu.CommitTracker.<init> Hard AutoCommit:
> disabled
>    [junit4]   2> 392869 T1947 oasu.CommitTracker.<init> Soft AutoCommit:
> disabled
>    [junit4]   2> 392870 T1947 oasu.RandomMergePolicy.<init>
> RandomMergePolicy wrapping class org.apache.lucene.index.LogDocMergePolicy:
> [LogDocMergePolicy: minMergeSize=1000, mergeFactor=31,
> maxMergeSize=9223372036854775807,
> maxMergeSizeForForcedMerge=9223372036854775807,
> calibrateSizeByDeletes=false, maxMergeDocs=2147483647,
> maxCFSSegmentSizeMB=8.796093022207999E12, noCFSRatio=0.3144584582793094]
>    [junit4]   2> 392870 T1947 oasc.SolrDeletionPolicy.onInit
> SolrDeletionPolicy.onInit: commits: num=1
>    [junit4]   2>
>  commit{dir=MockDirectoryWrapper(RAMDirectory@c3356f
> lockFactory=org.apache.lucene.store.SingleInstanceLockFactory@15522d2
> ),segFN=segments_1,generation=1}
>    [junit4]   2> 392871 T1947 oasc.SolrDeletionPolicy.updateCommits newest
> commit generation = 1
>    [junit4]   2> 392871 T1947 oass.SolrIndexSearcher.<init> Opening
> Searcher@19bbe[collection1] main
>    [junit4]   2> 392871 T1947 oascc.ZkStateReader.readConfigName Load
> collection config from:/collections/control_collection
>    [junit4]   2> 392872 T1947 oascc.ZkStateReader.readConfigName
> path=/collections/control_collection configName=conf1 specified config
> exists in ZooKeeper
>    [junit4]   2> 392872 T1947 oasr.ManagedResourceStorage.newStorageIO
> Setting up ZooKeeper-based storage for the RestManager with znodeBase:
> /configs/conf1
>    [junit4]   2> 392873 T1947
> oasr.ManagedResourceStorage$ZooKeeperStorageIO.configure Configured
> ZooKeeperStorageIO with znodeBase: /configs/conf1
>    [junit4]   2> 392873 T1947 oasr.RestManager.init Initializing
> RestManager with initArgs: {}
>    [junit4]   2> 392873 T1947 oasr.ManagedResourceStorage.load Reading
> _rest_managed.json using ZooKeeperStorageIO:path=/configs/conf1
>    [junit4]   2> 392873 T1947
> oasr.ManagedResourceStorage$ZooKeeperStorageIO.openInputStream No data
> found for znode /configs/conf1/_rest_managed.json
>    [junit4]   2> 392874 T1947 oasr.ManagedResourceStorage.load Loaded null
> at path _rest_managed.json using ZooKeeperStorageIO:path=/configs/conf1
>    [junit4]   2> 392874 T1947 oascc.SolrZkClient.makePath makePath:
> /configs/conf1/_rest_managed.json
>    [junit4]   2> 392876 T1947
> oasr.ManagedResourceStorage$ZooKeeperStorageIO$1.close Wrote 38 bytes to
> new znode /configs/conf1/_rest_managed.json
>    [junit4]   2> 392876 T1947
> oasr.ManagedResourceStorage$JsonStorage.store Saved JSON object to path
> _rest_managed.json using ZooKeeperStorageIO:path=/configs/conf1
>    [junit4]   2> 392876 T1947 oasr.RestManager.init Initializing 0
> registered ManagedResources
>    [junit4]   2> 392878 T1948 oasc.SolrCore.registerSearcher [collection1]
> Registered new searcher Searcher@19bbe[collection1]
> main{UninvertingDirectoryReader()}
>    [junit4]   2> 392879 T1947 oasc.CoreContainer.registerCore registering
> core: collection1
>    [junit4]   2> 392880 T1951 oasc.ZkController.register Register replica
> - core:collection1 address:https://127.0.0.1:46199/hvft/pc
> collection:control_collection shard:shard1
>    [junit4]   2> 392880 T1920 oass.SolrDispatchFilter.init
> user.dir=/mnt/ssd/jenkins/workspace/Lucene-Solr-trunk-Linux/solr/build/solr-core/test/J0
>    [junit4]   2> 392881 T1951 oascc.SolrZkClient.makePath makePath:
> /collections/control_collection/leader_elect/shard1/election
>    [junit4]   2> 392881 T1920 oass.SolrDispatchFilter.init
> SolrDispatchFilter.init() done
>    [junit4]   2> 392883 T1920 oascc.ConnectionManager.waitForConnected
> Waiting for client to connect to ZooKeeper
>    [junit4]   2> 392884 T1951
> oasc.ShardLeaderElectionContext.runLeaderProcess Running the leader process
> for shard shard1
>    [junit4]   2> 392884 T1953 oascc.ConnectionManager.process Watcher
> org.apache.solr.common.cloud.ConnectionManager@1f4cc72
> name:ZooKeeperConnection Watcher:127.0.0.1:37318/solr got event
> WatchedEvent state:SyncConnected type:None path:null path:null type:None
>    [junit4]   2> 392884 T1920 oascc.ConnectionManager.waitForConnected
> Client is connected to ZooKeeper
>    [junit4]   2> 392885 T1951
> oasc.ShardLeaderElectionContext.waitForReplicasToComeUp Enough replicas
> found to continue.
>    [junit4]   2> 392885 T1944
> oasc.DistributedQueue$LatchChildWatcher.process LatchChildWatcher fired on
> path: /overseer/queue state: SyncConnected type NodeChildrenChanged
>    [junit4]   2> 392885 T1951
> oasc.ShardLeaderElectionContext.runLeaderProcess I may be the new leader -
> try and sync
>    [junit4]   2> 392885 T1920
> oascc.ZkStateReader.createClusterStateWatchersAndUpdate Updating cluster
> state from ZooKeeper...
>    [junit4]   2> ASYNC  NEW_CORE C558 name=collection1
> org.apache.solr.core.SolrCore@1351b3e url=
> https://127.0.0.1:46199/hvft/pc/collection1 node=127.0.0.1:46199_hvft%2Fpc
> C558_STATE=coll:control_collection core:collection1 props:{state=down,
> base_url=https://127.0.0.1:46199/hvft/pc, core=collection1,
> node_name=127.0.0.1:46199_hvft%2Fpc}
>    [junit4]   2> 392885 T1951 C558 P46199 oasc.SyncStrategy.sync Sync
> replicas to https://127.0.0.1:46199/hvft/pc/collection1/
>    [junit4]   2> 392886 T1945 oascc.ZkStateReader.updateClusterState
> Updating cloud state from ZooKeeper...
>    [junit4]   2> 392886 T1951 C558 P46199 oasc.SyncStrategy.syncReplicas
> Sync Success - now sync replicas to me
>    [junit4]   2> 392886 T1951 C558 P46199 oasc.SyncStrategy.syncToMe
> https://127.0.0.1:46199/hvft/pc/collection1/ has no replicas
>    [junit4]   2> 392886 T1951
> oasc.ShardLeaderElectionContext.runLeaderProcess I am the new leader:
> https://127.0.0.1:46199/hvft/pc/collection1/ shard1
>    [junit4]   2> 392887 T1951 oascc.SolrZkClient.makePath makePath:
> /collections/control_collection/leaders/shard1
>    [junit4]   2> 392887 T1920 oasc.ChaosMonkey.monkeyLog monkey: init -
> expire sessions:false cause connection loss:false
>    [junit4]   2> 392887 T1944
> oasc.DistributedQueue$LatchChildWatcher.process LatchChildWatcher fired on
> path: /overseer/queue state: SyncConnected type NodeChildrenChanged
>    [junit4]   2> 392889 T1944
> oasc.DistributedQueue$LatchChildWatcher.process LatchChildWatcher fired on
> path: /overseer/queue state: SyncConnected type NodeChildrenChanged
>    [junit4]   2> 392890 T1944
> oasc.DistributedQueue$LatchChildWatcher.process LatchChildWatcher fired on
> path: /overseer/queue state: SyncConnected type NodeChildrenChanged
>    [junit4]   2> 392992 T1944 oascc.ZkStateReader$2.process A cluster
> state change: WatchedEvent state:SyncConnected type:NodeDataChanged
> path:/clusterstate.json, has occurred - updating... (live nodes size: 1)
>    [junit4]   2> 392992 T1953 oascc.ZkStateReader$2.process A cluster
> state change: WatchedEvent state:SyncConnected type:NodeDataChanged
> path:/clusterstate.json, has occurred - updating... (live nodes size: 1)
>    [junit4]   2> 393039 T1951 oasc.ZkController.register We are
> https://127.0.0.1:46199/hvft/pc/collection1/ and leader is
> https://127.0.0.1:46199/hvft/pc/collection1/
>    [junit4]   2> 393040 T1951 oasc.ZkController.register No LogReplay
> needed for core=collection1 baseURL=https://127.0.0.1:46199/hvft/pc
>    [junit4]   2> 393040 T1951 oasc.ZkController.checkRecovery I am the
> leader, no recovery necessary
>    [junit4]   2> 393040 T1951 oasc.ZkController.publish publishing
> core=collection1 state=active collection=control_collection
>    [junit4]   2> 393040 T1951 oasc.ZkController.publish numShards not
> found on descriptor - reading it from system property
>    [junit4]   2> 393041 T1944
> oasc.DistributedQueue$LatchChildWatcher.process LatchChildWatcher fired on
> path: /overseer/queue state: SyncConnected type NodeChildrenChanged
>    [junit4]   2> 393041 T1944
> oasc.DistributedQueue$LatchChildWatcher.process LatchChildWatcher fired on
> path: /overseer/queue state: SyncConnected type NodeChildrenChanged
>    [junit4]   2> 393042 T1944
> oasc.DistributedQueue$LatchChildWatcher.process LatchChildWatcher fired on
> path: /overseer/queue state: SyncConnected type NodeChildrenChanged
>    [junit4]   2> 393042 T1951 oascc.ZkStateReader.updateClusterState
> Updating cloud state from ZooKeeper...
>    [junit4]   2> 393042 T1945 oascc.ZkStateReader.updateClusterState
> Updating cloud state from ZooKeeper...
>    [junit4]   2> 393043 T1945
> oasc.Overseer$ClusterStateUpdater.updateState Update state numShards=1
> message={
>    [junit4]   2>          "operation":"state",
>    [junit4]   2>          "state":"active",
>    [junit4]   2>          "base_url":"https://127.0.0.1:46199/hvft/pc",
>    [junit4]   2>          "core":"collection1",
>    [junit4]   2>          "roles":null,
>    [junit4]   2>          "node_name":"127.0.0.1:46199_hvft%2Fpc",
>    [junit4]   2>          "shard":"shard1",
>    [junit4]   2>          "collection":"control_collection",
>    [junit4]   2>          "numShards":"1",
>    [junit4]   2>          "core_node_name":"core_node1"}
>    [junit4]   2> 393044 T1944
> oasc.DistributedQueue$LatchChildWatcher.process LatchChildWatcher fired on
> path: /overseer/queue state: SyncConnected type NodeChildrenChanged
>    [junit4]   2> 393125 T1920
> oasc.AbstractFullDistribZkTestBase.createJettys create jetty 1
>    [junit4]   2> 393125 T1920 oejs.Server.doStart jetty-8.1.10.v20130312
>    [junit4]   2> 393141 T1920 oejus.SslContextFactory.doStart Enabled
> Protocols [SSLv2Hello, SSLv3, TLSv1, TLSv1.1, TLSv1.2] of [SSLv2Hello,
> SSLv3, TLSv1, TLSv1.1, TLSv1.2]
>    [junit4]   2> 393142 T1920 oejs.AbstractConnector.doStart Started
> SslSelectChannelConnector@127.0.0.1:59679
>    [junit4]   2> 393144 T1920 oass.SolrDispatchFilter.init
> SolrDispatchFilter.init()
>    [junit4]   2> 393144 T1920 oasc.SolrResourceLoader.locateSolrHome JNDI
> not configured for solr (NoInitialContextEx)
>    [junit4]   2> 393145 T1944 oascc.ZkStateReader$2.process A cluster
> state change: WatchedEvent state:SyncConnected type:NodeDataChanged
> path:/clusterstate.json, has occurred - updating... (live nodes size: 1)
>    [junit4]   2> 393145 T1953 oascc.ZkStateReader$2.process A cluster
> state change: WatchedEvent state:SyncConnected type:NodeDataChanged
> path:/clusterstate.json, has occurred - updating... (live nodes size: 1)
>    [junit4]   2> 393145 T1920 oasc.SolrResourceLoader.locateSolrHome using
> system property solr.solr.home:
> /mnt/ssd/jenkins/workspace/Lucene-Solr-trunk-Linux/solr/build/solr-core/test/J0/./temp/solr.cloud.SyncSliceTest-AE3C63646FD894D0-001/tempDir-003
>    [junit4]   2> 393147 T1920 oasc.SolrResourceLoader.<init> new
> SolrResourceLoader for directory:
> '/mnt/ssd/jenkins/workspace/Lucene-Solr-trunk-Linux/solr/build/solr-core/test/J0/./temp/solr.cloud.SyncSliceTest-AE3C63646FD894D0-001/tempDir-003/'
>    [junit4]   2> 393164 T1920 oasc.ConfigSolr.fromFile Loading container
> configuration from
> /mnt/ssd/jenkins/workspace/Lucene-Solr-trunk-Linux/solr/build/solr-core/test/J0/./temp/solr.cloud.SyncSliceTest-AE3C63646FD894D0-001/tempDir-003/solr.xml
>    [junit4]   2> 393173 T1920 oasc.CoreContainer.<init> New CoreContainer
> 5440565
>    [junit4]   2> 393174 T1920 oasc.CoreContainer.load Loading cores into
> CoreContainer
> [instanceDir=/mnt/ssd/jenkins/workspace/Lucene-Solr-trunk-Linux/solr/build/solr-core/test/J0/./temp/solr.cloud.SyncSliceTest-AE3C63646FD894D0-001/tempDir-003/]
>    [junit4]   2> 393175 T1920 oashc.HttpShardHandlerFactory.getParameter
> Setting socketTimeout to: 90000
>    [junit4]   2> 393175 T1920 oashc.HttpShardHandlerFactory.getParameter
> Setting urlScheme to:
>    [junit4]   2> 393175 T1920 oashc.HttpShardHandlerFactory.getParameter
> Setting connTimeout to: 15000
>    [junit4]   2> 393176 T1920 oashc.HttpShardHandlerFactory.getParameter
> Setting maxConnectionsPerHost to: 20
>    [junit4]   2> 393176 T1920 oashc.HttpShardHandlerFactory.getParameter
> Setting corePoolSize to: 0
>    [junit4]   2> 393177 T1920 oashc.HttpShardHandlerFactory.getParameter
> Setting maximumPoolSize to: 2147483647
>    [junit4]   2> 393177 T1920 oashc.HttpShardHandlerFactory.getParameter
> Setting maxThreadIdleTime to: 5
>    [junit4]   2> 393177 T1920 oashc.HttpShardHandlerFactory.getParameter
> Setting sizeOfQueue to: -1
>    [junit4]   2> 393178 T1920 oashc.HttpShardHandlerFactory.getParameter
> Setting fairnessPolicy to: false
>    [junit4]   2> 393180 T1920 oasl.LogWatcher.createWatcher SLF4J impl is
> org.slf4j.impl.Log4jLoggerFactory
>    [junit4]   2> 393181 T1920 oasl.LogWatcher.newRegisteredLogWatcher
> Registering Log Listener [Log4j (org.slf4j.impl.Log4jLoggerFactory)]
>    [junit4]   2> 393181 T1920 oasc.CoreContainer.load Host Name: 127.0.0.1
>    [junit4]   2> 393181 T1920 oasc.ZkContainer.initZooKeeper Zookeeper
> client=127.0.0.1:37318/solr
>    [junit4]   2> 393182 T1920 oasc.ZkController.checkChrootPath zkHost
> includes chroot
>    [junit4]   2> 393183 T1920 oascc.ConnectionManager.waitForConnected
> Waiting for client to connect to ZooKeeper
>    [junit4]   2> 393184 T1964 oascc.ConnectionManager.process Watcher
> org.apache.solr.common.cloud.ConnectionManager@10b2253
> name:ZooKeeperConnection Watcher:127.0.0.1:37318 got event WatchedEvent
> state:SyncConnected type:None path:null path:null type:None
>    [junit4]   2> 393184 T1920 oascc.ConnectionManager.waitForConnected
> Client is connected to ZooKeeper
>    [junit4]   2> 393186 T1920 oascc.ConnectionManager.waitForConnected
> Waiting for client to connect to ZooKeeper
>    [junit4]   2> 393187 T1966 oascc.ConnectionManager.process Watcher
> org.apache.solr.common.cloud.ConnectionManager@1260e
> name:ZooKeeperConnection Watcher:127.0.0.1:37318/solr got event
> WatchedEvent state:SyncConnected type:None path:null path:null type:None
>    [junit4]   2> 393187 T1920 oascc.ConnectionManager.waitForConnected
> Client is connected to ZooKeeper
>    [junit4]   2> 393190 T1920
> oascc.ZkStateReader.createClusterStateWatchersAndUpdate Updating cluster
> state from ZooKeeper...
>    [junit4]   2> 394192 T1920 oasc.ZkController.createEphemeralLiveNode
> Register node as live in ZooKeeper:/live_nodes/127.0.0.1:59679_hvft%2Fpc
>    [junit4]   2> 394193 T1920 oascc.SolrZkClient.makePath makePath:
> /live_nodes/127.0.0.1:59679_hvft%2Fpc
>    [junit4]   2> 394198 T1967 oasc.ZkController.publish publishing
> core=collection1 state=down collection=collection1
>    [junit4]   2> 394198 T1967 oasc.ZkController.publish numShards not
> found on descriptor - reading it from system property
>    [junit4]   2> 394199 T1944
> oasc.DistributedQueue$LatchChildWatcher.process LatchChildWatcher fired on
> path: /overseer/queue state: SyncConnected type NodeChildrenChanged
>    [junit4]   2> 394199 T1967 oasc.ZkController.waitForCoreNodeName look
> for our core node name
>    [junit4]   2> 394199 T1944
> oasc.DistributedQueue$LatchChildWatcher.process LatchChildWatcher fired on
> path: /overseer/queue state: SyncConnected type NodeChildrenChanged
>    [junit4]   2> 394199 T1944
> oasc.DistributedQueue$LatchChildWatcher.process LatchChildWatcher fired on
> path: /overseer/queue state: SyncConnected type NodeChildrenChanged
>    [junit4]   2> 394199 T1945 oascc.ZkStateReader.updateClusterState
> Updating cloud state from ZooKeeper...
>    [junit4]   2> 394200 T1945
> oasc.Overseer$ClusterStateUpdater.updateState Update state numShards=1
> message={
>    [junit4]   2>          "operation":"state",
>    [junit4]   2>          "state":"down",
>    [junit4]   2>          "base_url":"https://127.0.0.1:59679/hvft/pc",
>    [junit4]   2>          "core":"collection1",
>    [junit4]   2>          "roles":null,
>    [junit4]   2>          "node_name":"127.0.0.1:59679_hvft%2Fpc",
>    [junit4]   2>          "shard":null,
>    [junit4]   2>          "collection":"collection1",
>    [junit4]   2>          "numShards":"1",
>    [junit4]   2>          "core_node_name":null}
>    [junit4]   2> 394200 T1945
> oasc.Overseer$ClusterStateUpdater.createCollection Create collection
> collection1 with shards [shard1]
>    [junit4]   2> 394200 T1945
> oasc.Overseer$ClusterStateUpdater.updateState Assigning new node to shard
> shard=shard1
>    [junit4]   2> 394202 T1944
> oasc.DistributedQueue$LatchChildWatcher.process LatchChildWatcher fired on
> path: /overseer/queue state: SyncConnected type NodeChildrenChanged
>    [junit4]   2> 394303 T1944 oascc.ZkStateReader$2.process A cluster
> state change: WatchedEvent state:SyncConnected type:NodeDataChanged
> path:/clusterstate.json, has occurred - updating... (live nodes size: 2)
>    [junit4]   2> 394303 T1953 oascc.ZkStateReader$2.process A cluster
> state change: WatchedEvent state:SyncConnected type:NodeDataChanged
> path:/clusterstate.json, has occurred - updating... (live nodes size: 2)
>    [junit4]   2> 394303 T1966 oascc.ZkStateReader$2.process A cluster
> state change: WatchedEvent state:SyncConnected type:NodeDataChanged
> path:/clusterstate.json, has occurred - updating... (live nodes size: 2)
>    [junit4]   2> 395199 T1967 oasc.ZkController.waitForShardId waiting to
> find shard id in clusterstate for collection1
>    [junit4]   2> 395199 T1967 oasc.ZkController.createCollectionZkNode
> Check for collection zkNode:collection1
>    [junit4]   2> 395200 T1967 oasc.ZkController.createCollectionZkNode
> Collection zkNode exists
>    [junit4]   2> 395200 T1967 oascc.ZkStateReader.readConfigName Load
> collection config from:/collections/collection1
>    [junit4]   2> 395201 T1967 oascc.ZkStateReader.readConfigName
> path=/collections/collection1 configName=conf1 specified config exists in
> ZooKeeper
>    [junit4]   2> 395201 T1967 oasc.SolrResourceLoader.<init> new
> SolrResourceLoader for directory:
> '/mnt/ssd/jenkins/workspace/Lucene-Solr-trunk-Linux/solr/build/solr-core/test/J0/./temp/solr.cloud.SyncSliceTest-AE3C63646FD894D0-001/tempDir-003/collection1/'
>    [junit4]   2> 395201 T1967 oasc.SolrResourceLoader.replaceClassLoader
> Adding
> 'file:/mnt/ssd/jenkins/workspace/Lucene-Solr-trunk-Linux/solr/build/solr-core/test/J0/temp/solr.cloud.SyncSliceTest-AE3C63646FD894D0-001/tempDir-003/collection1/lib/.svn/'
> to classloader
>    [junit4]   2> 395201 T1967 oasc.SolrResourceLoader.replaceClassLoader
> Adding
> 'file:/mnt/ssd/jenkins/workspace/Lucene-Solr-trunk-Linux/solr/build/solr-core/test/J0/temp/solr.cloud.SyncSliceTest-AE3C63646FD894D0-001/tempDir-003/collection1/lib/classes/'
> to classloader
>    [junit4]   2> 395202 T1967 oasc.SolrResourceLoader.replaceClassLoader
> Adding
> 'file:/mnt/ssd/jenkins/workspace/Lucene-Solr-trunk-Linux/solr/build/solr-core/test/J0/temp/solr.cloud.SyncSliceTest-AE3C63646FD894D0-001/tempDir-003/collection1/lib/README'
> to classloader
>    [junit4]   2> 395224 T1967 oasc.SolrConfig.<init> Using Lucene
> MatchVersion: LUCENE_5_0
>    [junit4]   2> 395235 T1967 oasc.SolrConfig.<init> Loaded SolrConfig:
> solrconfig.xml
>    [junit4]   2> 395235 T1967 oass.IndexSchema.readSchema Reading Solr
> Schema from schema.xml
>    [junit4]   2> 395240 T1967 oass.IndexSchema.readSchema [collection1]
> Schema name=test
>    [junit4]   2> 395353 T1967 oass.OpenExchangeRatesOrgProvider.init
> Initialized with rates=open-exchange-rates.json, refreshInterval=1440.
>    [junit4]   2> 395358 T1967 oass.IndexSchema.readSchema default search
> field in schema is text
>    [junit4]   2> 395360 T1967 oass.IndexSchema.readSchema unique key
> field: id
>    [junit4]   2> 395368 T1967 oass.FileExchangeRateProvider.reload
> Reloading exchange rates from file currency.xml
>    [junit4]   2> 395371 T1967 oass.FileExchangeRateProvider.reload
> Reloading exchange rates from file currency.xml
>    [junit4]   2> 395374 T1967 oass.OpenExchangeRatesOrgProvider.reload
> Reloading exchange rates from open-exchange-rates.json
>    [junit4]   2> 395375 T1967
> oass.OpenExchangeRatesOrgProvider$OpenExchangeRates.<init> WARN Unknown key
> IMPORTANT NOTE
>    [junit4]   2> 395376 T1967
> oass.OpenExchangeRatesOrgProvider$OpenExchangeRates.<init> WARN Expected
> key, got STRING
>    [junit4]   2> 395376 T1967 oass.OpenExchangeRatesOrgProvider.reload
> Reloading exchange rates from open-exchange-rates.json
>    [junit4]   2> 395377 T1967
> oass.OpenExchangeRatesOrgProvider$OpenExchangeRates.<init> WARN Unknown key
> IMPORTANT NOTE
>    [junit4]   2> 395378 T1967
> oass.OpenExchangeRatesOrgProvider$OpenExchangeRates.<init> WARN Expected
> key, got STRING
>    [junit4]   2> 395378 T1967 oasc.CoreContainer.create Creating SolrCore
> 'collection1' using configuration from collection collection1
>    [junit4]   2> 395378 T1967 oasc.SolrCore.initDirectoryFactory
> org.apache.solr.core.MockDirectoryFactory
>    [junit4]   2> 395378 T1967 oasc.SolrCore.<init> [collection1] Opening
> new SolrCore at
> /mnt/ssd/jenkins/workspace/Lucene-Solr-trunk-Linux/solr/build/solr-core/test/J0/./temp/solr.cloud.SyncSliceTest-AE3C63646FD894D0-001/tempDir-003/collection1/,
> dataDir=/mnt/ssd/jenkins/workspace/Lucene-Solr-trunk-Linux/solr/build/solr-core/test/J0/./temp/solr.cloud.SyncSliceTest-AE3C63646FD894D0-001/tempDir-001/jetty1/
>    [junit4]   2> 395379 T1967 oasc.JmxMonitoredMap.<init> JMX monitoring
> is enabled. Adding Solr mbeans to JMX Server:
> com.sun.jmx.mbeanserver.JmxMBeanServer@c3eeec
>    [junit4]   2> 395379 T1967 oasc.CachingDirectoryFactory.get return new
> directory for
> /mnt/ssd/jenkins/workspace/Lucene-Solr-trunk-Linux/solr/build/solr-core/test/J0/./temp/solr.cloud.SyncSliceTest-AE3C63646FD894D0-001/tempDir-001/jetty1
>    [junit4]   2> 395379 T1967 oasc.SolrCore.getNewIndexDir New index
> directory detected: old=null
> new=/mnt/ssd/jenkins/workspace/Lucene-Solr-trunk-Linux/solr/build/solr-core/test/J0/./temp/solr.cloud.SyncSliceTest-AE3C63646FD894D0-001/tempDir-001/jetty1/index/
>    [junit4]   2> 395380 T1967 oasc.SolrCore.initIndex WARN [collection1]
> Solr index directory
> '/mnt/ssd/jenkins/workspace/Lucene-Solr-trunk-Linux/solr/build/solr-core/test/J0/./temp/solr.cloud.SyncSliceTest-AE3C63646FD894D0-001/tempDir-001/jetty1/index'
> doesn't exist. Creating new index...
>    [junit4]   2> 395380 T1967 oasc.CachingDirectoryFactory.get return new
> directory for
> /mnt/ssd/jenkins/workspace/Lucene-Solr-trunk-Linux/solr/build/solr-core/test/J0/./temp/solr.cloud.SyncSliceTest-AE3C63646FD894D0-001/tempDir-001/jetty1/index
>    [junit4]   2> 395380 T1967 oasu.RandomMergePolicy.<init>
> RandomMergePolicy wrapping class
> org.apache.lucene.index.LogByteSizeMergePolicy: [LogByteSizeMergePolicy:
> minMergeSize=1677721, mergeFactor=38, maxMergeSize=2147483648,
> maxMergeSizeForForcedMerge=9223372036854775807,
> calibrateSizeByDeletes=true, maxMergeDocs=2147483647,
> maxCFSSegmentSizeMB=8.796093022207999E12, noCFSRatio=0.4735666359161278]
>    [junit4]   2> 395381 T1967 oasc.SolrDeletionPolicy.onCommit
> SolrDeletionPolicy.onCommit: commits: num=1
>    [junit4]   2>
>  commit{dir=MockDirectoryWrapper(RAMDirectory@c35d77
> lockFactory=org.apache.lucene.store.SingleInstanceLockFactory@1a0d25c
> ),segFN=segments_1,generation=1}
>    [junit4]   2> 395381 T1967 oasc.SolrDeletionPolicy.updateCommits newest
> commit generation = 1
>    [junit4]   2> 395385 T1967 oasup.UpdateRequestProcessorChain.init
> creating updateRequestProcessorChain "nodistrib"
>    [junit4]   2> 395385 T1967 oasup.UpdateRequestProcessorChain.init
> creating updateRequestProcessorChain "dedupe"
>    [junit4]   2> 395385 T1967 oasup.UpdateRequestProcessorChain.init
> inserting DistributedUpdateProcessorFactory into
> updateRequestProcessorChain "dedupe"
>    [junit4]   2> 395385 T1967 oasup.UpdateRequestProcessorChain.init
> creating updateRequestProcessorChain "stored_sig"
>    [junit4]   2> 395386 T1967 oasup.UpdateRequestProcessorChain.init
> inserting DistributedUpdateProcessorFactory into
> updateRequestProcessorChain "stored_sig"
>    [junit4]   2> 395386 T1967 oasup.UpdateRequestProcessorChain.init
> creating updateRequestProcessorChain "distrib-dup-test-chain-explicit"
>    [junit4]   2> 395386 T1967 oasup.UpdateRequestProcessorChain.init
> creating updateRequestProcessorChain "distrib-dup-test-chain-implicit"
>    [junit4]   2> 395387 T1967 oasup.UpdateRequestProcessorChain.init
> inserting DistributedUpdateProcessorFactory into
> updateRequestProcessorChain "distrib-dup-test-chain-implicit"
>    [junit4]   2> 395387 T1967 oasc.SolrCore.loadUpdateProcessorChains no
> updateRequestProcessorChain defined as default, creating implicit default
>    [junit4]   2> 395387 T1967 oasc.RequestHandlers.initHandlersFromConfig
> created standard: solr.StandardRequestHandler
>    [junit4]   2> 395388 T1967 oasc.RequestHandlers.initHandlersFromConfig
> created /get: solr.RealTimeGetHandler
>    [junit4]   2> 395388 T1967 oasc.RequestHandlers.initHandlersFromConfig
> adding lazy requestHandler: solr.ReplicationHandler
>    [junit4]   2> 395388 T1967 oasc.RequestHandlers.initHandlersFromConfig
> created /replication: solr.ReplicationHandler
>    [junit4]   2> 395389 T1967 oasc.RequestHandlers.initHandlersFromConfig
> created /update: solr.UpdateRequestHandler
>    [junit4]   2> 395389 T1967 oasc.RequestHandlers.initHandlersFromConfig
> created /admin/: org.apache.solr.handler.admin.AdminHandlers
>    [junit4]   2> 395389 T1967 oasc.RequestHandlers.initHandlersFromConfig
> created /admin/file: solr.admin.ShowFileRequestHandler
>    [junit4]   2> 395390 T1967 oasc.RequestHandlers.initHandlersFromConfig
> created /admin/fileedit: solr.admin.EditFileRequestHandler
>    [junit4]   2> 395392 T1967 oashl.XMLLoader.init
> xsltCacheLifetimeSeconds=60
>    [junit4]   2> 395394 T1967 oasu.CommitTracker.<init> Hard AutoCommit:
> disabled
>    [junit4]   2> 395394 T1967 oasu.CommitTracker.<init> Soft AutoCommit:
> disabled
>    [junit4]   2> 395395 T1967 oasu.RandomMergePolicy.<init>
> RandomMergePolicy wrapping class org.apache.lucene.index.LogDocMergePolicy:
> [LogDocMergePolicy: minMergeSize=1000, mergeFactor=31,
> maxMergeSize=9223372036854775807,
> maxMergeSizeForForcedMerge=9223372036854775807,
> calibrateSizeByDeletes=false, maxMergeDocs=2147483647,
> maxCFSSegmentSizeMB=8.796093022207999E12, noCFSRatio=0.3144584582793094]
>    [junit4]   2> 395395 T1967 oasc.SolrDeletionPolicy.onInit
> SolrDeletionPolicy.onInit: commits: num=1
>    [junit4]   2>
>  commit{dir=MockDirectoryWrapper(RAMDirectory@c35d77
> lockFactory=org.apache.lucene.store.SingleInstanceLockFactory@1a0d25c
> ),segFN=segments_1,generation=1}
>    [junit4]   2> 395396 T1967 oasc.SolrDeletionPolicy.updateCommits newest
> commit generation = 1
>    [junit4]   2> 395396 T1967 oass.SolrIndexSearcher.<init> Opening
> Searcher@6e9cd9[collection1] main
>    [junit4]   2> 395396 T1967 oascc.ZkStateReader.readConfigName Load
> collection config from:/collections/collection1
>    [junit4]   2> 395399 T1967 oascc.ZkStateReader.readConfigName
> path=/collections/collection1 configName=conf1 specified config exists in
> ZooKeeper
>    [junit4]   2> 395399 T1967 oasr.ManagedResourceStorage.newStorageIO
> Setting up ZooKeeper-based storage for the RestManager with znodeBase:
> /configs/conf1
>    [junit4]   2> 395400 T1967
> oasr.ManagedResourceStorage$ZooKeeperStorageIO.configure Configured
> ZooKeeperStorageIO with znodeBase: /configs/conf1
>    [junit4]   2> 395400 T1967 oasr.RestManager.init Initializing
> RestManager with initArgs: {}
>    [junit4]   2> 395400 T1967 oasr.ManagedResourceStorage.load Reading
> _rest_managed.json using ZooKeeperStorageIO:path=/configs/conf1
>    [junit4]   2> 395401 T1967
> oasr.ManagedResourceStorage$ZooKeeperStorageIO.openInputStream Read 38
> bytes from znode /configs/conf1/_rest_managed.json
>    [junit4]   2> 395401 T1967 oasr.ManagedResourceStorage.load Loaded
> LinkedHashMap at path _rest_managed.json using
> ZooKeeperStorageIO:path=/configs/conf1
>    [junit4]   2> 395402 T1967 oasr.ManagedResource.reloadFromStorage
> Loaded initArgs {} for /rest/managed
>    [junit4]   2> 395402 T1967 oasr.RestManager.init Initializing 0
> registered ManagedResources
>    [junit4]   2> 395404 T1968 oasc.SolrCore.registerSearcher [collection1]
> Registered new searcher Searcher@6e9cd9[collection1]
> main{UninvertingDirectoryReader()}
>    [junit4]   2> 395406 T1967 oasc.CoreContainer.registerCore registering
> core: collection1
>    [junit4]   2> 395407 T1971 oasc.ZkController.register Register replica
> - core:collection1 address:https://127.0.0.1:59679/hvft/pc
> collection:collection1 shard:shard1
>    [junit4]   2> 395407 T1920 oass.SolrDispatchFilter.init
> user.dir=/mnt/ssd/jenkins/workspace/Lucene-Solr-trunk-Linux/solr/build/solr-core/test/J0
>    [junit4]   2> 395408 T1971 oascc.SolrZkClient.makePath makePath:
> /collections/collection1/leader_elect/shard1/election
>    [junit4]   2> 395408 T1920 oass.SolrDispatchFilter.init
> SolrDispatchFilter.init() done
>    [junit4]   2> 395417 T1971
> oasc.ShardLeaderElectionContext.runLeaderProcess Running the leader process
> for shard shard1
>    [junit4]   2> 395419 T1944
> oasc.DistributedQueue$LatchChildWatcher.process LatchChildWatcher fired on
> path: /overseer/queue state: SyncConnected type NodeChildrenChanged
>    [junit4]   2> 395419 T1944
> oasc.DistributedQueue$LatchChildWatcher.process LatchChildWatcher fired on
> path: /overseer/queue state: SyncConnected type NodeChildrenChanged
>    [junit4]   2> 395419 T1971
> oasc.ShardLeaderElectionContext.waitForReplicasToComeUp Enough replicas
> found to continue.
>    [junit4]   2> 395419 T1971
> oasc.ShardLeaderElectionContext.runLeaderProcess I may be the new leader -
> try and sync
>    [junit4]   2> 395419 T1944
> oasc.DistributedQueue$LatchChildWatcher.process LatchChildWatcher fired on
> path: /overseer/queue state: SyncConnected type NodeChildrenChanged
>    [junit4]   2> ASYNC  NEW_CORE C559 name=collection1
> org.apache.solr.core.SolrCore@1fb5a08 url=
> https://127.0.0.1:59679/hvft/pc/collection1 node=127.0.0.1:59679_hvft%2Fpc
> C559_STATE=coll:collection1 core:collection1 props:{state=down, base_url=
> https://127.0.0.1:59679/hvft/pc, core=collection1,
> node_name=127.0.0.1:59679_hvft%2Fpc}
>    [junit4]   2> 395419 T1971 C559 P59679 oasc.SyncStrategy.sync Sync
> replicas to https://127.0.0.1:59679/hvft/pc/collection1/
>    [junit4]   2> 395420 T1971 C559 P59679 oasc.SyncStrategy.syncReplicas
> Sync Success - now sync replicas to me
>    [junit4]   2> 395420 T1971 C559 P59679 oasc.SyncStrategy.syncToMe
> https://127.0.0.1:59679/hvft/pc/collection1/ has no replicas
>    [junit4]   2> 395420 T1971
> oasc.ShardLeaderElectionContext.runLeaderProcess I am the new leader:
> https://127.0.0.1:59679/hvft/pc/collection1/ shard1
>    [junit4]   2> 395420 T1971 oascc.SolrZkClient.makePath makePath:
> /collections/collection1/leaders/shard1
>    [junit4]   2> 395426 T1945 oascc.ZkStateReader.updateClusterState
> Updating cloud state from ZooKeeper...
>    [junit4]   2> 395428 T1944
> oasc.DistributedQueue$LatchChildWatcher.process LatchChildWatcher fired on
> path: /overseer/queue state: SyncConnected type NodeChildrenChanged
>    [junit4]   2> 395429 T1944
> oasc.DistributedQueue$LatchChildWatcher.process LatchChildWatcher fired on
> path: /overseer/queue state: SyncConnected type NodeChildrenChanged
>    [junit4]   2> 395432 T1944
> oasc.DistributedQueue$LatchChildWatcher.process LatchChildWatcher fired on
> path: /overseer/queue state: SyncConnected type NodeChildrenChanged
>    [junit4]   2> 395533 T1966 oascc.ZkStateReader$2.process A cluster
> state change: WatchedEvent state:SyncConnected type:NodeDataChanged
> path:/clusterstate.json, has occurred - updating... (live nodes size: 2)
>    [junit4]   2> 395533 T1944 oascc.ZkStateReader$2.process A cluster
> state change: WatchedEvent state:SyncConnected type:NodeDataChanged
> path:/clusterstate.json, has occurred - updating... (live nodes size: 2)
>    [junit4]   2> 395533 T1953 oascc.ZkStateReader$2.process A cluster
> state change: WatchedEvent state:SyncConnected type:NodeDataChanged
> path:/clusterstate.json, has occurred - updating... (live nodes size: 2)
>    [junit4]   2> 395580 T1971 oasc.ZkController.register We are
> https://127.0.0.1:59679/hvft/pc/collection1/ and leader is
> https://127.0.0.1:59679/hvft/pc/collection1/
>    [junit4]   2> 395581 T1971 oasc.ZkController.register No LogReplay
> needed for core=collection1 baseURL=https://127.0.0.1:59679/hvft/pc
>    [junit4]   2> 395581 T1971 oasc.ZkController.checkRecovery I am the
> leader, no recovery necessary
>    [junit4]   2> 395581 T1971 oasc.ZkController.publish publishing
> core=collection1 state=active collection=collection1
>    [junit4]   2> 395581 T1971 oasc.ZkController.publish numShards not
> found on descriptor - reading it from system property
>    [junit4]   2> 395582 T1944
> oasc.DistributedQueue$LatchChildWatcher.process LatchChildWatcher fired on
> path: /overseer/queue state: SyncConnected type NodeChildrenChanged
>    [junit4]   2> 395582 T1944
> oasc.DistributedQueue$LatchChildWatcher.process LatchChildWatcher fired on
> path: /overseer/queue state: SyncConnected type NodeChildrenChanged
>    [junit4]   2> 395582 T1944
> oasc.DistributedQueue$LatchChildWatcher.process LatchChildWatcher fired on
> path: /overseer/queue state: SyncConnected type NodeChildrenChanged
>    [junit4]   2> 395583 T1971 oascc.ZkStateReader.updateClusterState
> Updating cloud state from ZooKeeper...
>    [junit4]   2> 395583 T1945 oascc.ZkStateReader.updateClusterState
> Updating cloud state from ZooKeeper...
>    [junit4]   2> 395583 T1945
> oasc.Overseer$ClusterStateUpdater.updateState Update state numShards=1
> message={
>    [junit4]   2>          "operation":"state",
>    [junit4]   2>          "state":"active",
>    [junit4]   2>          "base_url":"https://127.0.0.1:59679/hvft/pc",
>    [junit4]   2>          "core":"collection1",
>    [junit4]   2>          "roles":null,
>    [junit4]   2>          "node_name":"127.0.0.1:59679_hvft%2Fpc",
>    [junit4]   2>          "shard":"shard1",
>    [junit4]   2>          "collection":"collection1",
>    [junit4]   2>          "numShards":"1",
>    [junit4]   2>          "core_node_name":"core_node1"}
>    [junit4]   2> 395585 T1944
> oasc.DistributedQueue$LatchChildWatcher.process LatchChildWatcher fired on
> path: /overseer/queue state: SyncConnected type NodeChildrenChanged
>    [junit4]   2> 395686 T1966 oascc.ZkStateReader$2.process A cluster
> state change: WatchedEvent state:SyncConnected type:NodeDataChanged
> path:/clusterstate.json, has occurred - updating... (live nodes size: 2)
>    [junit4]   2> 395686 T1944 oascc.ZkStateReader$2.process A cluster
> state change: WatchedEvent state:SyncConnected type:NodeDataChanged
> path:/clusterstate.json, has occurred - updating... (live nodes size: 2)
>    [junit4]   2> 395686 T1953 oascc.ZkStateReader$2.process A cluster
> state change: WatchedEvent state:SyncConnected type:NodeDataChanged
> path:/clusterstate.json, has occurred - updating... (live nodes size: 2)
>    [junit4]   2> 395742 T1920
> oasc.AbstractFullDistribZkTestBase.createJettys create jetty 2
>    [junit4]   2> 395742 T1920 oejs.Server.doStart jetty-8.1.10.v20130312
>    [junit4]   2> 395745 T1920 oejus.SslContextFactory.doStart Enabled
> Protocols [SSLv2Hello, SSLv3, TLSv1, TLSv1.1, TLSv1.2] of [SSLv2Hello,
> SSLv3, TLSv1, TLSv1.1, TLSv1.2]
>    [junit4]   2> 395747 T1920 oejs.AbstractConnector.doStart Started
> SslSelectChannelConnector@127.0.0.1:57711
>    [junit4]   2> 395749 T1920 oass.SolrDispatchFilter.init
> SolrDispatchFilter.init()
>    [junit4]   2> 395750 T1920 oasc.SolrResourceLoader.locateSolrHome JNDI
> not configured for solr (NoInitialContextEx)
>    [junit4]   2> 395750 T1920 oasc.SolrResourceLoader.locateSolrHome using
> system property solr.solr.home:
> /mnt/ssd/jenkins/workspace/Lucene-Solr-trunk-Linux/solr/build/solr-core/test/J0/./temp/solr.cloud.SyncSliceTest-AE3C63646FD894D0-001/tempDir-004
>    [junit4]   2> 395751 T1920 oasc.SolrResourceLoader.<init> new
> SolrResourceLoader for directory:
> '/mnt/ssd/jenkins/workspace/Lucene-Solr-trunk-Linux/solr/build/solr-core/test/J0/./temp/solr.cloud.SyncSliceTest-AE3C63646FD894D0-001/tempDir-004/'
>    [junit4]   2> 395762 T1920 oasc.ConfigSolr.fromFile Loading container
> configuration from
> /mnt/ssd/jenkins/workspace/Lucene-Solr-trunk-Linux/solr/build/solr-core/test/J0/./temp/solr.cloud.SyncSliceTest-AE3C63646FD894D0-001/tempDir-004/solr.xml
>    [junit4]   2> 395769 T1920 oasc.CoreContainer.<init> New CoreContainer
> 21700499
>    [junit4]   2> 395769 T1920 oasc.CoreContainer.load Loading cores into
> CoreContainer
> [instanceDir=/mnt/ssd/jenkins/workspace/Lucene-Solr-trunk-Linux/solr/build/solr-core/test/J0/./temp/solr.cloud.SyncSliceTest-AE3C63646FD894D0-001/tempDir-004/]
>    [junit4]   2> 395770 T1920 oashc.HttpShardHandlerFactory.getParameter
> Setting socketTimeout to: 90000
>    [junit4]   2> 395770 T1920 oashc.HttpShardHandlerFactory.getParameter
> Setting urlScheme to:
>    [junit4]   2> 395770 T1920 oashc.HttpShardHandlerFactory.getParameter
> Setting connTimeout to: 15000
>    [junit4]   2> 395771 T1920 oashc.HttpShardHandlerFactory.getParameter
> Setting maxConnectionsPerHost to: 20
>    [junit4]   2> 395771 T1920 oashc.HttpShardHandlerFactory.getParameter
> Setting corePoolSize to: 0
>    [junit4]   2> 395771 T1920 oashc.HttpShardHandlerFactory.getParameter
> Setting maximumPoolSize to: 2147483647
>    [junit4]   2> 395772 T1920 oashc.HttpShardHandlerFactory.getParameter
> Setting maxThreadIdleTime to: 5
>    [junit4]   2> 395772 T1920 oashc.HttpShardHandlerFactory.getParameter
> Setting sizeOfQueue to: -1
>    [junit4]   2> 395772 T1920 oashc.HttpShardHandlerFactory.getParameter
> Setting fairnessPolicy to: false
>    [junit4]   2> 395774 T1920 oasl.LogWatcher.createWatcher SLF4J impl is
> org.slf4j.impl.Log4jLoggerFactory
>    [junit4]   2> 395774 T1920 oasl.LogWatcher.newRegisteredLogWatcher
> Registering Log Listener [Log4j (org.slf4j.impl.Log4jLoggerFactory)]
>    [junit4]   2> 395774 T1920 oasc.CoreContainer.load Host Name: 127.0.0.1
>    [junit4]   2> 395775 T1920 oasc.ZkContainer.initZooKeeper Zookeepe
>
> [...truncated too long message...]
>
> tor$ElectionWatcher.process WARN
>  org.apache.zookeeper.KeeperException$SessionExpiredException:
> KeeperErrorCode = Session expired for /overseer_elect/election
>    [junit4]   2>        at
> org.apache.zookeeper.KeeperException.create(KeeperException.java:127)
>    [junit4]   2>        at
> org.apache.zookeeper.KeeperException.create(KeeperException.java:51)
>    [junit4]   2>        at
> org.apache.zookeeper.ZooKeeper.getChildren(ZooKeeper.java:1472)
>    [junit4]   2>        at
> org.apache.solr.common.cloud.SolrZkClient$6.execute(SolrZkClient.java:260)
>    [junit4]   2>        at
> org.apache.solr.common.cloud.SolrZkClient$6.execute(SolrZkClient.java:257)
>    [junit4]   2>        at
> org.apache.solr.common.cloud.ZkCmdExecutor.retryOperation(ZkCmdExecutor.java:73)
>    [junit4]   2>        at
> org.apache.solr.common.cloud.SolrZkClient.getChildren(SolrZkClient.java:257)
>    [junit4]   2>        at
> org.apache.solr.cloud.LeaderElector.checkIfIamLeader(LeaderElector.java:94)
>    [junit4]   2>        at
> org.apache.solr.cloud.LeaderElector.access$200(LeaderElector.java:55)
>    [junit4]   2>        at
> org.apache.solr.cloud.LeaderElector$ElectionWatcher.process(LeaderElector.java:358)
>    [junit4]   2>        at
> org.apache.zookeeper.ClientCnxn$EventThread.processEvent(ClientCnxn.java:522)
>    [junit4]   2>        at
> org.apache.zookeeper.ClientCnxn$EventThread.run(ClientCnxn.java:498)
>    [junit4]   2>
>    [junit4]   2> 1182142 T5355 oascc.ZkStateReader$3.process WARN
> ZooKeeper watch triggered, but Solr cannot talk to ZK
>    [junit4]   2> 1182142 T5355 oasc.LeaderElector$ElectionWatcher.process
> WARN  org.apache.zookeeper.KeeperException$SessionExpiredException:
> KeeperErrorCode = Session expired for
> /collections/implicitcoll4/leader_elect/a/election
>    [junit4]   2>        at
> org.apache.zookeeper.KeeperException.create(KeeperException.java:127)
>    [junit4]   2>        at
> org.apache.zookeeper.KeeperException.create(KeeperException.java:51)
>    [junit4]   2>        at
> org.apache.zookeeper.ZooKeeper.getChildren(ZooKeeper.java:1472)
>    [junit4]   2>        at
> org.apache.solr.common.cloud.SolrZkClient$6.execute(SolrZkClient.java:260)
>    [junit4]   2>        at
> org.apache.solr.common.cloud.SolrZkClient$6.execute(SolrZkClient.java:257)
>    [junit4]   2>        at
> org.apache.solr.common.cloud.ZkCmdExecutor.retryOperation(ZkCmdExecutor.java:73)
>    [junit4]   2>        at
> org.apache.solr.common.cloud.SolrZkClient.getChildren(SolrZkClient.java:257)
>    [junit4]   2>        at
> org.apache.solr.cloud.LeaderElector.checkIfIamLeader(LeaderElector.java:94)
>    [junit4]   2>        at
> org.apache.solr.cloud.LeaderElector.access$200(LeaderElector.java:55)
>    [junit4]   2>        at
> org.apache.solr.cloud.LeaderElector$ElectionWatcher.process(LeaderElector.java:358)
>    [junit4]   2>        at
> org.apache.zookeeper.ClientCnxn$EventThread.processEvent(ClientCnxn.java:522)
>    [junit4]   2>        at
> org.apache.zookeeper.ClientCnxn$EventThread.run(ClientCnxn.java:498)
>    [junit4]   2>
>    [junit4]   2> 1182143 T5355 oasc.LeaderElector$ElectionWatcher.process
> WARN  org.apache.zookeeper.KeeperException$SessionExpiredException:
> KeeperErrorCode = Session expired for
> /collections/implicitcoll2/leader_elect/b/election
>    [junit4]   2>        at
> org.apache.zookeeper.KeeperException.create(KeeperException.java:127)
>    [junit4]   2>        at
> org.apache.zookeeper.KeeperException.create(KeeperException.java:51)
>    [junit4]   2>        at
> org.apache.zookeeper.ZooKeeper.getChildren(ZooKeeper.java:1472)
>    [junit4]   2>        at
> org.apache.solr.common.cloud.SolrZkClient$6.execute(SolrZkClient.java:260)
>    [junit4]   2>        at
> org.apache.solr.common.cloud.SolrZkClient$6.execute(SolrZkClient.java:257)
>    [junit4]   2>        at
> org.apache.solr.common.cloud.ZkCmdExecutor.retryOperation(ZkCmdExecutor.java:73)
>    [junit4]   2>        at
> org.apache.solr.common.cloud.SolrZkClient.getChildren(SolrZkClient.java:257)
>    [junit4]   2>        at
> org.apache.solr.cloud.LeaderElector.checkIfIamLeader(LeaderElector.java:94)
>    [junit4]   2>        at
> org.apache.solr.cloud.LeaderElector.access$200(LeaderElector.java:55)
>    [junit4]   2>        at
> org.apache.solr.cloud.LeaderElector$ElectionWatcher.process(LeaderElector.java:358)
>    [junit4]   2>        at
> org.apache.zookeeper.ClientCnxn$EventThread.processEvent(ClientCnxn.java:522)
>    [junit4]   2>        at
> org.apache.zookeeper.ClientCnxn$EventThread.run(ClientCnxn.java:498)
>    [junit4]   2>
>    [junit4]   2> NOTE: leaving temporary files on disk at:
> /mnt/ssd/jenkins/workspace/Lucene-Solr-trunk-Linux/solr/build/solr-core/test/J1/./temp/solr.cloud.CustomCollectionTest-AE3C63646FD894D0-001
>    [junit4]   2> NOTE: test params are: codec=CheapBastard,
> sim=DefaultSimilarity, locale=ja, timezone=America/Argentina/Buenos_Aires
>    [junit4]   2> NOTE: Linux 3.8.0-42-generic i386/Oracle Corporation
> 1.8.0_20-ea (32-bit)/cpus=8,threads=1,free=129193328,total=338427904
>    [junit4]   2> NOTE: All tests run in this JVM: [TestQueryUtils,
> OpenCloseCoreStressTest, TestSerializedLuceneMatchVersion,
> TestPseudoReturnFields, SolrRequestParserTest, TestAddFieldRealTimeGet,
> HdfsBasicDistributedZk2Test, SortByFunctionTest, TestExceedMaxTermLength,
> DirectUpdateHandlerOptimizeTest, BasicDistributedZk2Test,
> SuggestComponentTest, ResponseHeaderTest, URLClassifyProcessorTest,
> AnalyticsQueryTest, TestStressLucene, QueryElevationComponentTest,
> LukeRequestHandlerTest, TestCloudInspectUtil, SOLR749Test,
> TestFieldCollectionResource, LeaderElectionIntegrationTest, TestLazyCores,
> TestManagedStopFilterFactory, CoreContainerCoreInitFailuresTest,
> SoftAutoCommitTest, DistributedSuggestComponentTest, TestJoin,
> SolrCoreTest, CSVRequestHandlerTest, TestShardHandlerFactory,
> MultiTermTest, TestOmitPositions, TestRealTimeGet, TestNonNRTOpen,
> TestMergePolicyConfig, ClusterStateTest, TestCollapseQParserPlugin,
> SolrPluginUtilsTest, DocValuesMissingTest, TestFieldResource,
> SynonymTokenizerTest, DocValuesTest, TermVectorComponentDistributedTest,
> TestNonDefinedSimilarityFactory, HdfsChaosMonkeySafeLeaderTest, SampleTest,
> TestRandomMergePolicy, TestPerFieldSimilarity,
> LegacyHTMLStripCharFilterTest, SuggesterFSTTest, TestSolrXMLSerializer,
> SolrIndexConfigTest, TestXIncludeConfig, TestReplicationHandlerBackup,
> CoreMergeIndexesAdminHandlerTest, ResourceLoaderTest, SolrXmlInZkTest,
> TestDocumentBuilder, OutputWriterTest, TestNoOpRegenerator,
> TestCSVResponseWriter, OverseerStatusTest,
> TestSolrQueryParserDefaultOperatorResource, TestElisionMultitermQuery,
> QueryFacetTest, DeleteInactiveReplicaTest, DOMUtilTest, UUIDFieldTest,
> TestJmxMonitoredMap, DistribDocExpirationUpdateProcessorTest,
> SpatialFilterTest, TestIndexingPerformance, TestFunctionQuery,
> TestRecovery, SchemaVersionSpecificBehaviorTest, TestRecoveryHdfs,
> FieldAnalysisRequestHandlerTest, HdfsRecoveryZkTest, TestUpdate,
> ChaosMonkeySafeLeaderTest, SSLMigrationTest,
> CollectionsAPIDistributedZkTest, SearchHandlerTest, TestInitQParser,
> CursorMarkTest, PolyFieldTest, TestLRUCache, ZkSolrClientTest,
> TestPostingsSolrHighlighter, HardAutoCommitTest, TestPhraseSuggestions,
> TestInfoStreamLogging, TestCoreContainer, NumericFieldsTest,
> AutoCommitTest, DeleteReplicaTest, TestReversedWildcardFilterFactory,
> TestFreeTextSuggestions, TestDynamicFieldResource,
> TestComplexPhraseQParserPlugin, DirectSolrConnectionTest,
> TestReplicationHandler, TestZkChroot, ShardRoutingCustomTest,
> TestDistributedGrouping, TestFaceting, TestHashPartitioner,
> TestStressVersions, TestGroupingSearch, BasicFunctionalityTest,
> TestBadConfig, TestIndexSearcher, HighlighterTest,
> CurrencyFieldOpenExchangeTest, DistributedQueryElevationComponentTest,
> CurrencyFieldXmlFileTest, SimplePostToolTest, AnalysisAfterCoreReloadTest,
> SignatureUpdateProcessorFactoryTest, TestExtendedDismaxParser,
> SpellCheckCollatorTest, CoreAdminHandlerTest, SuggesterTest, TestCSVLoader,
> FieldMutatingUpdateProcessorTest, TestAtomicUpdateErrorCases,
> StatelessScriptUpdateProcessorFactoryTest, CacheHeaderTest, TestWriterPerf,
> TestQueryTypes, TermsComponentTest, DocumentBuilderTest,
> TermVectorComponentTest, FastVectorHighlighterTest, LoggingHandlerTest,
> TestJmxIntegration, UpdateRequestProcessorFactoryTest, MBeansHandlerTest,
> UniqFieldsUpdateProcessorFactoryTest, TestPartialUpdateDeduplication,
> PingRequestHandlerTest, TestBinaryResponseWriter, AlternateDirectoryTest,
> CopyFieldTest, TestBinaryField, MinimalSchemaTest,
> TestFuzzyAnalyzedSuggestions, NotRequiredUniqueKeyTest, TestCharFilters,
> TestLMDirichletSimilarityFactory, TestIBSimilarityFactory,
> TestDefaultSimilarityFactory, TestFastOutputStream,
> OpenExchangeRatesOrgProviderTest, DateMathParserTest,
> ChaosMonkeyNothingIsSafeTest, RangeFacetTest, FunctionTest,
> CollectionsAPIAsyncDistributedZkTest, ConnectionManagerTest,
> CustomCollectionTest]
>    [junit4] Completed on J1 in 37.99s, 1 test, 1 failure <<< FAILURES!
>
> [...truncated 233 lines...]
> BUILD FAILED
> /mnt/ssd/jenkins/workspace/Lucene-Solr-trunk-Linux/build.xml:467: The
> following error occurred while executing this line:
> /mnt/ssd/jenkins/workspace/Lucene-Solr-trunk-Linux/build.xml:447: The
> following error occurred while executing this line:
> /mnt/ssd/jenkins/workspace/Lucene-Solr-trunk-Linux/build.xml:45: The
> following error occurred while executing this line:
> /mnt/ssd/jenkins/workspace/Lucene-Solr-trunk-Linux/extra-targets.xml:37:
> The following error occurred while executing this line:
> /mnt/ssd/jenkins/workspace/Lucene-Solr-trunk-Linux/solr/build.xml:189: The
> following error occurred while executing this line:
> /mnt/ssd/jenkins/workspace/Lucene-Solr-trunk-Linux/solr/common-build.xml:496:
> The following error occurred while executing this line:
> /mnt/ssd/jenkins/workspace/Lucene-Solr-trunk-Linux/lucene/common-build.xml:1298:
> The following error occurred while executing this line:
> /mnt/ssd/jenkins/workspace/Lucene-Solr-trunk-Linux/lucene/common-build.xml:922:
> There were test failures: 418 suites, 1710 tests, 1 error, 5 failures, 38
> ignored (17 assumptions)
>
> Total time: 64 minutes 30 seconds
> Build step 'Invoke Ant' marked build as failure
> [description-setter] Description set: Java: 32bit/jdk1.8.0_20-ea-b21
> -server -XX:+UseParallelGC
> Archiving artifacts
> Recording test results
> Email was triggered for: Failure - Any
> Sending email for trigger: Failure - Any
>
>
>
>
> ---------------------------------------------------------------------
> To unsubscribe, e-mail: dev-unsubscribe@lucene.apache.org
> For additional commands, e-mail: dev-help@lucene.apache.org
>



-- 
Regards,
Shalin Shekhar Mangar.

Mime
View raw message