lucene-dev mailing list archives

Site index · List index
Message view « Date » · « Thread »
Top « Date » · « Thread »
From buil...@flonkings.com
Subject [JENKINS] Lucene-4x-Linux-Java7-64-test-only - Build # 27188 - Failure!
Date Fri, 25 Jul 2014 10:02:27 GMT
Build: builds.flonkings.com/job/Lucene-4x-Linux-Java7-64-test-only/27188/

1 tests failed.
REGRESSION:  org.apache.lucene.index.TestIndexWriterThreadsToSegments.testManyThreadsClose

Error Message:
Captured an uncaught exception in thread: Thread[id=222, name=Thread-102, state=RUNNABLE,
group=TGRP-TestIndexWriterThreadsToSegments]

Stack Trace:
com.carrotsearch.randomizedtesting.UncaughtExceptionError: Captured an uncaught exception
in thread: Thread[id=222, name=Thread-102, state=RUNNABLE, group=TGRP-TestIndexWriterThreadsToSegments]
	at __randomizedtesting.SeedInfo.seed([23CFC8083A310D8C:11760FEA478C456A]:0)
Caused by: java.lang.RuntimeException: java.lang.NullPointerException
	at __randomizedtesting.SeedInfo.seed([23CFC8083A310D8C]:0)
	at org.apache.lucene.index.TestIndexWriterThreadsToSegments$3.run(TestIndexWriterThreadsToSegments.java:258)
Caused by: java.lang.NullPointerException
	at org.apache.lucene.index.DocumentsWriterPerThreadPool.release(DocumentsWriterPerThreadPool.java:300)
	at org.apache.lucene.index.DocumentsWriterFlushControl.obtainAndLock(DocumentsWriterFlushControl.java:473)
	at org.apache.lucene.index.DocumentsWriter.updateDocument(DocumentsWriter.java:437)
	at org.apache.lucene.index.IndexWriter.updateDocument(IndexWriter.java:1507)
	at org.apache.lucene.index.IndexWriter.addDocument(IndexWriter.java:1222)
	at org.apache.lucene.index.RandomIndexWriter.addDocument(RandomIndexWriter.java:149)
	at org.apache.lucene.index.RandomIndexWriter.addDocument(RandomIndexWriter.java:110)
	at org.apache.lucene.index.TestIndexWriterThreadsToSegments$3.run(TestIndexWriterThreadsToSegments.java:253)




Build Log:
[...truncated 1608 lines...]
   [junit4] Suite: org.apache.lucene.index.TestIndexWriterThreadsToSegments
   [junit4]   2> NOTE: reproduce with: ant test  -Dtestcase=TestIndexWriterThreadsToSegments
-Dtests.method=testManyThreadsClose -Dtests.seed=23CFC8083A310D8C -Dtests.slow=true -Dtests.locale=fr_FR
-Dtests.timezone=Pacific/Midway -Dtests.file.encoding=UTF-8
   [junit4] ERROR   2.55s J4 | TestIndexWriterThreadsToSegments.testManyThreadsClose <<<
   [junit4]    > Throwable #1: com.carrotsearch.randomizedtesting.UncaughtExceptionError:
Captured an uncaught exception in thread: Thread[id=222, name=Thread-102, state=RUNNABLE,
group=TGRP-TestIndexWriterThreadsToSegments]
   [junit4]    > 	at __randomizedtesting.SeedInfo.seed([23CFC8083A310D8C:11760FEA478C456A]:0)
   [junit4]    > Caused by: java.lang.RuntimeException: java.lang.NullPointerException
   [junit4]    > 	at __randomizedtesting.SeedInfo.seed([23CFC8083A310D8C]:0)
   [junit4]    > 	at org.apache.lucene.index.TestIndexWriterThreadsToSegments$3.run(TestIndexWriterThreadsToSegments.java:258)
   [junit4]    > Caused by: java.lang.NullPointerException
   [junit4]    > 	at org.apache.lucene.index.DocumentsWriterPerThreadPool.release(DocumentsWriterPerThreadPool.java:300)
   [junit4]    > 	at org.apache.lucene.index.DocumentsWriterFlushControl.obtainAndLock(DocumentsWriterFlushControl.java:473)
   [junit4]    > 	at org.apache.lucene.index.DocumentsWriter.updateDocument(DocumentsWriter.java:437)
   [junit4]    > 	at org.apache.lucene.index.IndexWriter.updateDocument(IndexWriter.java:1507)
   [junit4]    > 	at org.apache.lucene.index.IndexWriter.addDocument(IndexWriter.java:1222)
   [junit4]    > 	at org.apache.lucene.index.RandomIndexWriter.addDocument(RandomIndexWriter.java:149)
   [junit4]    > 	at org.apache.lucene.index.RandomIndexWriter.addDocument(RandomIndexWriter.java:110)
   [junit4]    > 	at org.apache.lucene.index.TestIndexWriterThreadsToSegments$3.run(TestIndexWriterThreadsToSegments.java:253)
   [junit4]   2> NOTE: test params are: codec=Lucene49: {field=PostingsFormat(name=SimpleText)},
docValues:{}, sim=DefaultSimilarity, locale=fr_FR, timezone=Pacific/Midway
   [junit4]   2> NOTE: Linux 3.2.0-26-generic amd64/Oracle Corporation 1.7.0_55 (64-bit)/cpus=8,threads=1,free=57393592,total=242221056
   [junit4]   2> NOTE: All tests run in this JVM: [TestScorerPerf, TestDeterminism, TestDemo,
TestAutomatonQuery, TestLookaheadTokenFilter, TestTermVectorsFormat, TestBinaryDocValuesUpdates,
TestSumDocFreq, Test2BNumericDocValues, Nested, Nested2, TestDateSort, TestPrefixFilter, ThrowInUncaught,
TestCrashCausesCorruptIndex, TestDocValuesWithThreads, TestLucene3xStoredFieldsFormat, InBeforeClass,
InAfterClass, InTestMethod, NonStringProperties, TestReaderClosed, TestBitVector, TestLucene42NormsFormat,
TestOmitNorms, TestQueryRescorer, TestSimpleAttributeImpl, TestDocCount, TestDocIdBitSet,
TestOpenBitSet, TestBasics, TestNorms, TestCompoundFile, TestIndexWriterUnicode, TestBufferedIndexInput,
TestConsistentFieldNumbers, TestLockFactory, TestSegmentMerger, TestIndexWriterNRTIsCurrent,
TestFieldsReader, TestDocValuesIndexing, TestHugeRamFile, TestSpanSearchEquivalence, TestPerSegmentDeletes,
TestPrefixCodedTerms, TestCheckIndex, TestCachingWrapperFilter, TestAttributeSource, TestSpanFirstQuery,
TestFieldInfos, TestDocBoost, TestTerm, TestLucene41StoredFieldsFormat, TestIndexWriterThreadsToSegments]
   [junit4] Completed on J4 in 75.31s, 4 tests, 1 error <<< FAILURES!

[...truncated 16 lines...]
BUILD FAILED
/var/lib/jenkins/workspace/Lucene-4x-Linux-Java7-64-test-only/checkout/lucene/build.xml:49:
The following error occurred while executing this line:
/var/lib/jenkins/workspace/Lucene-4x-Linux-Java7-64-test-only/checkout/lucene/common-build.xml:1299:
The following error occurred while executing this line:
/var/lib/jenkins/workspace/Lucene-4x-Linux-Java7-64-test-only/checkout/lucene/common-build.xml:923:
There were test failures: 415 suites, 3552 tests, 1 error, 131 ignored (120 assumptions)

Total time: 6 minutes 57 seconds
Build step 'Invoke Ant' marked build as failure
Recording test results
Email was triggered for: Failure
Sending email for trigger: Failure



Mime
View raw message