lucene-dev mailing list archives

Site index · List index
Message view « Date » · « Thread »
Top « Date » · « Thread »
From Policeman Jenkins Server <jenk...@thetaphi.de>
Subject [JENKINS] Lucene-Solr-4.x-Linux (32bit/jdk1.7.0_65) - Build # 10789 - Failure!
Date Mon, 28 Jul 2014 04:10:04 GMT
Build: http://jenkins.thetaphi.de/job/Lucene-Solr-4.x-Linux/10789/
Java: 32bit/jdk1.7.0_65 -server -XX:+UseSerialGC

1 tests failed.
REGRESSION:  org.apache.solr.morphlines.cell.SolrCellMorphlineTest.testSolrCellDocumentTypes

Error Message:
key:ignored__attachment_mimetype expected:<[message/rfc822]> but was:<[text/plain]>

Stack Trace:
java.lang.AssertionError: key:ignored__attachment_mimetype expected:<[message/rfc822]> but was:<[text/plain]>
	at __randomizedtesting.SeedInfo.seed([3064D825784C0F92:AAA77BBB1D975147]:0)
	at org.junit.Assert.fail(Assert.java:93)
	at org.junit.Assert.failNotEquals(Assert.java:647)
	at org.junit.Assert.assertEquals(Assert.java:128)
	at org.apache.solr.morphlines.solr.AbstractSolrMorphlineTestBase.testDocumentTypesInternal(AbstractSolrMorphlineTestBase.java:170)
	at org.apache.solr.morphlines.cell.SolrCellMorphlineTest.testSolrCellDocumentTypes(SolrCellMorphlineTest.java:193)
	at sun.reflect.NativeMethodAccessorImpl.invoke0(Native Method)
	at sun.reflect.NativeMethodAccessorImpl.invoke(NativeMethodAccessorImpl.java:57)
	at sun.reflect.DelegatingMethodAccessorImpl.invoke(DelegatingMethodAccessorImpl.java:43)
	at java.lang.reflect.Method.invoke(Method.java:606)
	at com.carrotsearch.randomizedtesting.RandomizedRunner.invoke(RandomizedRunner.java:1618)
	at com.carrotsearch.randomizedtesting.RandomizedRunner$6.evaluate(RandomizedRunner.java:827)
	at com.carrotsearch.randomizedtesting.RandomizedRunner$7.evaluate(RandomizedRunner.java:863)
	at com.carrotsearch.randomizedtesting.RandomizedRunner$8.evaluate(RandomizedRunner.java:877)
	at com.carrotsearch.randomizedtesting.rules.SystemPropertiesRestoreRule$1.evaluate(SystemPropertiesRestoreRule.java:53)
	at org.apache.lucene.util.TestRuleSetupTeardownChained$1.evaluate(TestRuleSetupTeardownChained.java:50)
	at org.apache.lucene.util.TestRuleFieldCacheSanity$1.evaluate(TestRuleFieldCacheSanity.java:51)
	at org.apache.lucene.util.AbstractBeforeAfterRule$1.evaluate(AbstractBeforeAfterRule.java:46)
	at com.carrotsearch.randomizedtesting.rules.SystemPropertiesInvariantRule$1.evaluate(SystemPropertiesInvariantRule.java:55)
	at org.apache.lucene.util.TestRuleThreadAndTestName$1.evaluate(TestRuleThreadAndTestName.java:49)
	at org.apache.lucene.util.TestRuleIgnoreAfterMaxFailures$1.evaluate(TestRuleIgnoreAfterMaxFailures.java:65)
	at org.apache.lucene.util.TestRuleMarkFailure$1.evaluate(TestRuleMarkFailure.java:48)
	at com.carrotsearch.randomizedtesting.rules.StatementAdapter.evaluate(StatementAdapter.java:36)
	at com.carrotsearch.randomizedtesting.ThreadLeakControl$StatementRunner.run(ThreadLeakControl.java:365)
	at com.carrotsearch.randomizedtesting.ThreadLeakControl.forkTimeoutingTask(ThreadLeakControl.java:798)
	at com.carrotsearch.randomizedtesting.ThreadLeakControl$3.evaluate(ThreadLeakControl.java:458)
	at com.carrotsearch.randomizedtesting.RandomizedRunner.runSingleTest(RandomizedRunner.java:836)
	at com.carrotsearch.randomizedtesting.RandomizedRunner$3.evaluate(RandomizedRunner.java:738)
	at com.carrotsearch.randomizedtesting.RandomizedRunner$4.evaluate(RandomizedRunner.java:772)
	at com.carrotsearch.randomizedtesting.RandomizedRunner$5.evaluate(RandomizedRunner.java:783)
	at com.carrotsearch.randomizedtesting.rules.StatementAdapter.evaluate(StatementAdapter.java:36)
	at com.carrotsearch.randomizedtesting.rules.SystemPropertiesRestoreRule$1.evaluate(SystemPropertiesRestoreRule.java:53)
	at org.apache.lucene.util.AbstractBeforeAfterRule$1.evaluate(AbstractBeforeAfterRule.java:46)
	at org.apache.lucene.util.TestRuleStoreClassName$1.evaluate(TestRuleStoreClassName.java:42)
	at com.carrotsearch.randomizedtesting.rules.SystemPropertiesInvariantRule$1.evaluate(SystemPropertiesInvariantRule.java:55)
	at com.carrotsearch.randomizedtesting.rules.NoShadowingOrOverridesOnMethodsRule$1.evaluate(NoShadowingOrOverridesOnMethodsRule.java:39)
	at com.carrotsearch.randomizedtesting.rules.NoShadowingOrOverridesOnMethodsRule$1.evaluate(NoShadowingOrOverridesOnMethodsRule.java:39)
	at com.carrotsearch.randomizedtesting.rules.StatementAdapter.evaluate(StatementAdapter.java:36)
	at com.carrotsearch.randomizedtesting.rules.StatementAdapter.evaluate(StatementAdapter.java:36)
	at com.carrotsearch.randomizedtesting.rules.StatementAdapter.evaluate(StatementAdapter.java:36)
	at org.apache.lucene.util.TestRuleAssertionsRequired$1.evaluate(TestRuleAssertionsRequired.java:43)
	at org.apache.lucene.util.TestRuleMarkFailure$1.evaluate(TestRuleMarkFailure.java:48)
	at org.apache.lucene.util.TestRuleIgnoreAfterMaxFailures$1.evaluate(TestRuleIgnoreAfterMaxFailures.java:65)
	at org.apache.lucene.util.TestRuleIgnoreTestSuites$1.evaluate(TestRuleIgnoreTestSuites.java:55)
	at com.carrotsearch.randomizedtesting.rules.StatementAdapter.evaluate(StatementAdapter.java:36)
	at com.carrotsearch.randomizedtesting.ThreadLeakControl$StatementRunner.run(ThreadLeakControl.java:365)
	at java.lang.Thread.run(Thread.java:745)




Build Log:
[...truncated 19520 lines...]
   [junit4] Suite: org.apache.solr.morphlines.cell.SolrCellMorphlineTest
   [junit4]   2> log4j:WARN No such property [conversionPattern] in org.apache.solr.util.SolrLogLayout.
   [junit4]   2> Creating dataDir: /mnt/ssd/jenkins/workspace/Lucene-Solr-4.x-Linux/solr/build/contrib/solr-morphlines-cell/test/J0/./solr.morphlines.cell.SolrCellMorphlineTest-3064D825784C0F92-001/init-core-data-001
   [junit4]   2> 837 T11 oas.SolrTestCaseJ4.buildSSLConfig Randomized ssl (false) and clientAuth (true)
   [junit4]   2> 869 T11 oas.SolrTestCaseJ4.initCore ####initCore
   [junit4]   2> 904 T11 oasc.SolrResourceLoader.<init> new SolrResourceLoader for directory: '/mnt/ssd/jenkins/workspace/Lucene-Solr-4.x-Linux/solr/contrib/morphlines-core/src/test-files/solr/collection1/'
   [junit4]   2> 1569 T11 oasc.SolrConfig.initLibs Adding specified lib dirs to ClassLoader
   [junit4]   2> 1571 T11 oasc.SolrResourceLoader.addToClassLoader WARN Can't find (or read) directory to add to classloader: ../../../contrib/extraction/lib (resolved as: /mnt/ssd/jenkins/workspace/Lucene-Solr-4.x-Linux/solr/contrib/morphlines-core/src/test-files/solr/collection1/../../../contrib/extraction/lib).
   [junit4]   2> 1572 T11 oasc.SolrResourceLoader.addToClassLoader WARN Can't find (or read) directory to add to classloader: ../../../dist/ (resolved as: /mnt/ssd/jenkins/workspace/Lucene-Solr-4.x-Linux/solr/contrib/morphlines-core/src/test-files/solr/collection1/../../../dist).
   [junit4]   2> 1573 T11 oasc.SolrResourceLoader.addToClassLoader WARN Can't find (or read) directory to add to classloader: ../../../contrib/clustering/lib/ (resolved as: /mnt/ssd/jenkins/workspace/Lucene-Solr-4.x-Linux/solr/contrib/morphlines-core/src/test-files/solr/collection1/../../../contrib/clustering/lib).
   [junit4]   2> 1573 T11 oasc.SolrResourceLoader.addToClassLoader WARN Can't find (or read) directory to add to classloader: ../../../dist/ (resolved as: /mnt/ssd/jenkins/workspace/Lucene-Solr-4.x-Linux/solr/contrib/morphlines-core/src/test-files/solr/collection1/../../../dist).
   [junit4]   2> 1574 T11 oasc.SolrResourceLoader.addToClassLoader WARN Can't find (or read) directory to add to classloader: ../../../contrib/langid/lib/ (resolved as: /mnt/ssd/jenkins/workspace/Lucene-Solr-4.x-Linux/solr/contrib/morphlines-core/src/test-files/solr/collection1/../../../contrib/langid/lib).
   [junit4]   2> 1575 T11 oasc.SolrResourceLoader.addToClassLoader WARN Can't find (or read) directory to add to classloader: ../../../dist/ (resolved as: /mnt/ssd/jenkins/workspace/Lucene-Solr-4.x-Linux/solr/contrib/morphlines-core/src/test-files/solr/collection1/../../../dist).
   [junit4]   2> 1576 T11 oasc.SolrResourceLoader.addToClassLoader WARN Can't find (or read) directory to add to classloader: ../../../contrib/velocity/lib (resolved as: /mnt/ssd/jenkins/workspace/Lucene-Solr-4.x-Linux/solr/contrib/morphlines-core/src/test-files/solr/collection1/../../../contrib/velocity/lib).
   [junit4]   2> 1577 T11 oasc.SolrResourceLoader.addToClassLoader WARN Can't find (or read) directory to add to classloader: ../../../dist/ (resolved as: /mnt/ssd/jenkins/workspace/Lucene-Solr-4.x-Linux/solr/contrib/morphlines-core/src/test-files/solr/collection1/../../../dist).
   [junit4]   2> 1578 T11 oasc.SolrResourceLoader.addToClassLoader WARN Can't find (or read) directory to add to classloader: /non/existent/dir/yields/warning (resolved as: /non/existent/dir/yields/warning).
   [junit4]   2> 1735 T11 oasc.SolrConfig.<init> Using Lucene MatchVersion: LUCENE_4_10
   [junit4]   2> 1960 T11 oasc.SolrConfig.<init> Loaded SolrConfig: solrconfig.xml
   [junit4]   2> 1970 T11 oass.IndexSchema.readSchema Reading Solr Schema from schema.xml
   [junit4]   2> 2051 T11 oass.IndexSchema.readSchema [null] Schema name=example
   [junit4]   2> 2232 T11 oasc.SolrResourceLoader.findClass WARN Solr loaded a deprecated plugin/analysis class [solr.IntField]. Please consult documentation how to replace it accordingly.
   [junit4]   2> 2243 T11 oasc.SolrResourceLoader.findClass WARN Solr loaded a deprecated plugin/analysis class [solr.LongField]. Please consult documentation how to replace it accordingly.
   [junit4]   2> 2252 T11 oasc.SolrResourceLoader.findClass WARN Solr loaded a deprecated plugin/analysis class [solr.FloatField]. Please consult documentation how to replace it accordingly.
   [junit4]   2> 2262 T11 oasc.SolrResourceLoader.findClass WARN Solr loaded a deprecated plugin/analysis class [solr.DoubleField]. Please consult documentation how to replace it accordingly.
   [junit4]   2> 2271 T11 oasc.SolrResourceLoader.findClass WARN Solr loaded a deprecated plugin/analysis class [solr.DateField]. Please consult documentation how to replace it accordingly.
   [junit4]   2> 2790 T11 oasc.SolrResourceLoader.findClass WARN Solr loaded a deprecated plugin/analysis class [solr.ThaiWordFilterFactory]. Please consult documentation how to replace it accordingly.
   [junit4]   2> 2830 T11 oass.IndexSchema.readSchema unique key field: id
   [junit4]   2> 3021 T11 oass.FileExchangeRateProvider.reload Reloading exchange rates from file currency.xml
   [junit4]   2> 3034 T11 oass.FileExchangeRateProvider.reload Reloading exchange rates from file currency.xml
   [junit4]   2> 3170 T11 oasc.SolrResourceLoader.locateSolrHome JNDI not configured for solr (NoInitialContextEx)
   [junit4]   2> 3170 T11 oasc.SolrResourceLoader.locateSolrHome using system property solr.solr.home: /mnt/ssd/jenkins/workspace/Lucene-Solr-4.x-Linux/solr/contrib/morphlines-core/src/test-files/solr
   [junit4]   2> 3171 T11 oasc.SolrResourceLoader.<init> new SolrResourceLoader for directory: '/mnt/ssd/jenkins/workspace/Lucene-Solr-4.x-Linux/solr/contrib/morphlines-core/src/test-files/solr/'
   [junit4]   2> 3299 T11 oasc.CoreContainer.<init> New CoreContainer 4860632
   [junit4]   2> 3299 T11 oasc.CoreContainer.load Loading cores into CoreContainer [instanceDir=/mnt/ssd/jenkins/workspace/Lucene-Solr-4.x-Linux/solr/contrib/morphlines-core/src/test-files/solr/]
   [junit4]   2> 3321 T11 oashc.HttpShardHandlerFactory.getParameter Setting socketTimeout to: 0
   [junit4]   2> 3322 T11 oashc.HttpShardHandlerFactory.getParameter Setting urlScheme to: null
   [junit4]   2> 3322 T11 oashc.HttpShardHandlerFactory.getParameter Setting connTimeout to: 0
   [junit4]   2> 3323 T11 oashc.HttpShardHandlerFactory.getParameter Setting maxConnectionsPerHost to: 20
   [junit4]   2> 3323 T11 oashc.HttpShardHandlerFactory.getParameter Setting corePoolSize to: 0
   [junit4]   2> 3324 T11 oashc.HttpShardHandlerFactory.getParameter Setting maximumPoolSize to: 2147483647
   [junit4]   2> 3324 T11 oashc.HttpShardHandlerFactory.getParameter Setting maxThreadIdleTime to: 5
   [junit4]   2> 3325 T11 oashc.HttpShardHandlerFactory.getParameter Setting sizeOfQueue to: -1
   [junit4]   2> 3325 T11 oashc.HttpShardHandlerFactory.getParameter Setting fairnessPolicy to: false
   [junit4]   2> 3562 T11 oasu.UpdateShardHandler.<init> Creating UpdateShardHandler HTTP client with params: socketTimeout=30000&connTimeout=30000&retry=false
   [junit4]   2> 3567 T11 oasl.LogWatcher.createWatcher SLF4J impl is org.slf4j.impl.Log4jLoggerFactory
   [junit4]   2> 3569 T11 oasl.LogWatcher.newRegisteredLogWatcher Registering Log Listener [Log4j (org.slf4j.impl.Log4jLoggerFactory)]
   [junit4]   2> 3571 T11 oasc.CoreContainer.load Host Name: 
   [junit4]   2> 3680 T12 oasc.SolrResourceLoader.<init> new SolrResourceLoader for directory: '/mnt/ssd/jenkins/workspace/Lucene-Solr-4.x-Linux/solr/contrib/morphlines-core/src/test-files/solr/collection1/'
   [junit4]   2> 3781 T12 oasc.SolrConfig.initLibs Adding specified lib dirs to ClassLoader
   [junit4]   2> 3781 T12 oasc.SolrResourceLoader.addToClassLoader WARN Can't find (or read) directory to add to classloader: ../../../contrib/extraction/lib (resolved as: /mnt/ssd/jenkins/workspace/Lucene-Solr-4.x-Linux/solr/contrib/morphlines-core/src/test-files/solr/collection1/../../../contrib/extraction/lib).
   [junit4]   2> 3782 T12 oasc.SolrResourceLoader.addToClassLoader WARN Can't find (or read) directory to add to classloader: ../../../dist/ (resolved as: /mnt/ssd/jenkins/workspace/Lucene-Solr-4.x-Linux/solr/contrib/morphlines-core/src/test-files/solr/collection1/../../../dist).
   [junit4]   2> 3783 T12 oasc.SolrResourceLoader.addToClassLoader WARN Can't find (or read) directory to add to classloader: ../../../contrib/clustering/lib/ (resolved as: /mnt/ssd/jenkins/workspace/Lucene-Solr-4.x-Linux/solr/contrib/morphlines-core/src/test-files/solr/collection1/../../../contrib/clustering/lib).
   [junit4]   2> 3784 T12 oasc.SolrResourceLoader.addToClassLoader WARN Can't find (or read) directory to add to classloader: ../../../dist/ (resolved as: /mnt/ssd/jenkins/workspace/Lucene-Solr-4.x-Linux/solr/contrib/morphlines-core/src/test-files/solr/collection1/../../../dist).
   [junit4]   2> 3784 T12 oasc.SolrResourceLoader.addToClassLoader WARN Can't find (or read) directory to add to classloader: ../../../contrib/langid/lib/ (resolved as: /mnt/ssd/jenkins/workspace/Lucene-Solr-4.x-Linux/solr/contrib/morphlines-core/src/test-files/solr/collection1/../../../contrib/langid/lib).
   [junit4]   2> 3785 T12 oasc.SolrResourceLoader.addToClassLoader WARN Can't find (or read) directory to add to classloader: ../../../dist/ (resolved as: /mnt/ssd/jenkins/workspace/Lucene-Solr-4.x-Linux/solr/contrib/morphlines-core/src/test-files/solr/collection1/../../../dist).
   [junit4]   2> 3786 T12 oasc.SolrResourceLoader.addToClassLoader WARN Can't find (or read) directory to add to classloader: ../../../contrib/velocity/lib (resolved as: /mnt/ssd/jenkins/workspace/Lucene-Solr-4.x-Linux/solr/contrib/morphlines-core/src/test-files/solr/collection1/../../../contrib/velocity/lib).
   [junit4]   2> 3786 T12 oasc.SolrResourceLoader.addToClassLoader WARN Can't find (or read) directory to add to classloader: ../../../dist/ (resolved as: /mnt/ssd/jenkins/workspace/Lucene-Solr-4.x-Linux/solr/contrib/morphlines-core/src/test-files/solr/collection1/../../../dist).
   [junit4]   2> 3787 T12 oasc.SolrResourceLoader.addToClassLoader WARN Can't find (or read) directory to add to classloader: /non/existent/dir/yields/warning (resolved as: /non/existent/dir/yields/warning).
   [junit4]   2> 3842 T12 oasc.SolrConfig.<init> Using Lucene MatchVersion: LUCENE_4_10
   [junit4]   2> 3928 T12 oasc.SolrConfig.<init> Loaded SolrConfig: solrconfig.xml
   [junit4]   2> 3929 T12 oass.IndexSchema.readSchema Reading Solr Schema from schema.xml
   [junit4]   2> 3986 T12 oass.IndexSchema.readSchema [collection1] Schema name=example
   [junit4]   2> 4458 T12 oass.IndexSchema.readSchema unique key field: id
   [junit4]   2> 4486 T12 oass.FileExchangeRateProvider.reload Reloading exchange rates from file currency.xml
   [junit4]   2> 4498 T12 oass.FileExchangeRateProvider.reload Reloading exchange rates from file currency.xml
   [junit4]   2> 4569 T12 oasc.CoreContainer.create Creating SolrCore 'collection1' using configuration from instancedir /mnt/ssd/jenkins/workspace/Lucene-Solr-4.x-Linux/solr/contrib/morphlines-core/src/test-files/solr/collection1/
   [junit4]   2> 4605 T12 oasc.SolrCore.initDirectoryFactory org.apache.solr.core.MockDirectoryFactory
   [junit4]   2> 4616 T12 oasc.SolrCore.<init> [collection1] Opening new SolrCore at /mnt/ssd/jenkins/workspace/Lucene-Solr-4.x-Linux/solr/contrib/morphlines-core/src/test-files/solr/collection1/, dataDir=/mnt/ssd/jenkins/workspace/Lucene-Solr-4.x-Linux/solr/build/contrib/solr-morphlines-cell/test/J0/./solr.morphlines.cell.SolrCellMorphlineTest-3064D825784C0F92-001/init-core-data-001/
   [junit4]   2> 4618 T12 oasc.JmxMonitoredMap.<init> No JMX servers found, not exposing Solr information with JMX.
   [junit4]   2> 4631 T12 oasc.SolrCore.initListeners [collection1] Added SolrEventListener for newSearcher: org.apache.solr.core.QuerySenderListener{queries=[]}
   [junit4]   2> 4632 T12 oasc.SolrCore.initListeners [collection1] Added SolrEventListener for firstSearcher: org.apache.solr.core.QuerySenderListener{queries=[{q=static firstSearcher warming in solrconfig.xml}]}
   [junit4]   2> 4665 T12 oasc.CachingDirectoryFactory.get return new directory for /mnt/ssd/jenkins/workspace/Lucene-Solr-4.x-Linux/solr/build/contrib/solr-morphlines-cell/test/J0/./solr.morphlines.cell.SolrCellMorphlineTest-3064D825784C0F92-001/init-core-data-001
   [junit4]   2> 4666 T12 oasc.SolrCore.getNewIndexDir New index directory detected: old=null new=/mnt/ssd/jenkins/workspace/Lucene-Solr-4.x-Linux/solr/build/contrib/solr-morphlines-cell/test/J0/./solr.morphlines.cell.SolrCellMorphlineTest-3064D825784C0F92-001/init-core-data-001/index/
   [junit4]   2> 4666 T12 oasc.SolrCore.initIndex WARN [collection1] Solr index directory '/mnt/ssd/jenkins/workspace/Lucene-Solr-4.x-Linux/solr/build/contrib/solr-morphlines-cell/test/J0/./solr.morphlines.cell.SolrCellMorphlineTest-3064D825784C0F92-001/init-core-data-001/index' doesn't exist. Creating new index...
   [junit4]   2> 4676 T12 oasc.CachingDirectoryFactory.get return new directory for /mnt/ssd/jenkins/workspace/Lucene-Solr-4.x-Linux/solr/build/contrib/solr-morphlines-cell/test/J0/./solr.morphlines.cell.SolrCellMorphlineTest-3064D825784C0F92-001/init-core-data-001/index
   [junit4]   2> 4726 T12 oasc.SolrDeletionPolicy.onCommit SolrDeletionPolicy.onCommit: commits: num=1
   [junit4]   2> 		commit{dir=MockDirectoryWrapper(RAMDirectory@16962b1 lockFactory=NativeFSLockFactory@/mnt/ssd/jenkins/workspace/Lucene-Solr-4.x-Linux/solr/build/contrib/solr-morphlines-cell/test/J0/./solr.morphlines.cell.SolrCellMorphlineTest-3064D825784C0F92-001/init-core-data-001/index),segFN=segments_1,generation=1}
   [junit4]   2> 4727 T12 oasc.SolrDeletionPolicy.updateCommits newest commit generation = 1
   [junit4]   2> 4739 T12 oasc.SolrCore.initWriters created json: solr.JSONResponseWriter
   [junit4]   2> 4739 T12 oasc.SolrCore.initWriters adding lazy queryResponseWriter: solr.VelocityResponseWriter
   [junit4]   2> 4740 T12 oasc.SolrCore.initWriters created velocity: solr.VelocityResponseWriter
   [junit4]   2> 4752 T12 oasc.SolrCore.initWriters created xslt: solr.XSLTResponseWriter
   [junit4]   2> 4752 T12 oasr.XSLTResponseWriter.init xsltCacheLifetimeSeconds=5
   [junit4]   2> 5080 T12 oasc.SolrCore.loadUpdateProcessorChains no updateRequestProcessorChain defined as default, creating implicit default
   [junit4]   2> 5110 T12 oasc.RequestHandlers.initHandlersFromConfig created /select: solr.SearchHandler
   [junit4]   2> 5110 T12 oasc.RequestHandlers.initHandlersFromConfig created /query: solr.SearchHandler
   [junit4]   2> 5116 T12 oasc.RequestHandlers.initHandlersFromConfig created /get: solr.RealTimeGetHandler
   [junit4]   2> 5116 T12 oasc.RequestHandlers.initHandlersFromConfig created /browse: solr.SearchHandler
   [junit4]   2> 5125 T12 oasc.RequestHandlers.initHandlersFromConfig created /update: solr.UpdateRequestHandler
   [junit4]   2> 5132 T12 oasc.SolrResourceLoader.findClass WARN Solr loaded a deprecated plugin/analysis class [solr.JsonUpdateRequestHandler]. Please consult documentation how to replace it accordingly.
   [junit4]   2> 5132 T12 oasc.RequestHandlers.initHandlersFromConfig created /update/json: solr.JsonUpdateRequestHandler
   [junit4]   2> 5138 T12 oasc.SolrResourceLoader.findClass WARN Solr loaded a deprecated plugin/analysis class [solr.CSVRequestHandler]. Please consult documentation how to replace it accordingly.
   [junit4]   2> 5139 T12 oasc.RequestHandlers.initHandlersFromConfig created /update/csv: solr.CSVRequestHandler
   [junit4]   2> 5139 T12 oasc.RequestHandlers.initHandlersFromConfig adding lazy requestHandler: solr.FieldAnalysisRequestHandler
   [junit4]   2> 5140 T12 oasc.RequestHandlers.initHandlersFromConfig created /analysis/field: solr.FieldAnalysisRequestHandler
   [junit4]   2> 5141 T12 oasc.RequestHandlers.initHandlersFromConfig adding lazy requestHandler: solr.DocumentAnalysisRequestHandler
   [junit4]   2> 5141 T12 oasc.RequestHandlers.initHandlersFromConfig created /analysis/document: solr.DocumentAnalysisRequestHandler
   [junit4]   2> 5148 T12 oasc.RequestHandlers.initHandlersFromConfig created /admin/: solr.admin.AdminHandlers
   [junit4]   2> 5155 T12 oasc.RequestHandlers.initHandlersFromConfig created /admin/ping: solr.PingRequestHandler
   [junit4]   2> 5161 T12 oasc.RequestHandlers.initHandlersFromConfig created /debug/dump: solr.DumpRequestHandler
   [junit4]   2> 5178 T12 oasc.RequestHandlers.initHandlersFromConfig created /replication: solr.ReplicationHandler
   [junit4]   2> 5178 T12 oasc.RequestHandlers.initHandlersFromConfig adding lazy requestHandler: solr.SearchHandler
   [junit4]   2> 5179 T12 oasc.RequestHandlers.initHandlersFromConfig created /spell: solr.SearchHandler
   [junit4]   2> 5179 T12 oasc.RequestHandlers.initHandlersFromConfig adding lazy requestHandler: solr.SearchHandler
   [junit4]   2> 5179 T12 oasc.RequestHandlers.initHandlersFromConfig created /tvrh: solr.SearchHandler
   [junit4]   2> 5180 T12 oasc.RequestHandlers.initHandlersFromConfig adding lazy requestHandler: solr.SearchHandler
   [junit4]   2> 5180 T12 oasc.RequestHandlers.initHandlersFromConfig created /terms: solr.SearchHandler
   [junit4]   2> 5180 T12 oasc.RequestHandlers.initHandlersFromConfig adding lazy requestHandler: solr.SearchHandler
   [junit4]   2> 5181 T12 oasc.RequestHandlers.initHandlersFromConfig created /elevate: solr.SearchHandler
   [junit4]   2> 5220 T12 oashl.XMLLoader.init xsltCacheLifetimeSeconds=60
   [junit4]   2> 5226 T12 oashl.XMLLoader.init xsltCacheLifetimeSeconds=60
   [junit4]   2> 5227 T12 oashl.XMLLoader.init xsltCacheLifetimeSeconds=60
   [junit4]   2> 5257 T12 oasu.CommitTracker.<init> Hard AutoCommit: if uncommited for 60000ms; 
   [junit4]   2> 5258 T12 oasu.CommitTracker.<init> Soft AutoCommit: if uncommited for 1000ms; 
   [junit4]   2> 5261 T12 oasc.SolrDeletionPolicy.onInit SolrDeletionPolicy.onInit: commits: num=1
   [junit4]   2> 		commit{dir=MockDirectoryWrapper(RAMDirectory@16962b1 lockFactory=NativeFSLockFactory@/mnt/ssd/jenkins/workspace/Lucene-Solr-4.x-Linux/solr/build/contrib/solr-morphlines-cell/test/J0/./solr.morphlines.cell.SolrCellMorphlineTest-3064D825784C0F92-001/init-core-data-001/index),segFN=segments_1,generation=1}
   [junit4]   2> 5261 T12 oasc.SolrDeletionPolicy.updateCommits newest commit generation = 1
   [junit4]   2> 5285 T12 oass.SolrIndexSearcher.<init> Opening Searcher@15252a[collection1] main
   [junit4]   2> 5301 T12 oasr.ManagedResourceStorage.newStorageIO WARN Cannot write to config directory /mnt/ssd/jenkins/workspace/Lucene-Solr-4.x-Linux/solr/contrib/morphlines-core/src/test-files/solr/collection1/conf; switching to use InMemory storage instead.
   [junit4]   2> 5303 T12 oasr.RestManager.init Initializing RestManager with initArgs: {}
   [junit4]   2> 5327 T12 oasr.ManagedResourceStorage.load Reading _rest_managed.json using InMemoryStorage
   [junit4]   2> 5328 T12 oasr.ManagedResource.reloadFromStorage WARN No stored data found for /rest/managed
   [junit4]   2> 5332 T12 oasr.ManagedResourceStorage$JsonStorage.store Saved JSON object to path _rest_managed.json using InMemoryStorage
   [junit4]   2> 5333 T12 oasr.RestManager.init Initializing 0 registered ManagedResources
   [junit4]   2> 5333 T12 oashc.SpellCheckComponent.inform Initializing spell checkers
   [junit4]   2> 5357 T12 oass.DirectSolrSpellChecker.init init: {name=default,field=name,classname=solr.DirectSolrSpellChecker,distanceMeasure=internal,accuracy=0.5,maxEdits=2,minPrefix=1,maxInspections=5,minQueryLength=4,maxQueryFrequency=0.01}
   [junit4]   2> 5380 T12 oashc.SpellCheckComponent.inform No queryConverter defined, using default converter
   [junit4]   2> 5385 T12 oashc.QueryElevationComponent.inform Loading QueryElevation from: /mnt/ssd/jenkins/workspace/Lucene-Solr-4.x-Linux/solr/contrib/morphlines-core/src/test-files/solr/collection1/conf/elevate.xml
   [junit4]   2> 5463 T12 oash.ReplicationHandler.inform Commits will be reserved for  10000
   [junit4]   2> 5463 T13 oasc.QuerySenderListener.newSearcher QuerySenderListener sending requests to Searcher@15252a[collection1] main{StandardDirectoryReader(segments_1:1:nrt)}
   [junit4]   2> 5464 T12 oasc.CoreContainer.registerCore registering core: collection1
   [junit4]   2> 5473 T11 oas.SolrTestCaseJ4.initCore ####initCore end
   [junit4]   2> 5492 T11 oas.SolrTestCaseJ4.setUp ###Starting testSolrCellXML
   [junit4]   2> ASYNC  NEW_CORE C0 name=collection1 org.apache.solr.core.SolrCore@3f03c3
   [junit4]   2> 5578 T13 C0 oasc.SolrCore.execute [collection1] webapp=null path=null params={distrib=false&q=static+firstSearcher+warming+in+solrconfig.xml&event=firstSearcher} hits=0 status=0 QTime=111 
   [junit4]   2> 5580 T13 oasc.QuerySenderListener.newSearcher QuerySenderListener done.
   [junit4]   2> 5581 T13 oashc.SpellCheckComponent$SpellCheckerListener.newSearcher Loading spell index for spellchecker: default
   [junit4]   2> 5581 T13 oashc.SpellCheckComponent$SpellCheckerListener.newSearcher Loading spell index for spellchecker: wordbreak
   [junit4]   2> 5581 T13 oasc.SolrCore.registerSearcher [collection1] Registered new searcher Searcher@15252a[collection1] main{StandardDirectoryReader(segments_1:1:nrt)}
   [junit4]   2> 5693 T11 C0 oasup.LogUpdateProcessor.finish [collection1] webapp=null path=/update params={} {deleteByQuery=*:* (-1474843716195713024)} 0 178
   [junit4]   2> 5696 T11 C0 oasu.DirectUpdateHandler2.commit start commit{,optimize=false,openSearcher=true,waitSearcher=true,expungeDeletes=false,softCommit=false,prepareCommit=false}
   [junit4]   2> 5697 T11 C0 oasu.DirectUpdateHandler2.commit No uncommitted changes. Skipping IW.commit.
   [junit4]   2> 5698 T11 C0 oasc.SolrCore.openNewSearcher SolrIndexSearcher has not changed - not re-opening: org.apache.solr.search.SolrIndexSearcher
   [junit4]   2> 5698 T11 C0 oasu.DirectUpdateHandler2.commit end_commit_flush
   [junit4]   2> 5699 T11 C0 oasup.LogUpdateProcessor.finish [collection1] webapp=null path=/update params={commit=true&softCommit=false&waitSearcher=true} {commit=} 0 3
   [junit4]   2> 5959 T11 okma.MorphlineContext.importCommandBuilders Importing commands
   [junit4]   2> 8052 T11 okma.MorphlineContext.importCommandBuilders Done importing commands
   [junit4]   2> 8074 T11 oasc.SolrResourceLoader.<init> new SolrResourceLoader for directory: '/mnt/ssd/jenkins/workspace/Lucene-Solr-4.x-Linux/solr/contrib/morphlines-core/src/test-files/solr/collection1/'
   [junit4]   2> 8154 T11 oasc.SolrConfig.initLibs Adding specified lib dirs to ClassLoader
   [junit4]   2> 8155 T11 oasc.SolrResourceLoader.addToClassLoader WARN Can't find (or read) directory to add to classloader: ../../../contrib/extraction/lib (resolved as: /mnt/ssd/jenkins/workspace/Lucene-Solr-4.x-Linux/solr/contrib/morphlines-core/src/test-files/solr/collection1/../../../contrib/extraction/lib).
   [junit4]   2> 8155 T11 oasc.SolrResourceLoader.addToClassLoader WARN Can't find (or read) directory to add to classloader: ../../../dist/ (resolved as: /mnt/ssd/jenkins/workspace/Lucene-Solr-4.x-Linux/solr/contrib/morphlines-core/src/test-files/solr/collection1/../../../dist).
   [junit4]   2> 8156 T11 oasc.SolrResourceLoader.addToClassLoader WARN Can't find (or read) directory to add to classloader: ../../../contrib/clustering/lib/ (resolved as: /mnt/ssd/jenkins/workspace/Lucene-Solr-4.x-Linux/solr/contrib/morphlines-core/src/test-files/solr/collection1/../../../contrib/clustering/lib).
   [junit4]   2> 8157 T11 oasc.SolrResourceLoader.addToClassLoader WARN Can't find (or read) directory to add to classloader: ../../../dist/ (resolved as: /mnt/ssd/jenkins/workspace/Lucene-Solr-4.x-Linux/solr/contrib/morphlines-core/src/test-files/solr/collection1/../../../dist).
   [junit4]   2> 8158 T11 oasc.SolrResourceLoader.addToClassLoader WARN Can't find (or read) directory to add to classloader: ../../../contrib/langid/lib/ (resolved as: /mnt/ssd/jenkins/workspace/Lucene-Solr-4.x-Linux/solr/contrib/morphlines-core/src/test-files/solr/collection1/../../../contrib/langid/lib).
   [junit4]   2> 8159 T11 oasc.SolrResourceLoader.addToClassLoader WARN Can't find (or read) directory to add to classloader: ../../../dist/ (resolved as: /mnt/ssd/jenkins/workspace/Lucene-Solr-4.x-Linux/solr/contrib/morphlines-core/src/test-files/solr/collection1/../../../dist).
   [junit4]   2> 8160 T11 oasc.SolrResourceLoader.addToClassLoader WARN Can't find (or read) directory to add to classloader: ../../../contrib/velocity/lib (resolved as: /mnt/ssd/jenkins/workspace/Lucene-Solr-4.x-Linux/solr/contrib/morphlines-core/src/test-files/solr/collection1/../../../contrib/velocity/lib).
   [junit4]   2> 8160 T11 oasc.SolrResourceLoader.addToClassLoader WARN Can't find (or read) directory to add to classloader: ../../../dist/ (resolved as: /mnt/ssd/jenkins/workspace/Lucene-Solr-4.x-Linux/solr/contrib/morphlines-core/src/test-files/solr/collection1/../../../dist).
   [junit4]   2> 8161 T11 oasc.SolrResourceLoader.addToClassLoader WARN Can't find (or read) directory to add to classloader: /non/existent/dir/yields/warning (resolved as: /non/existent/dir/yields/warning).
   [junit4]   2> 8224 T11 oasc.SolrConfig.<init> Using Lucene MatchVersion: LUCENE_4_10
   [junit4]   2> 8322 T11 oasc.SolrConfig.<init> Loaded SolrConfig: solrconfig.xml
   [junit4]   2> 8323 T11 oass.IndexSchema.readSchema Reading Solr Schema from schema.xml
   [junit4]   2> 8381 T11 oass.IndexSchema.readSchema [null] Schema name=example
   [junit4]   2> 8920 T11 oass.IndexSchema.readSchema unique key field: id
   [junit4]   2> 8955 T11 oass.FileExchangeRateProvider.reload Reloading exchange rates from file currency.xml
   [junit4]   2> 8964 T11 oass.FileExchangeRateProvider.reload Reloading exchange rates from file currency.xml
   [junit4]   2> 9056 T11 oasc.SolrResourceLoader.<init> new SolrResourceLoader for directory: '/mnt/ssd/jenkins/workspace/Lucene-Solr-4.x-Linux/solr/contrib/morphlines-core/src/test-files/solr/collection1/'
   [junit4]   2> 9115 T11 oasc.SolrConfig.initLibs Adding specified lib dirs to ClassLoader
   [junit4]   2> 9116 T11 oasc.SolrResourceLoader.addToClassLoader WARN Can't find (or read) directory to add to classloader: ../../../contrib/extraction/lib (resolved as: /mnt/ssd/jenkins/workspace/Lucene-Solr-4.x-Linux/solr/contrib/morphlines-core/src/test-files/solr/collection1/../../../contrib/extraction/lib).
   [junit4]   2> 9117 T11 oasc.SolrResourceLoader.addToClassLoader WARN Can't find (or read) directory to add to classloader: ../../../dist/ (resolved as: /mnt/ssd/jenkins/workspace/Lucene-Solr-4.x-Linux/solr/contrib/morphlines-core/src/test-files/solr/collection1/../../../dist).
   [junit4]   2> 9117 T11 oasc.SolrResourceLoader.addToClassLoader WARN Can't find (or read) directory to add to classloader: ../../../contrib/clustering/lib/ (resolved as: /mnt/ssd/jenkins/workspace/Lucene-Solr-4.x-Linux/solr/contrib/morphlines-core/src/test-files/solr/collection1/../../../contrib/clustering/lib).
   [junit4]   2> 9118 T11 oasc.SolrResourceLoader.addToClassLoader WARN Can't find (or read) directory to add to classloader: ../../../dist/ (resolved as: /mnt/ssd/jenkins/workspace/Lucene-Solr-4.x-Linux/solr/contrib/morphlines-core/src/test-files/solr/collection1/../../../dist).
   [junit4]   2> 9119 T11 oasc.SolrResourceLoader.addToClassLoader WARN Can't find (or read) directory to add to classloader: ../../../contrib/langid/lib/ (resolved as: /mnt/ssd/jenkins/workspace/Lucene-Solr-4.x-Linux/solr/contrib/morphlines-core/src/test-files/solr/collection1/../../../contrib/langid/lib).
   [junit4]   2> 9120 T11 oasc.SolrResourceLoader.addToClassLoader WARN Can't find (or read) directory to add to classloader: ../../../dist/ (resolved as: /mnt/ssd/jenkins/workspace/Lucene-Solr-4.x-Linux/solr/contrib/morphlines-core/src/test-files/solr/collection1/../../../dist).
   [junit4]   2> 9121 T11 oasc.SolrResourceLoader.addToClassLoader WARN Can't find (or read) directory to add to classloader: ../../../contrib/velocity/lib (resolved as: /mnt/ssd/jenkins/workspace/Lucene-Solr-4.x-Linux/solr/contrib/morphlines-core/src/test-files/solr/collection1/../../../contrib/velocity/lib).
   [junit4]   2> 9121 T11 oasc.SolrResourceLoader.addToClassLoader WARN Can't find (or read) directory to add to classloader: ../../../dist/ (resolved as: /mnt/ssd/jenkins/workspace/Lucene-Solr-4.x-Linux/solr/contrib/morphlines-core/src/test-files/solr/collection1/../../../dist).
   [junit4]   2> 9122 T11 oasc.SolrResourceLoader.addToClassLoader WARN Can't find (or read) directory to add to classloader: /non/existent/dir/yields/warning (resolved as: /non/existent/dir/yields/warning).
   [junit4]   2> 9174 T11 oasc.SolrConfig.<init> Using Lucene MatchVersion: LUCENE_4_10
   [junit4]   2> 9264 T11 oasc.SolrConfig.<init> Loaded SolrConfig: solrconfig.xml
   [junit4]   2> 9265 T11 oass.IndexSchema.readSchema Reading Solr Schema from schema.xml
   [junit4]   2> 9319 T11 oass.IndexSchema.readSchema [null] Schema name=example
   [junit4]   2> 9848 T11 oass.IndexSchema.readSchema unique key field: id
   [junit4]   2> 9883 T11 oass.FileExchangeRateProvider.reload Reloading exchange rates from file currency.xml
   [junit4]   2> 9891 T11 oass.FileExchangeRateProvider.reload Reloading exchange rates from file currency.xml
   [junit4]   2> 9949 T11 oasc.SolrResourceLoader.<init> new SolrResourceLoader for directory: '/mnt/ssd/jenkins/workspace/Lucene-Solr-4.x-Linux/solr/contrib/morphlines-core/src/test-files/solr/collection1/'
   [junit4]   2> 10013 T11 oasc.SolrConfig.initLibs Adding specified lib dirs to ClassLoader
   [junit4]   2> 10014 T11 oasc.SolrResourceLoader.addToClassLoader WARN Can't find (or read) directory to add to classloader: ../../../contrib/extraction/lib (resolved as: /mnt/ssd/jenkins/workspace/Lucene-Solr-4.x-Linux/solr/contrib/morphlines-core/src/test-files/solr/collection1/../../../contrib/extraction/lib).
   [junit4]   2> 10015 T11 oasc.SolrResourceLoader.addToClassLoader WARN Can't find (or read) directory to add to classloader: ../../../dist/ (resolved as: /mnt/ssd/jenkins/workspace/Lucene-Solr-4.x-Linux/solr/contrib/morphlines-core/src/test-files/solr/collection1/../../../dist).
   [junit4]   2> 10016 T11 oasc.SolrResourceLoader.addToClassLoader WARN Can't find (or read) directory to add to classloader: ../../../contrib/clustering/lib/ (resolved as: /mnt/ssd/jenkins/workspace/Lucene-Solr-4.x-Linux/solr/contrib/morphlines-core/src/test-files/solr/collection1/../../../contrib/clustering/lib).
   [junit4]   2> 10017 T11 oasc.SolrResourceLoader.addToClassLoader WARN Can't find (or read) directory to add to classloader: ../../../dist/ (resolved as: /mnt/ssd/jenkins/workspace/Lucene-Solr-4.x-Linux/solr/contrib/morphlines-core/src/test-files/solr/collection1/../../../dist).
   [junit4]   2> 10017 T11 oasc.SolrResourceLoader.addToClassLoader WARN Can't find (or read) directory to add to classloader: ../../../contrib/langid/lib/ (resolved as: /mnt/ssd/jenkins/workspace/Lucene-Solr-4.x-Linux/solr/contrib/morphlines-core/src/test-files/solr/collection1/../../../contrib/langid/lib).
   [junit4]   2> 10021 T11 oasc.SolrResourceLoader.addToClassLoader WARN Can't find (or read) directory to add to classloader: ../../../dist/ (resolved as: /mnt/ssd/jenkins/workspace/Lucene-Solr-4.x-Linux/solr/contrib/morphlines-core/src/test-files/solr/collection1/../../../dist).
   [junit4]   2> 10022 T11 oasc.SolrResourceLoader.addToClassLoader WARN Can't find (or read) directory to add to classloader: ../../../contrib/velocity/lib (resolved as: /mnt/ssd/jenkins/workspace/Lucene-Solr-4.x-Linux/solr/contrib/morphlines-core/src/test-files/solr/collection1/../../../contrib/velocity/lib).
   [junit4]   2> 10023 T11 oasc.SolrResourceLoader.addToClassLoader WARN Can't find (or read) directory to add to classloader: ../../../dist/ (resolved as: /mnt/ssd/jenkins/workspace/Lucene-Solr-4.x-Linux/solr/contrib/morphlines-core/src/test-files/solr/collection1/../../../dist).
   [junit4]   2> 10024 T11 oasc.SolrResourceLoader.addToClassLoader WARN Can't find (or read) directory to add to classloader: /non/existent/dir/yields/warning (resolved as: /non/existent/dir/yields/warning).
   [junit4]   2> 10070 T11 oasc.SolrConfig.<init> Using Lucene MatchVersion: LUCENE_4_10
   [junit4]   2> 10153 T11 oasc.SolrConfig.<init> Loaded SolrConfig: solrconfig.xml
   [junit4]   2> 10154 T11 oass.IndexSchema.readSchema Reading Solr Schema from schema.xml
   [junit4]   2> 10193 T11 oass.IndexSchema.readSchema [null] Schema name=example
   [junit4]   2> 10697 T11 oass.IndexSchema.readSchema unique key field: id
   [junit4]   2> 10731 T11 oass.FileExchangeRateProvider.reload Reloading exchange rates from file currency.xml
   [junit4]   2> 10740 T11 oass.FileExchangeRateProvider.reload Reloading exchange rates from file currency.xml
   [junit4]   2> ASYNC  NEW_CORE C1 name=collection1 org.apache.solr.core.SolrCore@3f03c3
   [junit4]   2> 10792 T11 C1 oasup.LogUpdateProcessor.finish [collection1] webapp=null path=/update params={} {deleteByQuery=*:* (-1474843721632579584)} 0 1
   [junit4]   2> 10793 T11 C1 oasu.DirectUpdateHandler2.commit start commit{,optimize=false,openSearcher=true,waitSearcher=true,expungeDeletes=false,softCommit=false,prepareCommit=false}
   [junit4]   2> 10794 T11 C1 oasu.DirectUpdateHandler2.commit No uncommitted changes. Skipping IW.commit.
   [junit4]   2> 10795 T11 C1 oasc.SolrCore.openNewSearcher SolrIndexSearcher has not changed - not re-opening: org.apache.solr.search.SolrIndexSearcher
   [junit4]   2> 10796 T11 C1 oasu.DirectUpdateHandler2.commit end_commit_flush
   [junit4]   2> 10796 T11 C1 oasup.LogUpdateProcessor.finish [collection1] webapp=null path=/update params={commit=true&softCommit=false&waitSearcher=true} {commit=} 0 3
   [junit4]   2> 11053 T11 C1 oasup.LogUpdateProcessor.finish [collection1] webapp=null path=/update params={} {add=[testXML2.xml#0 (1474843721801400320)]} 0 103
   [junit4]   2> 11059 T11 C1 oasu.DirectUpdateHandler2.commit start commit{,optimize=false,openSearcher=true,waitSearcher=true,expungeDeletes=false,softCommit=true,prepareCommit=false}
   [junit4]   2> 11129 T11 C1 oass.SolrIndexSearcher.<init> Opening Searcher@1aed341[collection1] main
   [junit4]   2> ASYNC  NEW_CORE C2 name=collection1 org.apache.solr.core.SolrCore@3f03c3
   [junit4]   2> 11140 T11 C2 oasu.DirectUpdateHandler2.commit end_commit_flush
   [junit4]   2> 11140 T13 oasc.QuerySenderListener.newSearcher QuerySenderListener sending requests to Searcher@1aed341[collection1] main{StandardDirectoryReader(segments_1:3:nrt _0(4.10):C1)}
   [junit4]   2> 11142 T13 oasc.QuerySenderListener.newSearcher QuerySenderListener done.
   [junit4]   2> 11142 T13 oasc.SolrCore.registerSearcher [collection1] Registered new searcher Searcher@1aed341[collection1] main{StandardDirectoryReader(segments_1:3:nrt _0(4.10):C1)}
   [junit4]   2> 11143 T11 C2 oasup.LogUpdateProcessor.finish [collection1] webapp=null path=/update params={commit=true&softCommit=true&waitSearcher=true} {commit=} 0 84
   [junit4]   2> 11168 T11 C2 oasc.SolrCore.execute [collection1] webapp=null path=/select params={q=*%3A*&rows=2147483647} hits=1 status=0 QTime=18 
   [junit4]   2> 11177 T11 C2 oasu.DirectUpdateHandler2.commit start commit{,optimize=false,openSearcher=true,waitSearcher=true,expungeDeletes=false,softCommit=true,prepareCommit=false}
   [junit4]   2> 11177 T11 C2 oasc.SolrCore.openNewSearcher SolrIndexSearcher has not changed - not re-opening: org.apache.solr.search.SolrIndexSearcher
   [junit4]   2> 11178 T11 C2 oasu.DirectUpdateHandler2.commit end_commit_flush
   [junit4]   2> 11179 T11 C2 oasup.LogUpdateProcessor.finish [collection1] webapp=null path=/update params={commit=true&softCommit=true&waitSearcher=true} {commit=} 0 3
   [junit4]   2> 11180 T11 C2 oasc.SolrCore.execute [collection1] webapp=null path=/select params={q=*%3A*&rows=2147483647} hits=1 status=0 QTime=0 
   [junit4]   2> 11181 T11 oas.SolrTestCaseJ4.tearDown ###Ending testSolrCellXML
   [junit4]   2> 11204 T11 oas.SolrTestCaseJ4.setUp ###Starting testSolrCellJPGCompressed
   [junit4]   2> 11264 T11 C2 oass.SolrIndexSearcher.<init> Opening Searcher@1c84b28[collection1] realtime
   [junit4]   2> 11265 T11 C2 oasup.LogUpdateProcessor.finish [collection1] webapp=null path=/update params={} {deleteByQuery=*:* (-1474843722066690048)} 0 60
   [junit4]   2> 11266 T11 C2 oasu.DirectUpdateHandler2.commit start commit{,optimize=false,openSearcher=true,waitSearcher=true,expungeDeletes=false,softCommit=false,prepareCommit=false}
   [junit4]   2> 11267 T11 C2 oasc.SolrDeletionPolicy.onCommit SolrDeletionPolicy.onCommit: commits: num=2
   [junit4]   2> 		commit{dir=MockDirectoryWrapper(RAMDirectory@16962b1 lockFactory=NativeFSLockFactory@/mnt/ssd/jenkins/workspace/Lucene-Solr-4.x-Linux/solr/build/contrib/solr-morphlines-cell/test/J0/./solr.morphlines.cell.SolrCellMorphlineTest-3064D825784C0F92-001/init-core-data-001/index),segFN=segments_1,generation=1}
   [junit4]   2> 		commit{dir=MockDirectoryWrapper(RAMDirectory@16962b1 lockFactory=NativeFSLockFactory@/mnt/ssd/jenkins/workspace/Lucene-Solr-4.x-Linux/solr/build/contrib/solr-morphlines-cell/test/J0/./solr.morphlines.cell.SolrCellMorphlineTest-3064D825784C0F92-001/init-core-data-001/index),segFN=segments_2,generation=2}
   [junit4]   2> 11267 T11 C2 oasc.SolrDeletionPolicy.updateCommits newest commit generation = 2
   [junit4]   2> 11268 T11 C2 oass.SolrIndexSearcher.<init> Opening Searcher@1665034[collection1] main
   [junit4]   2> 11269 T11 C2 oasu.DirectUpdateHandler2.commit end_commit_flush
   [junit4]   2> 11269 T13 oasc.QuerySenderListener.newSearcher QuerySenderListener sending requests to Searcher@1665034[collection1] main{StandardDirectoryReader(segments_1:5:nrt)}
   [junit4]   2> 11269 T13 oasc.QuerySenderListener.newSearcher QuerySenderListener done.
   [junit4]   2> 11270 T13 oasc.SolrCore.registerSearcher [collection1] Registered new searcher Searcher@1665034[collection1] main{StandardDirectoryReader(segments_1:5:nrt)}
   [junit4]   2> 11271 T11 C2 oasup.LogUpdateProcessor.finish [collection1] webapp=null path=/update params={commit=true&softCommit=false&waitSearcher=true} {commit=} 0 5
   [junit4]   2> 11286 T11 okma.MorphlineContext.importCommandBuilders Importing commands
   [junit4]   2> 11866 T11 okma.MorphlineContext.importCommandBuilders Done importing commands
   [junit4]   2> 14139 T11 oasc.SolrResourceLoader.<init> new SolrResourceLoader for directory: '/mnt/ssd/jenkins/workspace/Lucene-Solr-4.x-Linux/solr/contrib/morphlines-core/src/test-files/solr/collection1/'
   [junit4]   2> 14181 T11 oasc.SolrConfig.initLibs Adding specified lib dirs to ClassLoader
   [junit4]   2> 14182 T11 oasc.SolrResourceLoader.addToClassLoader WARN Can't find (or read) directory to add to classloader: ../../../contrib/extraction/lib (resolved as: /mnt/ssd/jenkins/workspace/Lucene-Solr-4.x-Linux/solr/contrib/morphlines-core/src/test-files/solr/collection1/../../../contrib/extraction/lib).
   [junit4]   2> 14185 T11 oasc.SolrResourceLoader.addToClassLoader WARN Can't find (or read) directory to add to classloader: ../../../dist/ (resolved as: /mnt/ssd/jenkins/workspace/Lucene-Solr-4.x-Linux/solr/contrib/morphlines-core/src/test-files/solr/collection1/../../../dist).
   [junit4]   2> 14187 T11 oasc.SolrResourceLoader.addToClassLoader WARN Can't find (or read) directory to add to classloader: ../../../contrib/clustering/lib/ (resolved as: /mnt/ssd/jenkins/workspace/Lucene-Solr-4.x-Linux/solr/contrib/morphlines-core/src/test-files/solr/collection1/../../../contrib/clustering/lib).
   [junit4]   2> 14190 T11 oasc.SolrResourceLoader.addToClassLoader WARN Can't find (or read) directory to add to classloader: ../../../dist/ (resolved as: /mnt/ssd/jenkins/workspace/Lucene-Solr-4.x-Linux/solr/contrib/morphlines-core/src/test-files/solr/collection1/../../../dist).
   [junit4]   2> 14193 T11 oasc.SolrResourceLoader.addToClassLoader WARN Can't find (or read) directory to add to classloader: ../../../contrib/langid/lib/ (resolved as: /mnt/ssd/jenkins/workspace/Lucene-Solr-4.x-Linux/solr/contrib/morphlines-core/src/test-files/solr/collection1/../../../contrib/langid/lib).
   [junit4]   2> 14195 T11 oasc.SolrResourceLoader.addToClassLoader WARN Can't find (or read) directory to add to classloader: ../../../dist/ (resolved as: /mnt/ssd/jenkins/workspace/Lucene-Solr-4.x-Linux/solr/contrib/morphlines-core/src/test-files/solr/collection1/../../../dist).
   [junit4]   2> 14198 T11 oasc.SolrResourceLoader.addToClassLoader WARN Can't find (or read) directory to add to classloader: ../../../contrib/velocity/lib (resolved as: /mnt/ssd/jenkins/workspace/Lucene-Solr-4.x-Linux/solr/contrib/morphlines-core/src/test-files/solr/collection1/../../../contrib/velocity/lib).
   [junit4]   2> 14201 T11 oasc.SolrResourceLoader.addToClassLoader WARN Can't find (or read) directory to add to classloader: ../../../dist/ (resolved as: /mnt/ssd/jenkins/workspace/Lucene-Solr-4.x-Linux/solr/contrib/morphlines-core/src/test-files/solr/collection1/../../../dist).
   [junit4]   2> 14203 T11 oasc.SolrResourceLoader.addToClassLoader WARN Can't find (or read) directory to add to classloader: /non/existent/dir/yields/warning (resolved as: /non/existent/dir/yields/warning).
   [junit4]   2> 14246 T11 oasc.SolrConfig.<init> Using Lucene MatchVersion: LUCENE_4_10
   [junit4]   2> 14309 T11 oasc.SolrConfig.<init> Loaded SolrConfig: solrconfig.xml
   [junit4]   2> 14311 T11 oass.IndexSchema.readSchema Reading Solr Schema from schema.xml
   [junit4]   2> 14335 T11 oass.IndexSchema.readSchema [null] Schema name=example
   [junit4]   2> 14699 T11 oass.IndexSchema.readSchema unique key field: id
   [junit4]   2> 14721 T11 oass.FileExchangeRateProvider.reload Reloading exchange rates from file currency.xml
   [junit4]   2> 14729 T11 oass.FileExchangeRateProvider.reload Reloading exchange rates from file currency.xml
   [junit4]   2> 14755 T11 oasc.SolrResourceLoader.<init> new SolrResourceLoader for directory: '/mnt/ssd/jenkins/workspace/Lucene-Solr-4.x-Linux/solr/contrib/morphlines-core/src/test-files/solr/collection1/'
   [junit4]   2> 14792 T11 oasc.SolrConfig.initLibs Adding specified lib dirs to ClassLoader
   [junit4]   2> 14793 T11 oasc.SolrResourceLoader.addToClassLoader WARN Can't find (or read) directory to add to classloader: ../../../contrib/extraction/lib (resolved as: /mnt/ssd/jenkins/workspace/Lucene-Solr-4.x-Linux/solr/contrib/morphlines-core/src/test-files/solr/collection1/../../../contrib/extraction/lib).
   [junit4]   2> 14794 T11 oasc.SolrResourceLoader.addToClassLoader WARN Can't find (or read) directory to add to classloader: ../../../dist/ (resolved as: /mnt/ssd/jenkins/workspace/Lucene-Solr-4.x-Linux/solr/contrib/morphlines-core/src/test-files/solr/collection1/../../../dist).
   [junit4]   2> 14794 T11 oasc.SolrResourceLoader.addToClassLoader WARN Can't find (or read) directory to add to classloader: ../../../contrib/clustering/lib/ (resolved as: /mnt/ssd/jenkins/workspace/Lucene-Solr-4.x-Linux/solr/contrib/morphlines-core/src/test-files/solr/collection1/../../../contrib/clustering/lib).
   [junit4]   2> 14795 T11 oasc.SolrResourceLoader.addToClassLoader WARN Can't find (or read) directory to add to classloader: ../../../dist/ (resolved as: /mnt/ssd/jenkins/workspace/Lucene-Solr-4.x-Linux/solr/contrib/morphlines-core/src/test-files/solr/collection1/../../../dist).
   [junit4]   2> 14796 T11 oasc.SolrResourceLoader.addToClassLoader WARN Can't find (or read) directory to add to classloader: ../../../contrib/langid/lib/ (resolved as: /mnt/ssd/jenkins/workspace/Lucene-Solr-4.x-Linux/solr/contrib/morphlines-core/src/test-files/solr/collection1/../../../contrib/langid/lib).
   [junit4]   2> 14797 T11 oasc.SolrResourceLoader.addToClassLoader WARN Can't find (or read) directory to add to classloader: ../../../dist/ (resolved as: /mnt/ssd/jenkins/workspace/Lucene-Solr-4.x-Linux/solr/contrib/morphlines-core/src/test-files/solr/collection1/../../../dist).
   [junit4]   2> 14797 T11 oasc.SolrResourceLoader.addToClassLoader WARN Can't find (or read) directory to add to classloader: ../../../contrib/velocity/lib (resolved as: /mnt/ssd/jenkins/workspace/Lucene-Solr-4.x-Linux/solr/contrib/morphlines-core/src/test-files/solr/collection1/../../../contrib/velocity/lib).
   [junit4]   2> 14798 T11 oasc.SolrResourceLoader.addToClassLoader WARN Can't find (or read) directory to add to classloader: ../../../dist/ (resolved as: /mnt/ssd/jenkins/workspace/Lucene-Solr-4.x-Linux/solr/contrib/morphlines-core/src/test-files/solr/collection1/../../../dist).
   [junit4]   2> 14799 T11 oasc.SolrResourceLoader.addToClassLoader WARN Can't find (or read) directory to add to classloader: /non/existent/dir/yields/warning (resolved as: /non/existent/dir/yields/warning).
   [junit4]   2> 14843 T11 oasc.SolrConfig.<init> Using Lucene MatchVersion: LUCENE_4_10
   [junit4]   2> 14902 T11 oasc.SolrConfig.<init> Loaded SolrConfig: solrconfig.xml
   [junit4]   2> 14903 T11 oass.IndexSchema.readSchema Reading Solr Schema from schema.xml
   [junit4]   2> 14920 T11 oass.IndexSchema.readSchema [null] Schema name=example
   [junit4]   2> 15292 T11 oass.IndexSchema.readSchema unique key field: id
   [junit4]   2> 15315 T11 oass.FileExchangeRateProvider.reload Reloading exchange rates from file currency.xml
   [junit4]   2> 15320 T11 oass.FileExchangeRateProvider.reload Reloading exchange rates from file currency.xml
   [junit4]   2> ASYNC  NEW_CORE C3 name=collection1 org.apache.solr.core.SolrCore@3f03c3
   [junit4]   2> 15343 T11 C3 oasup.LogUpdateProcessor.finish [collection1] webapp=null path=/update params={} {deleteByQuery=*:* (-1474843726404648960)} 0 1
   [junit4]   2> 15344 T11 C3 oasu.DirectUpdateHandler2.commit start commit{,optimize=false,openSearcher=true,waitSearcher=true,expungeDeletes=false,softCommit=false,prepareCommit=false}
   [junit4]   2> 15344 T11 C3 oasu.DirectUpdateHandler2.commit No uncommitted changes. Skipping IW.commit.
   [junit4]   2> 15345 T11 C3 oasc.SolrCore.openNewSearcher SolrIndexSearcher has not changed - not re-opening: org.apache.solr.search.SolrIndexSearcher
   [junit4]   2> 15345 T11 C3 oasu.DirectUpdateHandler2.commit end_commit_flush
   [junit4]   2> 15346 T11 C3 oasup.LogUpdateProcessor.finish [collection1] webapp=null path=/update params={commit=true&softCommit=false&waitSearcher=true} {commit=} 0 2
   [junit4]   2> 15615 T11 C3 oasup.LogUpdateProcessor.finish [collection1] webapp=null path=/update params={} {add=[testJPEG_EXIF.jpg#0 (1474843726681473024)]} 0 12
   [junit4]   2> 15616 T11 C3 oasu.DirectUpdateHandler2.commit start commit{,optimize=false,openSearcher=true,waitSearcher=true,expungeDeletes=false,softCommit=true,prepareCommit=false}
   [junit4]   2> 15632 T11 C3 oass.SolrIndexSearcher.<init> Opening Searcher@758b15[collection1] main
   [junit4]   2> 15633 T11 C3 oasu.DirectUpdateHandler2.commit end_commit_flush
   [junit4]   2> 15633 T13 oasc.QuerySenderListener.newSearcher QuerySenderListener sending requests to Searcher@758b15[collection1] main{StandardDirectoryReader(segments_2:7:nrt _1(4.10):C1)}
   [junit4]   2> 15634 T13 oasc.QuerySenderListener.newSearcher QuerySenderListener done.
   [junit4]   2> 15634 T13 oasc.SolrCore.registerSearcher [collection1] Registered new searcher Searcher@758b15[collection1] main{StandardDirectoryReader(segments_2:7:nrt _1(4.10):C1)}
   [junit4]   2> 15635 T11 C3 oasup.LogUpdateProcessor.finish [collection1] webapp=null path=/update params={commit=true&softCommit=true&waitSearcher=true} {commit=} 0 19
   [junit4]   2> 15635 T11 C3 oasc.SolrCore.execute [collection1] webapp=null path=/select params={q=*%3A*&rows=2147483647} hits=1 status=0 QTime=0 
   [junit4]   2> 15665 T11 C3 oasup.LogUpdateProcessor.finish [collection1] webapp=null path=/update params={} {add=[testJPEG_EXIF.jpg.gz#0 (1474843726741241856)]} 0 7
   [junit4]   2> 15666 T11 C3 oasu.DirectUpdateHandler2.commit start commit{,optimize=false,openSearcher=true,waitSearcher=true,expungeDeletes=false,softCommit=true,prepareCommit=false}
   [junit4]   2> 15677 T11 C3 oass.SolrIndexSearcher.<init> Opening Searcher@14514d7[collection1] main
   [junit4]   2> 15678 T11 C3 oasu.DirectUpdateHandler2.commit end_commit_flush
   [junit4]   2> 15678 T13 oasc.QuerySenderListener.newSearcher QuerySenderListener sending requests to Searcher@14514d7[collection1] main{StandardDirectoryReader(segments_2:9:nrt _1(4.10):C1 _2(4.10):C1)}
   [junit4]   2> 15679 T13 oasc.QuerySenderListener.newSearcher QuerySenderListener done.
   [junit4]   2> 15680 T13 oasc.SolrCore.registerSearcher [collection1] Registered new searcher Searcher@14514d7[collection1] main{StandardDirectoryReader(segments_2:9:nrt _1(4.10):C1 _2(4.10):C1)}
   [junit4]   2> 15681 T11 C3 oasup.LogUpdateProcessor.finish [collection1] webapp=null path=/update params={commit=true&softCommit=true&waitSearcher=true} {commit=} 0 15
   [junit4]   2> 15682 T11 C3 oasc.SolrCore.execute [collection1] webapp=null path=/select params={q=*%3A*&rows=2147483647} hits=2 status=0 QTime=0 
   [junit4]   2> 15712 T11 C3 oasup.LogUpdateProcessor.finish [collection1] webapp=null path=/update params={} {add=[143ae7d6-1aa5-410f-91e3-96b02fd0a18c#0 (1474843726790524928)]} 0 5
   [junit4]   2> 15713 T11 C3 oasu.DirectUpdateHandler2.commit start commit{,optimize=false,openSearcher=true,waitSearcher=true,expungeDeletes=false,softCommit=true,prepareCommit=false}
   [junit4]   2> ASYNC  NEW_CORE C4 name=collection1 org.apache.solr.core.SolrCore@3f03c3
   [junit4]   2> 15724 T11 C4 oass.SolrIndexSearcher.<init> Opening Searcher@51cf6a[collection1] main
   [junit4]   2> 15725 T11 C4 oasu.DirectUpdateHandler2.commit end_commit_flush
   [junit4]   2> 15725 T13 oasc.QuerySenderListener.newSearcher QuerySenderListener sending requests to Searcher@51cf6a[collection1] main{StandardDirectoryReader(segments_2:11:nrt _1(4.10):C1 _2(4.10):C1 _3(4.10):C1)}
   [junit4]   2> 15726 T13 oasc.QuerySenderListener.newSearcher QuerySenderListener done.
   [junit4]   2> 15726 T13 oasc.SolrCore.registerSearcher [collection1] Registered new searcher Searcher@51cf6a[collection1] main{StandardDirectoryReader(segments_2:11:nrt _1(4.10):C1 _2(4.10):C1 _3(4.10):C1)}
   [junit4]   2> 15727 T11 C4 oasup.LogUpdateProcessor.finish [collection1] webapp=null path=/update params={commit=true&softCommit=true&waitSearcher=true} {commit=} 0 14
   [junit4]   2> 15728 T11 C4 oasc.SolrCore.execute [collection1] webapp=null path=/select params={q=*%3A*&rows=2147483647} hits=3 status=0 QTime=1 
   [junit4]   2> 15728 T11 C4 oasu.DirectUpdateHandler2.commit start commit{,optimize=false,openSearcher=true,waitSearcher=true,expungeDeletes=false,softCommit=true,prepareCommit=false}
   [junit4]   2> 15729 T11 C4 oasc.SolrCore.openNewSearcher SolrIndexSearcher has not changed - not re-opening: org.apache.solr.search.SolrIndexSearcher
   [junit4]   2> 15729 T11 C4 oasu.DirectUpdateHandler2.commit end_commit_flush
   [junit4]   2> 15730 T11 C4 oasup.LogUpdateProcessor.finish [collection1] webapp=null path=/update params={commit=true&softCommit=true&waitSearcher=true} {commit=} 0 2
   [junit4]   2> 15731 T11 C4 oasc.SolrCore.execute [collection1] webapp=null path=/select params={q=*%3A*&rows=2147483647} hits=3 status=0 QTime=0 
   [junit4]   2> 15731 T11 oas.SolrTestCaseJ4.tearDown ###Ending testSolrCellJPGCompressed
   [junit4]   2> 15743 T11 oas.SolrTestCaseJ4.setUp ###Starting testSolrCellDocumentTypes2
   [junit4]   2> 15745 T11 C4 oass.SolrIndexSearcher.<init> Opening Searcher@18f9516[collection1] realtime
   [junit4]   2> 15745 T11 C4 oasup.LogUpdateProcessor.finish [collection1] webapp=null path=/update params={} {deleteByQuery=*:* (-1474843726825127936)} 0 2
   [junit4]   2> 15746 T11 C4 oasu.DirectUpdateHandler2.commit start commit{,optimize=false,openSearcher=true,waitSearcher=true,expungeDeletes=false,softCommit=false,prepareCommit=false}
   [junit4]   2> 15747 T11 C4 oasc.SolrDeletionPolicy.onCommit SolrDeletionPolicy.onCommit: commits: num=2
   [junit4]   2> 		commit{dir=MockDirectoryWrapper(RAMDirectory@16962b1 lockFactory=NativeFSLockFactory@/mnt/ssd/jenkins/workspace/Lucene-Solr-4.x-Linux/solr/build/contrib/solr-morphlines-cell/test/J0/./solr.morphlines.cell.SolrCellMorphlineTest-3064D825784C0F92-001/init-core-data-001/index),segFN=segments_2,generation=2}
   [junit4]   2> 		commit{dir=MockDirectoryWrapper(RAMDirectory@16962b1 lockFactory=NativeFSLockFactory@/mnt/ssd/jenkins/workspace/Lucene-Solr-4.x-Linux/solr/build/contrib/solr-morphlines-cell/test/J0/./solr.morphlines.cell.SolrCellMorphlineTest-3064D825784C0F92-001/init-core-data-001/index),segFN=segments_3,generation=3}
   [junit4]   2> 15747 T11 C4 oasc.SolrDeletionPolicy.updateCommits newest commit generation = 3
   [junit4]   2> 15748 T11 C4 oass.SolrIndexSearcher.<init> Opening Searcher@1a66aba[collection1] main
   [junit4]   2> 15748 T11 C4 oasu.DirectUpdateHandler2.commit end_commit_flush
   [junit4]   2> 15748 T13 oasc.QuerySenderListener.newSearcher QuerySenderListener sending requests to Searcher@1a66aba[collection1] main{StandardDirectoryReader(segments_2:13:nrt)}
   [junit4]   2> 15749 T13 oasc.QuerySenderListener.newSearcher QuerySenderListener done.
   [junit4]   2> 15750 T13 oasc.SolrCore.registerSearcher [collection1] Registered new searcher Searcher@1a66aba[collection1] main{StandardDirectoryReader(segments_2:13:nrt)}
   [junit4]   2> 15752 T11 C4 oasup.LogUpdateProcessor.finish [collection1] webapp=null path=/update params={commit=true&softCommit=false&waitSearcher=true} {commit=} 0 6
   [junit4]   2> 15787 T11 okma.MorphlineContext.importCommandBuilders Importing commands
   [junit4]   2> 16314 T11 okma.MorphlineContext.importCommandBuilders Done importing commands
   [junit4]   2> 17025 T11 oasc.SolrResourceLoader.<init> new SolrResourceLoader for directory: '/mnt/ssd/jenkins/workspace/Lucene-Solr-4.x-Linux/solr/contrib/morphlines-core/src/test-files/solr/collection1/'
   [junit4]   2> 17090 T11 oasc.SolrConfig.initLibs Adding specified lib dirs to ClassLoader
   [junit4]   2> 17091 T11 oasc.SolrResourceLoader.addToClassLoader WARN Can't find (or read) directory to add to classloader: ../../../contrib/extraction/lib (resolved as: /mnt/ssd/jenkins/workspace/Lucene-Solr-4.x-Linux/solr/contrib/morphlines-core/src/test-files/solr/collection1/../../../contrib/extraction/lib).
   [junit4]   2> 17092 T11 oasc.SolrResourceLoader.addToClassLoader WARN Can't find (or read) directory to add to classloader: ../../../dist/ (resolved as: /mnt/ssd/jenkins/workspace/Lucene-Solr-4.x-Linux/solr/contrib/morphlines-core/src/test-files/solr/collection1/../../../dist).
   [junit4]   2> 17093 T11 oasc.SolrResourceLoader.addToClassLoader WARN Can't find (or read) directory to add to classloader: ../../../contrib/clustering/lib/ (resolved as: /mnt/ssd/jenkins/workspace/Lucene-Solr-4.x-Linux/solr/contrib/morphlines-core/src/test-files/solr/collection1/../../../contrib/clustering/lib).
   [junit4]   2> 17094 T11 oasc.SolrResourceLoader.addToClassLoader WARN Can't find (or read) directory to add to classloader: ../../../dist/ (resolved as: /mnt/ssd/jenkins/workspace/Lucene-Solr-4.x-Linux/solr/contrib/morphlines-core/src/test-files/solr/collection1/../../../dist).
   [junit4]   2> 17094 T11 oasc.SolrResourceLoader.addToClassLoader WARN Can't find (or read) directory to add to classloader: ../../../contrib/langid/lib/ (resolved as: /mnt/ssd/jenkins/workspace/Lucene-Solr-4.x-Linux/solr/contrib/morphlines-core/src/test-files/solr/collection1/../../../contrib/langid/lib).
   [junit4]   2> 17095 T11 oasc.SolrResourceLoader.addToClassLoader WARN Can't find (or read) directory to add to classloader: ../../../dist/ (resolved as: /mnt/ssd/jenkins/workspace/Lucene-Solr-4.x-Linux/solr/contrib/morphlines-core/src/test-files/solr/collection1/../../../dist).
   [junit4]   2> 17096 T11 oasc.SolrResourceLoader.addToClassLoader WARN Can't find (or read) directory to add to classloader: ../../../contrib/velocity/lib (resolved as: /mnt/ssd/jenkins/workspace/Lucene-Solr-4.x-Linux/solr/contrib/morphlines-core/src/test-files/solr/collection1/../../../contrib/velocity/lib).
   [junit4]   2> 17097 T11 oasc.SolrResourceLoader.addToClassLoader WARN Can't find (or read) directory to add to classloader: ../../../dist/ (resolved as: /mnt/ssd/jenkins/workspace/Lucene-Solr-4.x-Linux/solr/contrib/morphlines-core/src/test-files/solr/collection1/../../../dist).
   [junit4]   2> 17097 T11 oasc.SolrResourceLoader.addToClassLoader WARN Can't find (or read) directory to add to classloader: /non/existent/dir/yields/warning (resolved as: /non/existent/dir/yields/warning).
   [junit4]   2> 17146 T11 oasc.SolrConfig.<init> Using Lucene MatchVersion: LUCENE_4_10
   [junit4]   2> 17242 T11 oasc.SolrConfig.<init> Loaded SolrConfig: solrconfig.xml
   [junit4]   2> 17244 T11 oass.IndexSchema.readSchema Reading Solr Schema from schema.xml
   [junit4]   2> 17271 T11 oass.IndexSchema.readSchema [null] Schema name=example
   [junit4]   2> 17819 T11 oass.IndexSchema.readSchema unique key field: id
   [junit4]   2> 17846 T11 oass.FileExchangeRateProvider.reload Reloading exchange rates from file currency.xml
   [junit4]   2> 17853 T11 oass.FileExchangeRateProvider.reload Reloading exchange rates from file currency.xml
   [junit4]   2> 17894 T11 oasc.SolrResourceLoader.<init> new SolrResourceLoader for directory: '/mnt/ssd/jenkins/workspace/Lucene-Solr-4.x-Linux/solr/contrib/morphlines-core/src/test-files/solr/collection1/'
   [junit4]   2> 17938 T11 oasc.SolrConfig.initLibs Adding specified lib dirs to ClassLoader
   [junit4]   2> 17939 T11 oasc.SolrResourceLoader.addToClassLoader WARN Can't find (or read) directory to add to classloader: ../../../contrib/extraction/lib (resolved as: /mnt/ssd/jenkins/workspace/Lucene-Solr-4.x-Linux/solr/contrib/morphlines-core/src/test-files/solr/collection1/../../../contrib/extraction/lib).
   [junit4]   2> 17940 T11 oasc.SolrResourceLoader.addToClassLoader WARN Can't find (or read) directory to add to classloader: ../../../dist/ (resolved as: /mnt/ssd/jenkins/workspace/Lucene-Solr-4.x-Linux/solr/contrib/morphlines-core/src/test-files/solr/collection1/../../../dist).
   [junit4]   2> 17941 T11 oasc.SolrResourceLoader.addToClassLoader WARN Can't find (or read) directory to add to classloader: ../../../contrib/clustering/lib/ (resolved as: /mnt/ssd/jenkins/workspace/Lucene-Solr-4.x-Linux/solr/contrib/morphlines-core/src/test-files/solr/collection1/../../../contrib/clustering/lib).
   [junit4]   2> 17946 T11 oasc.SolrResourceLoader.addToClassLoader WARN Can't find (or read) directory to add to classloader: ../../../dist/ (resolved as: /mnt/ssd/jenkins/workspace/Lucene-Solr-4.x-Linux/solr/contrib/morphlines-core/src/test-files/solr/collection1/../../../dist).
   [junit4]   2> 17947 T11 oasc.SolrResourceLoader.addToClassLoader WARN Can't find (or read) directory to add to classloader: ../../../contrib/langid/lib/ (resolved as: /mnt/ssd/jenkins/workspace/Lucene-Solr-4.x-Linux/solr/contrib/morphlines-core/src/test-files/solr/collection1/../../../contrib/langid/lib).
   [junit4]   2> 17947 T11 oasc.SolrResourceLoader.addToClassLoader WARN Can't find (or read) directory to add to classloader: ../../../dist/ (resolved as: /mnt/ssd/jenkins/workspace/Lucene-Solr-4.x-Linux/solr/contrib/morphlines-core/src/test-files/solr/collection1/../../../dist).
   [junit4]   2> 17948 T11 oasc.SolrResourceLoader.addToClassLoader WARN Can't find (or read) directory to add to classloader: ../../../contrib/velocity/lib (resolved as: /mnt/ssd/jenkins/workspace/Lucene-Solr-4.x-Linux/solr/contrib/morphlines-core/src/test-files/solr/collection1/../../../contrib/velocity/lib).
   [junit4]   2> 17949 T11 oasc.SolrResourceLoader.addToClassLoader WARN Can't find (or read) directory to add to classloader: ../../../dist/ (resolved as: /mnt/ssd/jenkins/workspace/Lucene-Solr-4.x-Linux/solr/contrib/morphlines-core/src/test-files/solr/collection1/../../../dist).
   [junit4]   2> 17949 T11 oasc.SolrResourceLoader.addToClassLoader WARN Can't find (or read) directory to add to classloader: /non/existent/dir/yields/warning (resolved as: /non/existent/dir/yields/warning).
   [junit4]   2> 17992 T11 oasc.SolrConfig.<init> Using Lucene MatchVersion: LUCENE_4_10
   [junit4]   2> 18072 T11 oasc.SolrConfig.<init> Loaded SolrConfig: solrconfig.xml
   [junit4]   2> 18073 T11 oass.IndexSchema.readSchema Reading Solr Schema from schema.xml
   [junit4]   2> 18090 T11 oass.IndexSchema.readSchema [null] Schema name=example
   [junit4]   2> 18441 T11 oass.IndexSchema.readSchema unique key field: id
   [junit4]   2> 18470 T11 oass.FileExchangeRateProvider.reload Reloading exchange rates from file currency.xml
   [junit4]   2> 18475 T11 oass.FileExchangeRateProvider.reload Reloading exchange rates from file currency.xml
   [junit4]   2> 19118 T11 oasc.SolrResourceLoader.<init> new SolrResourceLoader for directory: '/mnt/ssd/jenkins/workspace/Lucene-Solr-4.x-Linux/solr/contrib/morphlines-core/src/test-files/solr/collection1/'
   [junit4]   2> 19153 T11 oasc.SolrConfig.initLibs Adding specified lib dirs to ClassLoader
   [junit4]   2> 19154 T11 oasc.SolrResourceLoader.addToClassLoader WARN Can't find (or read) directory to add to classloader: ../../../contrib/extraction/lib (resolved as: /mnt/ssd/jenkins/workspace/Lucene-Solr-4.x-Linux/solr/contrib/morphlines-core/src/test-files/solr/collection1/../../../contrib/extraction/lib).
   [junit4]   2> 19154 T11 oasc.SolrResourceLoader.addToClassLoader WARN Can't find (or read) directory to add to classloader: ../../../dist/ (resolved as: /mnt/ssd/jenkins/workspace/Lucene-Solr-4.x-Linux/solr/contrib/morphlines-core/src/test-files/solr/collection1/../../../dist).
   [junit4]   2> 19155 T11 oasc.SolrResourceLoader.addToClassLoader WARN Can't find (or read) directory to add to classloader: ../../../contrib/clustering/lib/ (resolved as: /mnt/ssd/jenkins/workspace/Lucene-Solr-4.x-Linux/solr/contrib/morphlines-core/src/test-files/solr/collection1/../../../contrib/clustering/lib).
   [junit4]   2> 19155 T11 oasc.SolrResourceLoader.addToClassLoader WARN Can't find (or read) directory to add to classloader: ../../../dist/ (resolved as: /mnt/ssd/jenkins/workspace/Lucene-Solr-4.x-Linux/solr/contrib/morphlines-core/src/test-files/solr/collection1/../../../dist).
   [junit4]   2> 19156 T11 oasc.SolrResourceLoader.addToClassLoader WARN Can't find (or read) directory to add to classloader: ../../../contrib/langid/lib/ (resolved as: /mnt/ssd/jenkins/workspace/Lucene-Solr-4.x-Linux/solr/contrib/morphlines-core/src/test-files/solr/collection1/../../../contrib/langid/lib).
   [junit4]   2> 19156 T11 oasc.SolrResourceLoader.addToClassLoader WARN Can't find (or read) directory to add to classloader: ../../../dist/ (resolved as: /mnt/ssd/jenkins/workspace/Lucene-Solr-4.x-Linux/solr/contrib/morphlines-core/src/test-files/solr/collection1/../../../dist).
   [junit4]   2> 19157 T11 oasc.SolrResourceLoader.addToClassLoader WARN Can't find (or read) directory to add to classloader: ../../../contrib/velocity/lib (resolved as: /mnt/ssd/jenkins/workspace/Lucene-Solr-4.x-Linux/solr/contrib/morphlines-core/src/test-files/solr/collection1/../../../contrib/velocity/lib).
   [junit4]   2> 19157 T11 oasc.SolrResourceLoader.addToClassLoader WARN Can't find (or read) directory to add to classloader: ../../../dist/ (resolved as: /mnt/ssd/jenkins/workspace/Lucene-Solr-4.x-Linux/solr/contrib/morphlines-core/src/test-files/solr/collection1/../../../dist).
   [junit4]   2> 19158 T11 oasc.SolrResourceLoader.addToClassLoader WARN Can't find (or read) directory to add to classloader: /non/existent/dir/yields/warning (resolved as: /non/existent/dir/yields/warning).
   [junit4]   2> 19194 T11 oasc.SolrConfig.<init> Using Lucene MatchVersion: LUCENE_4_10
   [junit4]   2> 19249 T11 oasc.SolrConfig.<init> Loaded SolrConfig: solrconfig.xml
   [junit4]   2> 19250 T11 oass.IndexSchema.readSchema Reading Solr Schema from schema.xml
   [junit4]   2> 19264 T11 oass.IndexSchema.readSchema [null] Schema name=example
   [junit4]   2> 19608 T11 oass.IndexSchema.readSchema unique key field: id
   [junit4]   2> 19629 T11 oass.FileExchangeRateProvider.reload Reloading exchange rates from file currency.xml
   [junit4]   2> 19633 T11 oass.FileExchangeRateProvider.reload Reloading exchange rates from file currency.xml
   [junit4]   2> 19652 T11 oasc.SolrResourceLoader.<init> new SolrResourceLoader for directory: '/mnt/ssd/jenkins/workspace/Lucene-Solr-4.x-Linux/solr/contrib/morphlines-core/src/test-files/solr/collection1/'
   [junit4]   2> 19681 T11 oasc.SolrConfig.initLibs Adding specified lib dirs to ClassLoader
   [junit4]   2> 19682 T11 oasc.SolrResourceLoader.addToClassLoader WARN Can't find (or read) directory to add to classloader: ../../../contrib/extraction/lib (resolved as: /mnt/ssd/jenkins/workspace/Lucene-Solr-4.x-Linux/solr/contrib/morphlines-core/src/test-files/solr/collection1/../../../contrib/extraction/lib).
   [junit4]   2> 19683 T11 oasc.SolrResourceLoader.addToClassLoader WARN Can't find (or read) directory to add to classloader: ../../../dist/ (resolved as: /mnt/ssd/jenkins/workspace/Lucene-Solr-4.x-Linux/solr/contrib/morphlines-core/src/test-files/solr/collection1/../../../dist).
   [junit4]   2> 19683 T11 oasc.SolrResourceLoader.addToClassLoader WARN Can't find (or read) directory to add to classloader: ../../../contrib/clustering/lib/ (resolved as: /mnt/ssd/jenkins/workspace/Lucene-Solr-4.x-Linux/solr/contrib/morphlines-core/src/test-files/solr/collection1/../../../contrib/clustering/lib).
   [junit4]   2> 19684 T11 oasc.SolrResourceLoader.addToClassLoader WARN Can't find (or read) directory to add to classloader: ../../../dist/ (resolved as: /mnt/ssd/jenkins/workspace/Lucene-Solr-4.x-Linux/solr/contrib/morphlines-core/src/test-files/solr/collection1/../../../dist).
   [junit4]   2> 19685 T11 oasc.SolrResourceLoader.addToClassLoader WARN Can't find (or read) directory to add to classloader: ../../../contrib/langid/lib/ (resolved as: /mnt/ssd/jenkins/workspace/Lucene-Solr-4.x-Linux/solr/contrib/morphlines-core/src/test-files/solr/collection1/../../../contrib/langid/lib).
   [junit4]   2> 19685 T11 oasc.SolrResourceLoader.addToClassLoader WARN Can't find (or read) directory to add to classloader: ../../../dist/ (resolved as: /mnt/ssd/jenkins/workspace/Lucene-Solr-4.x-Linux/solr/contrib/morphlines-core/src/test-files/solr/collection1/../../../dist).
   [junit4]   2> 19686 T11 oasc.SolrResourceLoader.addToClassLoader WARN Can't find (or read) directory to add to classloader: ../../../contrib/velocity/lib (resolved as: /mnt/ssd/jenkins/workspace/Lucene-Solr-4.x-Linux/solr/contrib/morphlines-core/src/test-files/solr/collection1/../../../contrib/velocity/lib).
   [junit4]   2> 19687 T11 oasc.SolrResourceLoader.addToClassLoader WARN Can't find (or read) directory to add to classloader: ../../../dist/ (resolved as: /mnt/ssd/jenkins/workspace/Lucene-Solr-4.x-Linux/solr/contrib/morphlines-core/src/test-files/solr/collection1/../../../dist).
   [junit4]   2> 19687 T11 oasc.SolrResourceLoader.addToClassLoader WARN Can't find (or read) directory to add to classloader: /non/existent/dir/yields/warning (resolved as: /non/existent/dir/yields/warning).
   [junit4]   2> 19724 T11 oasc.SolrConfig.<init> Using Lucene MatchVersion: LUCENE_4_10
   [junit4]   2> 19779 T11 oasc.SolrConfig.<init> Loaded SolrConfig: solrconfig.xml
   [junit4]   2> 19780 T11 oass.IndexSchema.readSchema Reading Solr Schema from schema.xml
   [junit4]   2> 19789 T11 oass.IndexSchema.readSchema [null] Schema name=example
   [junit4]   2> 20263 T11 oass.IndexSchema.readSchema unique key field: id
   [junit4]   2> 20293 T11 oass.FileExchangeRateProvider.reload Reloading exchange rates from file currency.xml
   [junit4]   2> 20299 T11 oass.FileExchangeRateProvider.reload Reloading exchange rates from file currency.xml
   [junit4]   2> 20547 T11 oasc.SolrResourceLoader.<init> new SolrResourceLoader for directory: '/mnt/ssd/jenkins/workspace/Lucene-Solr-4.x-Linux/solr/contrib/morphlines-core/src/test-files/solr/collection1/'
   [junit4]   2> 20574 T11 oasc.SolrConfig.initLibs Adding specified lib dirs to ClassLoader
   [junit4]   2> 20575 T11 oasc.SolrResourceLoader.addToClassLoader WARN Can't find (or read) directory to add to classloader: ../../../contrib/extraction/lib (resolved as: /mnt/ssd/jenkins/workspace/Lucene-Solr-4.x-Linux/solr/contrib/morphlines-core/src/test-files/solr/collection1/../../../contrib/extraction/lib).
   [junit4]   2> 20575 T11 oasc.SolrResourceLoader.addToClassLoader WARN Can't find (or read) directory to add to classloader: ../../../dist/ (resolved as: /mnt/ssd/jenkins/workspace/Lucene-Solr-4.x-Linux/solr/contrib/morphlines-core/src/test-files/solr/collection1/../../../dist).
   [junit4]   2> 20576 T11 oasc.SolrResourceLoader.addToClassLoader WARN Can't find (or read) directory to add to classloader: ../../../contrib/clustering/lib/ (resolved as: /mnt/ssd/jenkins/workspace/Lucene-Solr-4.x-Linux/solr/contrib/morphlines-core/src/test-files/solr/collection1/../../../contrib/clustering/lib).
   [junit4]   2> 20576 T11 oasc.SolrResourceLoader.addToClassLoader WARN Can't find (or read) directory to add to classloader: ../../../dist/ (resolved as: /mnt/ssd/jenkins/workspace/Lucene-Solr-4.x-Linux/solr/contrib/morphlines-core/src/test-files/solr/collection1/../../../dist).
   [junit4]   2> 20577 T11 oasc.SolrResourceLoader.addToClassLoader WARN Can't find (or read) directory to add to classloader: ../../../contrib/langid/lib/ (resolved as: /mnt/ssd/jenkins/workspace/Lucene-Solr-4.x-Linux/solr/contrib/morphlines-core/src/test-files/solr/collection1/../../../contrib/langid/lib).
   [junit4]   2> 20577 T11 oasc.SolrResourceLoader.addToClassLoader WARN Can't find (or read) directory to add to classloader: ../../../dist/ (resolved as: /mnt/ssd/jenkins/workspace/Lucene-Solr-4.x-Linux/solr/contrib/morphlines-core/src/test-files/solr/collection1/../../../dist).
   [junit4]   2> 20578 T11 oasc.SolrResourceLoader.addToClassLoader WARN Can't find (or read) directory to add to classloader: ../../../contrib/velocity/lib (resolved as: /mnt/ssd/jenkins/workspace/Lucene-Solr-4.x-Linux/solr/contrib/morphlines-core/src/test-files/solr/collection1/../../../contrib/velocity/lib).
   [junit4]   2> 20578 T11 oasc.SolrResourceLoader.addToClassLoader WARN Can't find (or read) directory to add to classloader: ../../../dist/ (resolved as: /mnt/ssd/jenkins/workspace/Lucene-Solr-4.x-Linux/solr/contrib/morphlines-core/src/test-files/solr/collection1/../../../dist).
   [junit4]   2> 20579 T11 oasc.SolrResourceLoader.addToClassLoader WARN Can't find (or read) directory to add to classloader: /non/existent/dir/yields/warning (resolved as: /non/existent/dir/yields/warning).
   [junit4]   2> 20616 T11 oasc.SolrConfig.<init> Using Lucene MatchVersion: LUCENE_4_10
   [junit4]   2> 20686 T11 oasc.SolrConfig.<init> Loaded SolrConfig: solrconfig.xml
   [junit4]   2> 20687 T11 oass.IndexSchema.readSchema Reading Solr Schema from schema.xml
   [junit4]   2> 20696 T11 oass.IndexSchema.readSchema [null] Schema name=example
   [junit4]   2> 21019 T11 oass.IndexSchema.readSchema unique key field: id
   [junit4]   2> 21043 T11 oass.FileExchangeRateProvider.reload Reloading exchange rates from file currency.xml
   [junit4]   2> 21049 T11 oass.FileExchangeRateProvider.reload Reloading exchange rates from file currency.xml
   [junit4]   2> ASYNC  NEW_CORE C5 name=collection1 org.apache.solr.core.SolrCore@3f03c3
   [junit4]   2> 21075 T11 C5 oasup.LogUpdateProcessor.finish [collection1] webapp=null path=/update params={} {deleteByQuery=*:* (-1474843732415086592)} 0 1
   [junit4]   2> 21076 T11 C5 oasu.DirectUpdateHandler2.commit start commit{,optimize=false,openSearcher=true,waitSearcher=true,expungeDeletes=false,softCommit=false,prepareCommit=false}
   [junit4]   2> 21077 T11 C5 oasu.DirectUpdateHandler2.commit No uncommitted changes. Skipping IW.commit.
   [junit4]   2> 21077 T11 C5 oasc.SolrCore.openNewSearcher SolrIndexSearcher has not changed - not re-opening: org.apache.solr.search.SolrIndexSearcher
   [junit4]   2> 21077 T11 C5 oasu.DirectUpdateHandler2.commit end_commit_flush
   [junit4]   2> 21078 T11 C5 oasup.LogUpdateProcessor.finish [collection1] webapp=null path=/update params={commit=true&softCommit=false&waitSearcher=true} {commit=} 0 2
   [junit4]   2> ASYNC  NEW_CORE C6 name=collection1 org.apache.solr.core.SolrCore@3f03c3
   [junit4]   2> 21661 T11 C6 oasup.LogUpdateProcessor.finish [collection1] webapp=null path=/update params={} {add=[testPPT_various.ppt#0 (1474843733022212096)]} 0 9
   [junit4]   2> 21662 T11 C6 oasu.DirectUpdateHandler2.commit start commit{,optimize=false,openSearcher=true,waitSearcher=true,expungeDeletes=false,softCommit=true,prepareCommit=false}
   [junit4]   2> 21673 T11 C6 oass.SolrIndexSearcher.<init> Opening Searcher@1e6a33b[collection1] main
   [junit4]   2> 21674 T11 C6 oasu.DirectUpdateHandler2.commit end_commit_flush
   [junit4]   2> 21675 T13 oasc.QuerySenderListener.newSearcher QuerySenderListener sending requests to Searcher@1e6a33b[collection1] main{StandardDirectoryReader(segments_3:15:nrt _4(4.10):C1)}
   [junit4]   2> 21675 T13 oasc.QuerySenderListener.newSearcher QuerySenderListener done.
   [junit4]   2> 21675 T13 oasc.SolrCore.registerSearcher [collection1] Registered new searcher Searcher@1e6a33b[collection1] main{StandardDirectoryReader(segments_3:15:nrt _4(4.10):C1)}
   [junit4]   2> 21677 T11 C6 oasup.LogUpdateProcessor.finish [collection1] webapp=null path=/update params={commit=true&softCommit=true&waitSearcher=true} {commit=} 0 15
   [junit4]   2> 21678 T11 C6 oasc.SolrCore.execute [collection1] webapp=null path=/select params={q=*%3A*&rows=2147483647} hits=1 status=0 QTime=0 
   [junit4]   2> ASYNC  NEW_CORE C7 name=collection1 org.apache.solr.core.SolrCore@3f03c3
   [junit4]   2> 23614 T11 C7 oasup.LogUpdateProcessor.finish [collection1] webapp=null path=/update params={} {add=[testPPT_various.pptx#0 (1474843735070081024)]} 0 10
   [junit4]   2> 23615 T11 C7 oasu.DirectUpdateHandler2.commit start commit{,optimize=false,openSearcher=true,waitSearcher=true,expungeDeletes=false,softCommit=true,prepareCommit=false}
   [junit4]   2> 23628 T11 C7 oass.SolrIndexSearcher.<init> Opening Searcher@1934d8d[collection1] main
   [junit4]   2> 23628 T11 C7 oasu.DirectUpdateHandler2.commit end_commit_flush
   [junit4]   2> 23628 T13 oasc.QuerySenderListener.newSearcher QuerySenderListener sending requests to Searcher@1934d8d[collection1] main{StandardDirectoryReader(segments_3:17:nrt _4(4.10):C1 _5(4.10):C1)}
   [junit4]   2> 23629 T13 oasc.QuerySenderListener.newSearcher QuerySenderListener done.
   [junit4]   2> 23629 T13 oasc.SolrCore.registerSearcher [collection1] Registered new searcher Searcher@1934d8d[collection1] main{StandardDirectoryReader(segments_3:17:nrt _4(4.10):C1 _5(4.10):C1)}
   [junit4]   2> 23630 T11 C7 oasup.LogUpdateProcessor.finish [collection1] webapp=null path=/update params={commit=true&softCommit=true&waitSearcher=true} {commit=} 0 15
   [junit4]   2> 23631 T11 C7 oasc.SolrCore.execute [collection1] webapp=null path=/select params={q=*%3A*&rows=2147483647} hits=2 status=0 QTime=1 
   [junit4]   2> ASYNC  NEW_CORE C8 name=collection1 org.apache.solr.core.SolrCore@3f03c3
   [junit4]   2> 23877 T11 C8 oasup.LogUpdateProcessor.finish [collection1] webapp=null path=/update params={} {add=[testEXCEL.xlsx#0 (1474843735349002240)]} 0 6
   [junit4]   2> 23878 T11 C8 oasu.DirectUpdateHandler2.commit start commit{,optimize=false,openSearcher=true,waitSearcher=true,expungeDeletes=false,softCommit=true,prepareCommit=false}
   [junit4]   2> 23887 T11 C8 oass.SolrIndexSearcher.<init> Opening Searcher@4febaf[collection1] main
   [junit4]   2> 23887 T11 C8 oasu.DirectUpdateHandler2.commit end_commit_flush
   [junit4]   2> 23887 T13 oasc.QuerySenderListener.newSearcher QuerySenderListener sending requests to Searcher@4febaf[collection1] main{StandardDirectoryReader(segments_3:19:nrt _4(4.10):C1 _5(4.10):C1 _6(4.10):C1)}
   [junit4]   2> 23888 T13 oasc.QuerySenderListener.newSearcher QuerySenderListener done.
   [junit4]   2> 23888 T13 oasc.SolrCore.registerSearcher [collection1] Registered new searcher Searcher@4febaf[collection1] main{StandardDirectoryReader(segments_3:19:nrt _4(4.10):C1 _5(4.10):C1 _6(4.10):C1)}
   [junit4]   2> 23889 T11 C8 oasup.LogUpdateProcessor.finish [collection1] webapp=null path=/update params={commit=true&softCommit=true&waitSearcher=true} {commit=} 0 11
   [junit4]   2> 23890 T11 C8 oasc.SolrCore.execute [collection1] webapp=null path=/select params={q=*%3A*&rows=2147483647} hits=3 status=0 QTime=0 
   [junit4]   2> ASYNC  NEW_CORE C9 name=collection1 org.apache.solr.core.SolrCore@3f03c3
   [junit4]   2> 24351 T11 C9 oasup.LogUpdateProcessor.finish [collection1] webapp=null path=/update params={} {add=[testEXCEL.xls#0 (1474843735847075840)]} 0 5
   [junit4]   2> 24352 T11 C9 oasu.DirectUpdateHandler2.commit start commit{,optimize=false,openSearcher=true,waitSearcher=true,expungeDeletes=false,softCommit=true,prepareCommit=false}
   [junit4]   2> 24360 T11 C9 oass.SolrIndexSearcher.<init> Opening Searcher@20721b[collection1] main
   [junit4]   2> 24361 T11 C9 oasu.DirectUpdateHandler2.commit end_commit_flush
   [junit4]   2> 24361 T13 oasc.QuerySenderListener.newSearcher QuerySenderListener sending requests to Searcher@20721b[collection1] main{StandardDirectoryReader(segments_3:21:nrt _4(4.10):C1 _5(4.10):C1 _6(4.10):C1 _7(4.10):C1)}
   [junit4]   2> 24362 T13 oasc.QuerySenderListener.newSearcher QuerySenderListener done.
   [junit4]   2> 24362 T13 oasc.SolrCore.registerSearcher [collection1] Registered new searcher Searcher@20721b[collection1] main{StandardDirectoryReader(segments_3:21:nrt _4(4.10):C1 _5(4.10):C1 _6(4.10):C1 _7(4.10):C1)}
   [junit4]   2> 24363 T11 C9 oasup.LogUpdateProcessor.finish [collection1] webapp=null path=/update params={commit=true&softCommit=true&waitSearcher=true} {commit=} 0 11
   [junit4]   2> 24363 T11 C9 oasc.SolrCore.execute [collection1] webapp=null path=/select params={q=*%3A*&rows=2147483647} hits=4 status=0 QTime=0 
   [junit4]   2> 24496 T11 C9 oasup.LogUpdateProcessor.finish [collection1] webapp=null path=/update params={} {add=[testPages.pages#0 (1474843735990730752)]} 0 14
   [junit4]   2> 24497 T11 C9 oasu.DirectUpdateHandler2.commit start commit{,optimize=false,openSearcher=true,waitSearcher=true,expungeDeletes=false,softCommit=true,prepareCommit=false}
   [junit4]   2> 24519 T11 C9 oass.SolrIndexSearcher.<init> Opening Searcher@621600[collection1] main
   [junit4]   2> 24520 T11 C9 oasu.DirectUpdateHandler2.commit end_commit_flush
   [junit4]   2> 24520 T13 oasc.QuerySenderListener.newSearcher QuerySenderListener sending requests to Searcher@621600[collection1] main{StandardDirectoryReader(segments_3:23:nrt _4(4.10):C1 _5(4.10):C1 _6(4.10):C1 _7(4.10):C1 _8(4.10):C1)}
   [junit4]   2> 24521 T13 oasc.QuerySenderListener.newSearcher QuerySenderListener done.
   [junit4]   2> 24522 T13 oasc.SolrCore.registerSearcher [collection1] Registered new searcher Searcher@621600[collection1] main{StandardDirectoryReader(segments_3:23:nrt _4(4.10):C1 _5(4.10):C1 _6(4.10):C1 _7(4.10):C1 _8(4.10):C1)}
   [junit4]   2> 24523 T11 C9 oasup.LogUpdateProcessor.finish [collection1] webapp=null path=/update params={commit=true&softCommit=true&waitSearcher=true} {commit=} 0 26
   [junit4]   2> 24524 T11 C9 oasc.SolrCore.execute [collection1] webapp=null path=/select params={q=*%3A*&rows=2147483647} hits=5 status=0 QTime=0 
   [junit4]   2> 24982 T11 C9 oasup.LogUpdateProcessor.finish [collection1] webapp=null path=/update params={} {add=[testRTFVarious.rtf#0 (1474843736508727296)]} 0 5
   [junit4]   2> 24983 T11 C9 oasu.DirectUpdateHandler2.commit start commit{,optimize=false,openSearcher=true,waitSearcher=true,expungeDeletes=false,softCommit=true,prepareCommit=false}
   [junit4]   2> 24990 T11 C9 oass.SolrIndexSearcher.<init> Opening Searcher@2d5a17[collection1] main
   [junit4]   2> 24991 T11 C9 oasu.DirectUpdateHandler2.commit end_commit_flush
   [junit4]   2> 24991 T13 oasc.QuerySenderListener.newSearcher QuerySenderListener sending requests to Searcher@2d5a17[collection1] main{StandardDirectoryReader(segments_3:25:nrt _4(4.10):C1 _5(4.10):C1 _6(4.10):C1 _7(4.10):C1 _8(4.10):C1 _9(4.10):C1)}
   [junit4]   2> 24992 T13 oasc.QuerySenderListener.newSearcher QuerySenderListener done.
   [junit4]   2> 24992 T13 oasc.SolrCore.registerSearcher [collection1] Registered new searcher Searcher@2d5a17[collection1] main{StandardDirectoryReader(segments_3:25:nrt _4(4.10):C1 _5(4.10):C1 _6(4.10):C1 _7(4.10):C1 _8(4.10):C1 _9(4.10):C1)}
   [junit4]   2> 24993 T11 C9 oasup.LogUpdateProcessor.finish [collection1] webapp=null path=/update params={commit=true&softCommit=true&waitSearcher=true} {commit=} 0 10
   [junit4]   2> 24994 T11 C9 oasc.SolrCore.execute [collection1] webapp=null path=/select params={q=*%3A*&rows=2147483647} hits=6 status=0 QTime=0 
   [junit4]   2> 25027 T11 C9 oasup.LogUpdateProcessor.finish [collection1] webapp=null path=/update params={} {add=[complex.mbox#0 (1474843736545427456)]} 0 17
   [junit4]   2> 25028 T11 C9 oasu.DirectUpdateHandler2.commit start commit{,optimize=false,openSearcher=true,waitSearcher=true,expungeDeletes=false,softCommit=true,prepareCommit=false}
   [junit4]   2> 25045 T11 C9 oass.SolrIndexSearcher.<init> Opening Searcher@6a409a[collection1] main
   [junit4]   2> 25046 T11 C9 oasu.DirectUpdateHandler2.commit end_commit_flush
   [junit4]   2> 25046 T13 oasc.QuerySenderListener.newSearcher QuerySenderListener sending requests to Searcher@6a409a[collection1] main{StandardDirectoryReader(segments_3:27:nrt _4(4.10):C1 _5(4.10):C1 _6(4.10):C1 _7(4.10):C1 _8(4.10):C1 _9(4.10):C1 _a(4.10):C1)}
   [junit4]   2> 25047 T13 oasc.QuerySenderListener.newSearcher QuerySenderListener done.
   [junit4]   2> 25047 T13 oasc.SolrCore.registerSearcher [collection1] Registered new searcher Searcher@6a409a[collection1] main{StandardDirectoryReader(segments_3:27:nrt _4(4.10):C1 _5(4.10):C1 _6(4.10):C1 _7(4.10):C1 _8(4.10):C1 _9(4.10):C1 _a(4.10):C1)}
   [junit4]   2> 25048 T11 C9 oasup.LogUpdateProcessor.finish [collection1] webapp=null path=/update params={commit=true&softCommit=true&waitSearcher=true} {commit=} 0 20
   [junit4]   2> 25049 T11 C9 oasc.SolrCore.execute [collection1] webapp=null path=/select params={q=*%3A*&rows=2147483647} hits=7 status=0 QTime=0 
   [junit4]   2> 25158 T11 C9 oasup.LogUpdateProcessor.finish [collection1] webapp=null path=/update params={} {add=[test-outlook.msg#0 (1474843736689082368)]} 0 9
   [junit4]   2> 25159 T11 C9 oasu.DirectUpdateHandler2.commit start commit{,optimize=false,openSearcher=true,waitSearcher=true,expungeDeletes=false,softCommit=true,prepareCommit=false}
   [junit4]   2> 25170 T11 C9 oass.SolrIndexSearcher.<init> Opening Searcher@1c01bf0[collection1] main
   [junit4]   2> 25171 T11 C9 oasu.DirectUpdateHandler2.commit end_commit_flush
   [junit4]   2> 25171 T13 oasc.QuerySenderListener.newSearcher QuerySenderListener sending requests to Searcher@1c01bf0[collection1] main{StandardDirectoryReader(segments_3:29:nrt _4(4.10):C1 _5(4.10):C1 _6(4.10):C1 _7(4.10):C1 _8(4.10):C1 _9(4.10):C1 _a(4.10):C1 _b(4.10):C1)}
   [junit4]   2> 25180 T13 oasc.QuerySenderListener.newSearcher QuerySenderListener done.
   [junit4]   2> 25181 T13 oasc.SolrCore.registerSearcher [collection1] Registered new searcher Searcher@1c01bf0[collection1] main{StandardDirectoryReader(segments_3:29:nrt _4(4.10):C1 _5(4.10):C1 _6(4.10):C1 _7(4.10):C1 _8(4.10):C1 _9(4.10):C1 _a(4.10):C1 _b(4.10):C1)}
   [junit4]   2> ASYNC  NEW_CORE C10 name=collection1 org.apache.solr.core.SolrCore@3f03c3
   [junit4]   2> 25181 T11 C10 oasup.LogUpdateProcessor.finish [collection1] webapp=null path=/update params={commit=true&softCommit=true&waitSearcher=true} {commit=} 0 22
   [junit4]   2> 25183 T11 C10 oasc.SolrCore.execute [collection1] webapp=null path=/select params={q=*%3A*&rows=2147483647} hits=8 status=0 QTime=1 
   [junit4]   2> 25249 T11 C10 oasup.LogUpdateProcessor.finish [collection1] webapp=null path=/update params={} {add=[testEMLX.emlx#0 (1474843736784502784)]} 0 9
   [junit4]   2> 25251 T11 C10 oasu.DirectUpdateHandler2.commit start commit{,optimize=false,openSearcher=true,waitSearcher=true,expungeDeletes=false,softCommit=true,prepareCommit=false}
   [junit4]   2> 25266 T11 C10 oass.SolrIndexSearcher.<init> Opening Searcher@1960f94[collection1] main
   [junit4]   2> 25267 T11 C10 oasu.DirectUpdateHandler2.commit end_commit_flush
   [junit4]   2> 25267 T13 oasc.QuerySenderListener.newSearcher QuerySenderListener sending requests to Searcher@1960f94[collection1] main{StandardDirectoryReader(segments_3:31:nrt _4(4.10):C1 _5(4.10):C1 _6(4.10):C1 _7(4.10):C1 _8(4.10

[...truncated too long message...]

 [collection1] webapp=null path=/update params={} {add=[3234567890 (1474843746259435520)]} 0 3
   [junit4]   2> 34282 T11 C17 oasup.LogUpdateProcessor.finish [collection1] webapp=null path=/update params={} {add=[4345678901 (1474843746263629824)]} 0 2
   [junit4]   2> 34283 T11 C17 oasu.DirectUpdateHandler2.commit start commit{,optimize=false,openSearcher=true,waitSearcher=true,expungeDeletes=false,softCommit=true,prepareCommit=false}
   [junit4]   2> 34289 T11 C17 oass.SolrIndexSearcher.<init> Opening Searcher@12416dc[collection1] main
   [junit4]   2> 34290 T11 C17 oasu.DirectUpdateHandler2.commit end_commit_flush
   [junit4]   2> 34290 T13 oasc.QuerySenderListener.newSearcher QuerySenderListener sending requests to Searcher@12416dc[collection1] main{StandardDirectoryReader(segments_4:99:nrt _13(4.10):C15 _14(4.10):C6 _15(4.10):C4 _16(4.10):C2 _17(4.10):C2 _18(4.10):C2 _19(4.10):C2)}
   [junit4]   2> 34291 T13 oasc.QuerySenderListener.newSearcher QuerySenderListener done.
   [junit4]   2> 34291 T13 oasc.SolrCore.registerSearcher [collection1] Registered new searcher Searcher@12416dc[collection1] main{StandardDirectoryReader(segments_4:99:nrt _13(4.10):C15 _14(4.10):C6 _15(4.10):C4 _16(4.10):C2 _17(4.10):C2 _18(4.10):C2 _19(4.10):C2)}
   [junit4]   2> 34292 T11 C17 oasup.LogUpdateProcessor.finish [collection1] webapp=null path=/update params={commit=true&softCommit=true&waitSearcher=true} {commit=} 0 10
   [junit4]   2> 34293 T11 C17 oasc.SolrCore.execute [collection1] webapp=null path=/select params={q=*%3A*&rows=2147483647} hits=33 status=0 QTime=1 
   [junit4]   2> 34304 T11 C17 oasup.LogUpdateProcessor.finish [collection1] webapp=null path=/update params={} {add=[email.eml#0 (1474843746285649920)]} 0 1
   [junit4]   2> 34304 T11 C17 oasu.DirectUpdateHandler2.commit start commit{,optimize=false,openSearcher=true,waitSearcher=true,expungeDeletes=false,softCommit=true,prepareCommit=false}
   [junit4]   2> 34309 T11 C17 oass.SolrIndexSearcher.<init> Opening Searcher@febe87[collection1] main
   [junit4]   2> 34310 T11 C17 oasu.DirectUpdateHandler2.commit end_commit_flush
   [junit4]   2> 34310 T13 oasc.QuerySenderListener.newSearcher QuerySenderListener sending requests to Searcher@febe87[collection1] main{StandardDirectoryReader(segments_4:101:nrt _13(4.10):C15 _14(4.10):C6 _15(4.10):C4 _16(4.10):C2 _17(4.10):C2 _18(4.10):C2 _19(4.10):C2 _1a(4.10):C1)}
   [junit4]   2> 34311 T13 oasc.QuerySenderListener.newSearcher QuerySenderListener done.
   [junit4]   2> 34311 T13 oasc.SolrCore.registerSearcher [collection1] Registered new searcher Searcher@febe87[collection1] main{StandardDirectoryReader(segments_4:101:nrt _13(4.10):C15 _14(4.10):C6 _15(4.10):C4 _16(4.10):C2 _17(4.10):C2 _18(4.10):C2 _19(4.10):C2 _1a(4.10):C1)}
   [junit4]   2> 34312 T11 C17 oasup.LogUpdateProcessor.finish [collection1] webapp=null path=/update params={commit=true&softCommit=true&waitSearcher=true} {commit=} 0 8
   [junit4]   2> 34313 T11 C17 oasc.SolrCore.execute [collection1] webapp=null path=/select params={q=*%3A*&rows=2147483647} hits=34 status=0 QTime=1 
   [junit4]   2> 34318 T11 oas.SolrTestCaseJ4.tearDown ###Ending testSolrCellDocumentTypes
   [junit4]   2> NOTE: reproduce with: ant test  -Dtestcase=SolrCellMorphlineTest -Dtests.method=testSolrCellDocumentTypes -Dtests.seed=3064D825784C0F92 -Dtests.multiplier=3 -Dtests.slow=true -Dtests.locale=tr_TR -Dtests.timezone=Asia/Karachi -Dtests.file.encoding=UTF-8
   [junit4] FAILURE 7.40s | SolrCellMorphlineTest.testSolrCellDocumentTypes <<<
   [junit4]    > Throwable #1: java.lang.AssertionError: key:ignored__attachment_mimetype expected:<[message/rfc822]> but was:<[text/plain]>
   [junit4]    > 	at __randomizedtesting.SeedInfo.seed([3064D825784C0F92:AAA77BBB1D975147]:0)
   [junit4]    > 	at org.apache.solr.morphlines.solr.AbstractSolrMorphlineTestBase.testDocumentTypesInternal(AbstractSolrMorphlineTestBase.java:170)
   [junit4]    > 	at org.apache.solr.morphlines.cell.SolrCellMorphlineTest.testSolrCellDocumentTypes(SolrCellMorphlineTest.java:193)
   [junit4]    > 	at java.lang.Thread.run(Thread.java:745)
   [junit4]   2> 34356 T11 oas.SolrTestCaseJ4.deleteCore ###deleteCore
   [junit4]   2> 34356 T11 oasc.CoreContainer.shutdown Shutting down CoreContainer instance=4860632
   [junit4]   2> 34357 T11 oasc.SolrCore.close [collection1]  CLOSING SolrCore org.apache.solr.core.SolrCore@3f03c3
   [junit4]   2> 34358 T11 oasu.DirectUpdateHandler2.close closing DirectUpdateHandler2{commits=56,autocommit maxTime=60000ms,autocommits=0,soft autocommit maxTime=1000ms,soft autocommits=0,optimizes=0,rollbacks=0,expungeDeletes=0,docsPending=34,adds=0,deletesById=0,deletesByQuery=0,errors=0,cumulative_adds=61,cumulative_deletesById=0,cumulative_deletesByQuery=9,cumulative_errors=0,transaction_logs_total_size=81046,transaction_logs_total_number=9}
   [junit4]   2> 34358 T11 oasu.SolrCoreState.decrefSolrCoreState Closing SolrCoreState
   [junit4]   2> 34359 T11 oasu.DefaultSolrCoreState.closeIndexWriter SolrCoreState ref count has reached 0 - closing IndexWriter
   [junit4]   2> 34359 T11 oasu.DefaultSolrCoreState.closeIndexWriter closing IndexWriter with IndexWriterCloser
   [junit4]   2> 34359 T11 C17 oasu.DirectUpdateHandler2.closeWriter Committing on IndexWriter close.
   [junit4]   2> 34412 T11 C17 oasc.SolrDeletionPolicy.onCommit SolrDeletionPolicy.onCommit: commits: num=2
   [junit4]   2> 		commit{dir=MockDirectoryWrapper(RAMDirectory@16962b1 lockFactory=NativeFSLockFactory@/mnt/ssd/jenkins/workspace/Lucene-Solr-4.x-Linux/solr/build/contrib/solr-morphlines-cell/test/J0/./solr.morphlines.cell.SolrCellMorphlineTest-3064D825784C0F92-001/init-core-data-001/index),segFN=segments_4,generation=4}
   [junit4]   2> 		commit{dir=MockDirectoryWrapper(RAMDirectory@16962b1 lockFactory=NativeFSLockFactory@/mnt/ssd/jenkins/workspace/Lucene-Solr-4.x-Linux/solr/build/contrib/solr-morphlines-cell/test/J0/./solr.morphlines.cell.SolrCellMorphlineTest-3064D825784C0F92-001/init-core-data-001/index),segFN=segments_5,generation=5}
   [junit4]   2> 34413 T11 C17 oasc.SolrDeletionPolicy.updateCommits newest commit generation = 5
   [junit4]   2> 34415 T11 oasc.SolrCore.closeSearcher [collection1] Closing main searcher on request.
   [junit4]   2> 34416 T11 oasc.CachingDirectoryFactory.close Closing MockDirectoryFactory - 2 directories currently being tracked
   [junit4]   2> 34416 T11 oasc.CachingDirectoryFactory.closeCacheValue looking to close /mnt/ssd/jenkins/workspace/Lucene-Solr-4.x-Linux/solr/build/contrib/solr-morphlines-cell/test/J0/./solr.morphlines.cell.SolrCellMorphlineTest-3064D825784C0F92-001/init-core-data-001 [CachedDir<<refCount=0;path=/mnt/ssd/jenkins/workspace/Lucene-Solr-4.x-Linux/solr/build/contrib/solr-morphlines-cell/test/J0/./solr.morphlines.cell.SolrCellMorphlineTest-3064D825784C0F92-001/init-core-data-001;done=false>>]
   [junit4]   2> 34417 T11 oasc.CachingDirectoryFactory.close Closing directory: /mnt/ssd/jenkins/workspace/Lucene-Solr-4.x-Linux/solr/build/contrib/solr-morphlines-cell/test/J0/./solr.morphlines.cell.SolrCellMorphlineTest-3064D825784C0F92-001/init-core-data-001
   [junit4]   2> 34417 T11 oasc.CachingDirectoryFactory.closeCacheValue looking to close /mnt/ssd/jenkins/workspace/Lucene-Solr-4.x-Linux/solr/build/contrib/solr-morphlines-cell/test/J0/./solr.morphlines.cell.SolrCellMorphlineTest-3064D825784C0F92-001/init-core-data-001/index [CachedDir<<refCount=0;path=/mnt/ssd/jenkins/workspace/Lucene-Solr-4.x-Linux/solr/build/contrib/solr-morphlines-cell/test/J0/./solr.morphlines.cell.SolrCellMorphlineTest-3064D825784C0F92-001/init-core-data-001/index;done=false>>]
   [junit4]   2> 34418 T11 oasc.CachingDirectoryFactory.close Closing directory: /mnt/ssd/jenkins/workspace/Lucene-Solr-4.x-Linux/solr/build/contrib/solr-morphlines-cell/test/J0/./solr.morphlines.cell.SolrCellMorphlineTest-3064D825784C0F92-001/init-core-data-001/index
   [junit4]   2> NOTE: leaving temporary files on disk at: /mnt/ssd/jenkins/workspace/Lucene-Solr-4.x-Linux/solr/build/contrib/solr-morphlines-cell/test/J0/./solr.morphlines.cell.SolrCellMorphlineTest-3064D825784C0F92-001
   [junit4]   2> NOTE: test params are: codec=Asserting(Lucene49), sim=DefaultSimilarity, locale=tr_TR, timezone=Asia/Karachi
   [junit4]   2> NOTE: Linux 3.13.0-32-generic i386/Oracle Corporation 1.7.0_65 (32-bit)/cpus=8,threads=1,free=43866352,total=134471680
   [junit4]   2> NOTE: All tests run in this JVM: [SolrCellMorphlineTest]
   [junit4] Completed in 34.61s, 5 tests, 1 failure <<< FAILURES!

[...truncated 9 lines...]
BUILD FAILED
/mnt/ssd/jenkins/workspace/Lucene-Solr-4.x-Linux/build.xml:467: The following error occurred while executing this line:
/mnt/ssd/jenkins/workspace/Lucene-Solr-4.x-Linux/build.xml:447: The following error occurred while executing this line:
/mnt/ssd/jenkins/workspace/Lucene-Solr-4.x-Linux/build.xml:45: The following error occurred while executing this line:
/mnt/ssd/jenkins/workspace/Lucene-Solr-4.x-Linux/extra-targets.xml:37: The following error occurred while executing this line:
/mnt/ssd/jenkins/workspace/Lucene-Solr-4.x-Linux/solr/build.xml:209: The following error occurred while executing this line:
/mnt/ssd/jenkins/workspace/Lucene-Solr-4.x-Linux/solr/common-build.xml:440: The following error occurred while executing this line:
/mnt/ssd/jenkins/workspace/Lucene-Solr-4.x-Linux/solr/common-build.xml:496: The following error occurred while executing this line:
/mnt/ssd/jenkins/workspace/Lucene-Solr-4.x-Linux/lucene/common-build.xml:1299: The following error occurred while executing this line:
/mnt/ssd/jenkins/workspace/Lucene-Solr-4.x-Linux/lucene/common-build.xml:923: There were test failures: 1 suite, 5 tests, 1 failure

Total time: 97 minutes 12 seconds
Build step 'Invoke Ant' marked build as failure
[description-setter] Description set: Java: 32bit/jdk1.7.0_65 -server -XX:+UseSerialGC
Archiving artifacts
Recording test results
Email was triggered for: Failure - Any
Sending email for trigger: Failure - Any



Mime
View raw message