lucene-dev mailing list archives

Site index · List index
Message view « Date » · « Thread »
Top « Date » · « Thread »
From buil...@flonkings.com
Subject [JENKINS] Lucene-trunk-Linux-java7-64-analyzers - Build # 11234 - Failure!
Date Mon, 28 Jul 2014 03:59:13 GMT
Build: builds.flonkings.com/job/Lucene-trunk-Linux-java7-64-analyzers/11234/

1 tests failed.
REGRESSION:  org.apache.lucene.analysis.core.TestRandomChains.testRandomChainsWithLargeStrings

Error Message:
startOffset must be non-negative, and endOffset must be >= startOffset, startOffset=11,endOffset=3

Stack Trace:
java.lang.IllegalArgumentException: startOffset must be non-negative, and endOffset must be
>= startOffset, startOffset=11,endOffset=3
	at __randomizedtesting.SeedInfo.seed([B120E2F7BE5F0044:DB7B5DE6E71120B7]:0)
	at org.apache.lucene.analysis.tokenattributes.PackedTokenAttributeImpl.setOffset(PackedTokenAttributeImpl.java:107)
	at org.apache.lucene.analysis.shingle.ShingleFilter.incrementToken(ShingleFilter.java:345)
	at org.apache.lucene.analysis.ValidatingTokenFilter.incrementToken(ValidatingTokenFilter.java:68)
	at org.apache.lucene.analysis.BaseTokenStreamTestCase.checkAnalysisConsistency(BaseTokenStreamTestCase.java:704)
	at org.apache.lucene.analysis.BaseTokenStreamTestCase.checkRandomData(BaseTokenStreamTestCase.java:615)
	at org.apache.lucene.analysis.BaseTokenStreamTestCase.checkRandomData(BaseTokenStreamTestCase.java:513)
	at org.apache.lucene.analysis.core.TestRandomChains.testRandomChainsWithLargeStrings(TestRandomChains.java:925)
	at sun.reflect.NativeMethodAccessorImpl.invoke0(Native Method)
	at sun.reflect.NativeMethodAccessorImpl.invoke(NativeMethodAccessorImpl.java:57)
	at sun.reflect.DelegatingMethodAccessorImpl.invoke(DelegatingMethodAccessorImpl.java:43)
	at java.lang.reflect.Method.invoke(Method.java:606)
	at com.carrotsearch.randomizedtesting.RandomizedRunner.invoke(RandomizedRunner.java:1618)
	at com.carrotsearch.randomizedtesting.RandomizedRunner$6.evaluate(RandomizedRunner.java:827)
	at com.carrotsearch.randomizedtesting.RandomizedRunner$7.evaluate(RandomizedRunner.java:863)
	at com.carrotsearch.randomizedtesting.RandomizedRunner$8.evaluate(RandomizedRunner.java:877)
	at org.apache.lucene.util.TestRuleSetupTeardownChained$1.evaluate(TestRuleSetupTeardownChained.java:50)
	at org.apache.lucene.util.AbstractBeforeAfterRule$1.evaluate(AbstractBeforeAfterRule.java:46)
	at com.carrotsearch.randomizedtesting.rules.SystemPropertiesInvariantRule$1.evaluate(SystemPropertiesInvariantRule.java:55)
	at org.apache.lucene.util.TestRuleThreadAndTestName$1.evaluate(TestRuleThreadAndTestName.java:49)
	at org.apache.lucene.util.TestRuleIgnoreAfterMaxFailures$1.evaluate(TestRuleIgnoreAfterMaxFailures.java:65)
	at org.apache.lucene.util.TestRuleMarkFailure$1.evaluate(TestRuleMarkFailure.java:48)
	at com.carrotsearch.randomizedtesting.rules.StatementAdapter.evaluate(StatementAdapter.java:36)
	at com.carrotsearch.randomizedtesting.ThreadLeakControl$StatementRunner.run(ThreadLeakControl.java:365)
	at com.carrotsearch.randomizedtesting.ThreadLeakControl.forkTimeoutingTask(ThreadLeakControl.java:798)
	at com.carrotsearch.randomizedtesting.ThreadLeakControl$3.evaluate(ThreadLeakControl.java:458)
	at com.carrotsearch.randomizedtesting.RandomizedRunner.runSingleTest(RandomizedRunner.java:836)
	at com.carrotsearch.randomizedtesting.RandomizedRunner$3.evaluate(RandomizedRunner.java:738)
	at com.carrotsearch.randomizedtesting.RandomizedRunner$4.evaluate(RandomizedRunner.java:772)
	at com.carrotsearch.randomizedtesting.RandomizedRunner$5.evaluate(RandomizedRunner.java:783)
	at org.apache.lucene.util.AbstractBeforeAfterRule$1.evaluate(AbstractBeforeAfterRule.java:46)
	at org.apache.lucene.util.TestRuleStoreClassName$1.evaluate(TestRuleStoreClassName.java:42)
	at com.carrotsearch.randomizedtesting.rules.SystemPropertiesInvariantRule$1.evaluate(SystemPropertiesInvariantRule.java:55)
	at com.carrotsearch.randomizedtesting.rules.NoShadowingOrOverridesOnMethodsRule$1.evaluate(NoShadowingOrOverridesOnMethodsRule.java:39)
	at com.carrotsearch.randomizedtesting.rules.NoShadowingOrOverridesOnMethodsRule$1.evaluate(NoShadowingOrOverridesOnMethodsRule.java:39)
	at com.carrotsearch.randomizedtesting.rules.StatementAdapter.evaluate(StatementAdapter.java:36)
	at com.carrotsearch.randomizedtesting.rules.StatementAdapter.evaluate(StatementAdapter.java:36)
	at com.carrotsearch.randomizedtesting.rules.StatementAdapter.evaluate(StatementAdapter.java:36)
	at org.apache.lucene.util.TestRuleAssertionsRequired$1.evaluate(TestRuleAssertionsRequired.java:43)
	at org.apache.lucene.util.TestRuleMarkFailure$1.evaluate(TestRuleMarkFailure.java:48)
	at org.apache.lucene.util.TestRuleIgnoreAfterMaxFailures$1.evaluate(TestRuleIgnoreAfterMaxFailures.java:65)
	at org.apache.lucene.util.TestRuleIgnoreTestSuites$1.evaluate(TestRuleIgnoreTestSuites.java:55)
	at com.carrotsearch.randomizedtesting.rules.StatementAdapter.evaluate(StatementAdapter.java:36)
	at com.carrotsearch.randomizedtesting.ThreadLeakControl$StatementRunner.run(ThreadLeakControl.java:365)
	at java.lang.Thread.run(Thread.java:745)




Build Log:
[...truncated 784 lines...]
   [junit4] Suite: org.apache.lucene.analysis.core.TestRandomChains
   [junit4]   2> TEST FAIL: useCharFilter=false text='bpo zlhgyvw q{0,5}th mztoc </scr
\u1a84y\u783f jorh m?td[?(mw| tol \ud8ba\udc25\uf3a9 muvq \udb2b\udd29A '
   [junit4]   2> Exception from random analyzer: 
   [junit4]   2> charfilters=
   [junit4]   2>   org.apache.lucene.analysis.fa.PersianCharFilter(java.io.StringReader@4f7b2dbf)
   [junit4]   2> tokenizer=
   [junit4]   2>   org.apache.lucene.analysis.path.PathHierarchyTokenizer()
   [junit4]   2> filters=
   [junit4]   2>   org.apache.lucene.analysis.gl.GalicianStemFilter(ValidatingTokenFilter@7371c310
term=,bytes=[],startOffset=0,endOffset=0,positionIncrement=1,positionLength=1,type=word,keyword=false)
   [junit4]   2>   org.apache.lucene.analysis.miscellaneous.WordDelimiterFilter(LUCENE_5_0,
ValidatingTokenFilter@12d9b1cd term=,bytes=[],startOffset=0,endOffset=0,positionIncrement=1,positionLength=1,type=word,keyword=false,
[-75, -102, -47, 47, -68, -62, -35, 32, 103, -122, 108, 21, -111, 90, -58, 44, -7, -55, 57,
44, 51, -56, 33, 13, -53, 113, 1, -58, -7, 30, -87, 123, 5, -117, -64, -101, -112, 60, -97,
77, 87, -73, 76, 78, -14, -76, -1, 127, 110, 82, 29, -64, 111, 102, 113, -62, -88, 108, 14,
-33, -71, -90, 105, -97, -50, -99, -48, -8, 2, -24, -105, 116, -43, -93, -115, 54, -81, -19,
27, -18, -4, 52, 13, -26, 53, 58, -52, 55, -64, 49, 80, 18, 21, -36, -65, 99, 125, -54, 87,
-86, 18, 54, -111, -120, -81, 5, 88, 17, 22, 95, -80, 96, 57, -81, -101, 2, 101, 80, 103,
40, 26, -26, 37, 87, 10, -35, 58, 119, 113, -115, 42, 29, -93, 107, -106, 91, -58, -90, 106,
99, -8, 51, 25, -85, -16, 94, 8, 85, 7, 100], 13, [])
   [junit4]   2>   org.apache.lucene.analysis.shingle.ShingleFilter(ValidatingTokenFilter@51196da
term=,bytes=[],startOffset=0,endOffset=0,positionIncrement=1,positionLength=1,type=word,keyword=false,
po)
   [junit4]   2> offsetsAreCorrect=false
   [junit4]   2> NOTE: reproduce with: ant test  -Dtestcase=TestRandomChains -Dtests.method=testRandomChainsWithLargeStrings
-Dtests.seed=B120E2F7BE5F0044 -Dtests.slow=true -Dtests.locale=mt -Dtests.timezone=Pacific/Guadalcanal
-Dtests.file.encoding=UTF-8
   [junit4] ERROR   25.4s J2 | TestRandomChains.testRandomChainsWithLargeStrings <<<
   [junit4]    > Throwable #1: java.lang.IllegalArgumentException: startOffset must be
non-negative, and endOffset must be >= startOffset, startOffset=11,endOffset=3
   [junit4]    > 	at __randomizedtesting.SeedInfo.seed([B120E2F7BE5F0044:DB7B5DE6E71120B7]:0)
   [junit4]    > 	at org.apache.lucene.analysis.tokenattributes.PackedTokenAttributeImpl.setOffset(PackedTokenAttributeImpl.java:107)
   [junit4]    > 	at org.apache.lucene.analysis.shingle.ShingleFilter.incrementToken(ShingleFilter.java:345)
   [junit4]    > 	at org.apache.lucene.analysis.ValidatingTokenFilter.incrementToken(ValidatingTokenFilter.java:68)
   [junit4]    > 	at org.apache.lucene.analysis.BaseTokenStreamTestCase.checkAnalysisConsistency(BaseTokenStreamTestCase.java:704)
   [junit4]    > 	at org.apache.lucene.analysis.BaseTokenStreamTestCase.checkRandomData(BaseTokenStreamTestCase.java:615)
   [junit4]    > 	at org.apache.lucene.analysis.BaseTokenStreamTestCase.checkRandomData(BaseTokenStreamTestCase.java:513)
   [junit4]    > 	at org.apache.lucene.analysis.core.TestRandomChains.testRandomChainsWithLargeStrings(TestRandomChains.java:925)
   [junit4]    > 	at java.lang.Thread.run(Thread.java:745)
   [junit4]   2> NOTE: leaving temporary files on disk at: /var/lib/jenkins/workspace/Lucene-trunk-Linux-java7-64-analyzers/checkout/lucene/build/analysis/common/test/J2/./temp/lucene.analysis.core.TestRandomChains-B120E2F7BE5F0044-001
   [junit4]   2> NOTE: test params are: codec=Asserting(Lucene49), sim=DefaultSimilarity,
locale=mt, timezone=Pacific/Guadalcanal
   [junit4]   2> NOTE: Linux 3.2.0-26-generic amd64/Oracle Corporation 1.7.0_55 (64-bit)/cpus=8,threads=1,free=147984544,total=256901120
   [junit4]   2> NOTE: All tests run in this JVM: [TestAllAnalyzersHaveFactories, TestRussianAnalyzer,
TestPatternReplaceCharFilterFactory, TestBasqueAnalyzer, TestMultiWordSynonyms, TestWordnetSynonymParser,
TestSoraniStemFilterFactory, TestLengthFilterFactory, TestHungarianAnalyzer, TestCaseSensitive,
TestAnalysisSPILoader, TestSwedishLightStemFilterFactory, TestNGramFilters, EdgeNGramTokenFilterTest,
TestPersianAnalyzer, TestCJKWidthFilter, TestCommonGramsQueryFilterFactory, TestRandomChains]
   [junit4] Completed on J2 in 53.67s, 2 tests, 1 error <<< FAILURES!

[...truncated 343 lines...]
BUILD FAILED
/var/lib/jenkins/workspace/Lucene-trunk-Linux-java7-64-analyzers/checkout/lucene/module-build.xml:60:
The following error occurred while executing this line:
/var/lib/jenkins/workspace/Lucene-trunk-Linux-java7-64-analyzers/checkout/lucene/common-build.xml:1298:
The following error occurred while executing this line:
/var/lib/jenkins/workspace/Lucene-trunk-Linux-java7-64-analyzers/checkout/lucene/common-build.xml:922:
There were test failures: 268 suites, 1358 tests, 1 error, 1 ignored

Total time: 2 minutes 36 seconds
Build step 'Invoke Ant' marked build as failure
Recording test results
Email was triggered for: Failure
Sending email for trigger: Failure



Mime
View raw message