lucene-dev mailing list archives

Site index · List index
Message view « Date » · « Thread »
Top « Date » · « Thread »
From Apache Jenkins Server <jenk...@builds.apache.org>
Subject [JENKINS-MAVEN] Lucene-Solr-Maven-4.x #660: POMs out of sync
Date Sun, 20 Jul 2014 05:31:43 GMT
Build: https://builds.apache.org/job/Lucene-Solr-Maven-4.x/660/

2 tests failed.
REGRESSION:  org.apache.solr.cloud.OverseerTest.testOverseerFailure

Error Message:
KeeperErrorCode = NoNode for /collections/collection1/leader_elect/shard1/election

Stack Trace:
org.apache.zookeeper.KeeperException$NoNodeException: KeeperErrorCode = NoNode for /collections/collection1/leader_elect/shard1/election
	at __randomizedtesting.SeedInfo.seed([FD101888579BC18B:F918977B453E2EAA]:0)
	at org.apache.zookeeper.KeeperException.create(KeeperException.java:111)
	at org.apache.zookeeper.KeeperException.create(KeeperException.java:51)
	at org.apache.zookeeper.ZooKeeper.getChildren(ZooKeeper.java:1472)
	at org.apache.solr.common.cloud.SolrZkClient$6.execute(SolrZkClient.java:260)
	at org.apache.solr.common.cloud.SolrZkClient$6.execute(SolrZkClient.java:257)
	at org.apache.solr.common.cloud.ZkCmdExecutor.retryOperation(ZkCmdExecutor.java:73)
	at org.apache.solr.common.cloud.SolrZkClient.getChildren(SolrZkClient.java:257)
	at org.apache.solr.cloud.LeaderElector.checkIfIamLeader(LeaderElector.java:94)
	at org.apache.solr.cloud.LeaderElector.checkIfIamLeader(LeaderElector.java:155)
	at org.apache.solr.cloud.LeaderElector.joinElection(LeaderElector.java:314)
	at org.apache.solr.cloud.LeaderElector.joinElection(LeaderElector.java:221)
	at org.apache.solr.cloud.OverseerTest$MockZKController.publishState(OverseerTest.java:155)
	at org.apache.solr.cloud.OverseerTest.testOverseerFailure(OverseerTest.java:660)


FAILED:  org.apache.solr.cloud.MultiThreadedOCPTest.testDistribSearch

Error Message:
Task 3002 did not complete, final state: running

Stack Trace:
java.lang.AssertionError: Task 3002 did not complete, final state: running
	at __randomizedtesting.SeedInfo.seed([5159783DC1610AE:84F3199BAB497092]:0)
	at org.junit.Assert.fail(Assert.java:93)
	at org.junit.Assert.assertTrue(Assert.java:43)
	at org.apache.solr.cloud.MultiThreadedOCPTest.testDeduplicationOfSubmittedTasks(MultiThreadedOCPTest.java:162)
	at org.apache.solr.cloud.MultiThreadedOCPTest.doTest(MultiThreadedOCPTest.java:71)




Build Log:
[...truncated 55192 lines...]
BUILD FAILED
/usr/home/hudson/hudson-slave/workspace/Lucene-Solr-Maven-4.x/build.xml:490: The following
error occurred while executing this line:
/usr/home/hudson/hudson-slave/workspace/Lucene-Solr-Maven-4.x/build.xml:182: The following
error occurred while executing this line:
/usr/home/hudson/hudson-slave/workspace/Lucene-Solr-Maven-4.x/extra-targets.xml:77: Java returned:
1

Total time: 244 minutes 4 seconds
Build step 'Invoke Ant' marked build as failure
Recording test results
Email was triggered for: Failure
Sending email for trigger: Failure



Mime
View raw message