lucene-dev mailing list archives

Site index · List index
Message view « Date » · « Thread »
Top « Date » · « Thread »
From Chris Hostetter <hossman_luc...@fucit.org>
Subject Re: [JENKINS] Lucene-Solr-Tests-trunk-Java7 - Build # 4735 - Still Failing
Date Fri, 27 Jun 2014 19:03:17 GMT

FYI: i haven't dug into it, but this seed definitily reproduces for me.

: Date: Fri, 27 Jun 2014 18:25:55 +0000 (UTC)
: From: Apache Jenkins Server <jenkins@builds.apache.org>
: Reply-To: dev@lucene.apache.org
: To: dev@lucene.apache.org
: Subject: [JENKINS] Lucene-Solr-Tests-trunk-Java7 - Build # 4735 - Still
:     Failing
: 
: Build: https://builds.apache.org/job/Lucene-Solr-Tests-trunk-Java7/4735/
: 
: 1 tests failed.
: REGRESSION:  org.apache.lucene.uninverting.TestFieldCacheSort.testEmptyStringVsNullStringSort
: 
: Error Message:
: 
: 
: Stack Trace:
: java.lang.AssertionError
: 	at __randomizedtesting.SeedInfo.seed([32DE5577A16BBF2:62CED7800277BD42]:0)
: 	at org.apache.lucene.index.AssertingAtomicReader.getSortedDocValues(AssertingAtomicReader.java:638)
: 	at org.apache.lucene.index.FilterAtomicReader.getSortedDocValues(FilterAtomicReader.java:414)
: 	at org.apache.lucene.index.AssertingAtomicReader.getSortedDocValues(AssertingAtomicReader.java:635)
: 	at org.apache.lucene.index.DocValues.getSorted(DocValues.java:273)
: 	at org.apache.lucene.search.FieldComparator$TermOrdValComparator.getSortedDocValues(FieldComparator.java:821)
: 	at org.apache.lucene.search.FieldComparator$TermOrdValComparator.setNextReader(FieldComparator.java:826)
: 	at org.apache.lucene.search.TopFieldCollector$OneComparatorNonScoringCollector.doSetNextReader(TopFieldCollector.java:97)
: 	at org.apache.lucene.search.SimpleCollector.getLeafCollector(SimpleCollector.java:33)
: 	at org.apache.lucene.search.IndexSearcher.search(IndexSearcher.java:605)
: 	at org.apache.lucene.search.AssertingIndexSearcher.search(AssertingIndexSearcher.java:94)
: 	at org.apache.lucene.search.IndexSearcher.search(IndexSearcher.java:573)
: 	at org.apache.lucene.search.IndexSearcher.search(IndexSearcher.java:525)
: 	at org.apache.lucene.search.IndexSearcher.search(IndexSearcher.java:502)
: 	at org.apache.lucene.search.IndexSearcher.search(IndexSearcher.java:318)
: 	at org.apache.lucene.uninverting.TestFieldCacheSort.testEmptyStringVsNullStringSort(TestFieldCacheSort.java:1029)
: 	at sun.reflect.NativeMethodAccessorImpl.invoke0(Native Method)
: 	at sun.reflect.NativeMethodAccessorImpl.invoke(NativeMethodAccessorImpl.java:57)
: 	at sun.reflect.DelegatingMethodAccessorImpl.invoke(DelegatingMethodAccessorImpl.java:43)
: 	at java.lang.reflect.Method.invoke(Method.java:606)
: 	at com.carrotsearch.randomizedtesting.RandomizedRunner.invoke(RandomizedRunner.java:1618)
: 	at com.carrotsearch.randomizedtesting.RandomizedRunner$6.evaluate(RandomizedRunner.java:827)
: 	at com.carrotsearch.randomizedtesting.RandomizedRunner$7.evaluate(RandomizedRunner.java:863)
: 	at com.carrotsearch.randomizedtesting.RandomizedRunner$8.evaluate(RandomizedRunner.java:877)
: 	at org.apache.lucene.util.TestRuleSetupTeardownChained$1.evaluate(TestRuleSetupTeardownChained.java:50)
: 	at org.apache.lucene.util.AbstractBeforeAfterRule$1.evaluate(AbstractBeforeAfterRule.java:46)
: 	at com.carrotsearch.randomizedtesting.rules.SystemPropertiesInvariantRule$1.evaluate(SystemPropertiesInvariantRule.java:55)
: 	at org.apache.lucene.util.TestRuleThreadAndTestName$1.evaluate(TestRuleThreadAndTestName.java:49)
: 	at org.apache.lucene.util.TestRuleIgnoreAfterMaxFailures$1.evaluate(TestRuleIgnoreAfterMaxFailures.java:65)
: 	at org.apache.lucene.util.TestRuleMarkFailure$1.evaluate(TestRuleMarkFailure.java:48)
: 	at com.carrotsearch.randomizedtesting.rules.StatementAdapter.evaluate(StatementAdapter.java:36)
: 	at com.carrotsearch.randomizedtesting.ThreadLeakControl$StatementRunner.run(ThreadLeakControl.java:360)
: 	at com.carrotsearch.randomizedtesting.ThreadLeakControl.forkTimeoutingTask(ThreadLeakControl.java:793)
: 	at com.carrotsearch.randomizedtesting.ThreadLeakControl$3.evaluate(ThreadLeakControl.java:453)
: 	at com.carrotsearch.randomizedtesting.RandomizedRunner.runSingleTest(RandomizedRunner.java:836)
: 	at com.carrotsearch.randomizedtesting.RandomizedRunner$3.evaluate(RandomizedRunner.java:738)
: 	at com.carrotsearch.randomizedtesting.RandomizedRunner$4.evaluate(RandomizedRunner.java:772)
: 	at com.carrotsearch.randomizedtesting.RandomizedRunner$5.evaluate(RandomizedRunner.java:783)
: 	at org.apache.lucene.util.AbstractBeforeAfterRule$1.evaluate(AbstractBeforeAfterRule.java:46)
: 	at org.apache.lucene.util.TestRuleStoreClassName$1.evaluate(TestRuleStoreClassName.java:42)
: 	at com.carrotsearch.randomizedtesting.rules.SystemPropertiesInvariantRule$1.evaluate(SystemPropertiesInvariantRule.java:55)
: 	at com.carrotsearch.randomizedtesting.rules.NoShadowingOrOverridesOnMethodsRule$1.evaluate(NoShadowingOrOverridesOnMethodsRule.java:39)
: 	at com.carrotsearch.randomizedtesting.rules.NoShadowingOrOverridesOnMethodsRule$1.evaluate(NoShadowingOrOverridesOnMethodsRule.java:39)
: 	at com.carrotsearch.randomizedtesting.rules.StatementAdapter.evaluate(StatementAdapter.java:36)
: 	at com.carrotsearch.randomizedtesting.rules.StatementAdapter.evaluate(StatementAdapter.java:36)
: 	at com.carrotsearch.randomizedtesting.rules.StatementAdapter.evaluate(StatementAdapter.java:36)
: 	at org.apache.lucene.util.TestRuleAssertionsRequired$1.evaluate(TestRuleAssertionsRequired.java:43)
: 	at org.apache.lucene.util.TestRuleMarkFailure$1.evaluate(TestRuleMarkFailure.java:48)
: 	at org.apache.lucene.util.TestRuleIgnoreAfterMaxFailures$1.evaluate(TestRuleIgnoreAfterMaxFailures.java:65)
: 	at org.apache.lucene.util.TestRuleIgnoreTestSuites$1.evaluate(TestRuleIgnoreTestSuites.java:55)
: 	at com.carrotsearch.randomizedtesting.rules.StatementAdapter.evaluate(StatementAdapter.java:36)
: 	at com.carrotsearch.randomizedtesting.ThreadLeakControl$StatementRunner.run(ThreadLeakControl.java:360)
: 	at java.lang.Thread.run(Thread.java:745)
: 
: 
: 
: 
: Build Log:
: [...truncated 8703 lines...]
:    [junit4] Suite: org.apache.lucene.uninverting.TestFieldCacheSort
:    [junit4]   2> NOTE: reproduce with: ant test  -Dtestcase=TestFieldCacheSort -Dtests.method=testEmptyStringVsNullStringSort
-Dtests.seed=32DE5577A16BBF2 -Dtests.multiplier=3 -Dtests.slow=true -Dtests.locale=cs -Dtests.timezone=Asia/Thimbu
-Dtests.file.encoding=US-ASCII
:    [junit4] FAILURE 0.03s J0 | TestFieldCacheSort.testEmptyStringVsNullStringSort <<<
:    [junit4]    > Throwable #1: java.lang.AssertionError
:    [junit4]    > 	at __randomizedtesting.SeedInfo.seed([32DE5577A16BBF2:62CED7800277BD42]:0)
:    [junit4]    > 	at org.apache.lucene.index.AssertingAtomicReader.getSortedDocValues(AssertingAtomicReader.java:638)
:    [junit4]    > 	at org.apache.lucene.index.FilterAtomicReader.getSortedDocValues(FilterAtomicReader.java:414)
:    [junit4]    > 	at org.apache.lucene.index.AssertingAtomicReader.getSortedDocValues(AssertingAtomicReader.java:635)
:    [junit4]    > 	at org.apache.lucene.index.DocValues.getSorted(DocValues.java:273)
:    [junit4]    > 	at org.apache.lucene.search.FieldComparator$TermOrdValComparator.getSortedDocValues(FieldComparator.java:821)
:    [junit4]    > 	at org.apache.lucene.search.FieldComparator$TermOrdValComparator.setNextReader(FieldComparator.java:826)
:    [junit4]    > 	at org.apache.lucene.search.TopFieldCollector$OneComparatorNonScoringCollector.doSetNextReader(TopFieldCollector.java:97)
:    [junit4]    > 	at org.apache.lucene.search.SimpleCollector.getLeafCollector(SimpleCollector.java:33)
:    [junit4]    > 	at org.apache.lucene.search.IndexSearcher.search(IndexSearcher.java:605)
:    [junit4]    > 	at org.apache.lucene.search.AssertingIndexSearcher.search(AssertingIndexSearcher.java:94)
:    [junit4]    > 	at org.apache.lucene.search.IndexSearcher.search(IndexSearcher.java:573)
:    [junit4]    > 	at org.apache.lucene.search.IndexSearcher.search(IndexSearcher.java:525)
:    [junit4]    > 	at org.apache.lucene.search.IndexSearcher.search(IndexSearcher.java:502)
:    [junit4]    > 	at org.apache.lucene.search.IndexSearcher.search(IndexSearcher.java:318)
:    [junit4]    > 	at org.apache.lucene.uninverting.TestFieldCacheSort.testEmptyStringVsNullStringSort(TestFieldCacheSort.java:1029)
:    [junit4]    > 	at java.lang.Thread.run(Thread.java:745)
:    [junit4]   2> NOTE: test params are: codec=Asserting(Lucene49), sim=DefaultSimilarity,
locale=cs, timezone=Asia/Thimbu
:    [junit4]   2> NOTE: FreeBSD 9.1-RELEASE-p3 amd64/Oracle Corporation 1.7.0_60 (64-bit)/cpus=16,threads=1,free=112767984,total=175112192
:    [junit4]   2> NOTE: All tests run in this JVM: [TestHighFreqTerms, SortingAtomicReaderTest,
TestLazyDocument, TestFieldCacheVsDocValues, TestNumericTerms64, TestFieldCacheReopen, TestSortingMergePolicy,
TestDocTermOrds, TestFieldCache, TestFieldCacheSanityChecker, TestFieldCacheSort]
:    [junit4] Completed on J0 in 0.63s, 39 tests, 1 failure <<< FAILURES!
: 
: [...truncated 19 lines...]
: BUILD FAILED
: /usr/home/hudson/hudson-slave/workspace/Lucene-Solr-Tests-trunk-Java7/build.xml:467: The
following error occurred while executing this line:
: /usr/home/hudson/hudson-slave/workspace/Lucene-Solr-Tests-trunk-Java7/build.xml:447: The
following error occurred while executing this line:
: /usr/home/hudson/hudson-slave/workspace/Lucene-Solr-Tests-trunk-Java7/build.xml:45: The
following error occurred while executing this line:
: /usr/home/hudson/hudson-slave/workspace/Lucene-Solr-Tests-trunk-Java7/extra-targets.xml:37:
The following error occurred while executing this line:
: /usr/home/hudson/hudson-slave/workspace/Lucene-Solr-Tests-trunk-Java7/lucene/build.xml:544:
The following error occurred while executing this line:
: /usr/home/hudson/hudson-slave/workspace/Lucene-Solr-Tests-trunk-Java7/lucene/common-build.xml:2019:
The following error occurred while executing this line:
: /usr/home/hudson/hudson-slave/workspace/Lucene-Solr-Tests-trunk-Java7/lucene/module-build.xml:60:
The following error occurred while executing this line:
: /usr/home/hudson/hudson-slave/workspace/Lucene-Solr-Tests-trunk-Java7/lucene/common-build.xml:1298:
The following error occurred while executing this line:
: /usr/home/hudson/hudson-slave/workspace/Lucene-Solr-Tests-trunk-Java7/lucene/common-build.xml:922:
There were test failures: 23 suites, 129 tests, 1 failure, 4 ignored (4 assumptions)
: 
: Total time: 35 minutes 47 seconds
: Build step 'Invoke Ant' marked build as failure
: Archiving artifacts
: Sending artifact delta relative to Lucene-Solr-Tests-trunk-Java7 #4729
: Archived 3 artifacts
: Archive block size is 32768
: Received 0 blocks and 223653 bytes
: Compression is 0.0%
: Took 0.12 sec
: Recording test results
: Email was triggered for: Failure
: Sending email for trigger: Failure
: 
: 
: 

-Hoss
http://www.lucidworks.com/

---------------------------------------------------------------------
To unsubscribe, e-mail: dev-unsubscribe@lucene.apache.org
For additional commands, e-mail: dev-help@lucene.apache.org


Mime
View raw message