lucene-dev mailing list archives

Site index · List index
Message view « Date » · « Thread »
Top « Date » · « Thread »
From Policeman Jenkins Server <jenk...@thetaphi.de>
Subject [JENKINS] Lucene-Solr-trunk-Windows (32bit/jdk1.8.0_20-ea-b15) - Build # 4104 - Failure!
Date Tue, 10 Jun 2014 23:45:20 GMT
Build: http://jenkins.thetaphi.de/job/Lucene-Solr-trunk-Windows/4104/
Java: 32bit/jdk1.8.0_20-ea-b15 -client -XX:+UseConcMarkSweepGC

1 tests failed.
FAILED:  org.apache.solr.core.TestConfigSets.testDefaultConfigSetBasePathResolution

Error Message:
 Expected: is "/path/to/solr/home/configsets"      got: "C:\path\to\solr\home\configsets" 

Stack Trace:
java.lang.AssertionError: 
Expected: is "/path/to/solr/home/configsets"
     got: "C:\path\to\solr\home\configsets"

	at __randomizedtesting.SeedInfo.seed([AC5C09D8931AE423:F87AFB14EE220D2F]:0)
	at org.junit.Assert.assertThat(Assert.java:780)
	at org.junit.Assert.assertThat(Assert.java:738)
	at org.apache.solr.core.TestConfigSets.testDefaultConfigSetBasePathResolution(TestConfigSets.java:59)
	at sun.reflect.NativeMethodAccessorImpl.invoke0(Native Method)
	at sun.reflect.NativeMethodAccessorImpl.invoke(NativeMethodAccessorImpl.java:62)
	at sun.reflect.DelegatingMethodAccessorImpl.invoke(DelegatingMethodAccessorImpl.java:43)
	at java.lang.reflect.Method.invoke(Method.java:483)
	at com.carrotsearch.randomizedtesting.RandomizedRunner.invoke(RandomizedRunner.java:1618)
	at com.carrotsearch.randomizedtesting.RandomizedRunner$6.evaluate(RandomizedRunner.java:827)
	at com.carrotsearch.randomizedtesting.RandomizedRunner$7.evaluate(RandomizedRunner.java:863)
	at com.carrotsearch.randomizedtesting.RandomizedRunner$8.evaluate(RandomizedRunner.java:877)
	at com.carrotsearch.randomizedtesting.rules.SystemPropertiesRestoreRule$1.evaluate(SystemPropertiesRestoreRule.java:53)
	at com.carrotsearch.randomizedtesting.rules.SystemPropertiesRestoreRule$1.evaluate(SystemPropertiesRestoreRule.java:53)
	at org.apache.lucene.util.TestRuleSetupTeardownChained$1.evaluate(TestRuleSetupTeardownChained.java:50)
	at org.apache.lucene.util.AbstractBeforeAfterRule$1.evaluate(AbstractBeforeAfterRule.java:46)
	at com.carrotsearch.randomizedtesting.rules.SystemPropertiesInvariantRule$1.evaluate(SystemPropertiesInvariantRule.java:55)
	at org.apache.lucene.util.TestRuleThreadAndTestName$1.evaluate(TestRuleThreadAndTestName.java:49)
	at org.apache.lucene.util.TestRuleIgnoreAfterMaxFailures$1.evaluate(TestRuleIgnoreAfterMaxFailures.java:65)
	at org.apache.lucene.util.TestRuleMarkFailure$1.evaluate(TestRuleMarkFailure.java:48)
	at com.carrotsearch.randomizedtesting.rules.StatementAdapter.evaluate(StatementAdapter.java:36)
	at com.carrotsearch.randomizedtesting.ThreadLeakControl$StatementRunner.run(ThreadLeakControl.java:360)
	at com.carrotsearch.randomizedtesting.ThreadLeakControl.forkTimeoutingTask(ThreadLeakControl.java:793)
	at com.carrotsearch.randomizedtesting.ThreadLeakControl$3.evaluate(ThreadLeakControl.java:453)
	at com.carrotsearch.randomizedtesting.RandomizedRunner.runSingleTest(RandomizedRunner.java:836)
	at com.carrotsearch.randomizedtesting.RandomizedRunner$3.evaluate(RandomizedRunner.java:738)
	at com.carrotsearch.randomizedtesting.RandomizedRunner$4.evaluate(RandomizedRunner.java:772)
	at com.carrotsearch.randomizedtesting.RandomizedRunner$5.evaluate(RandomizedRunner.java:783)
	at com.carrotsearch.randomizedtesting.rules.StatementAdapter.evaluate(StatementAdapter.java:36)
	at com.carrotsearch.randomizedtesting.rules.SystemPropertiesRestoreRule$1.evaluate(SystemPropertiesRestoreRule.java:53)
	at org.apache.lucene.util.AbstractBeforeAfterRule$1.evaluate(AbstractBeforeAfterRule.java:46)
	at org.apache.lucene.util.TestRuleStoreClassName$1.evaluate(TestRuleStoreClassName.java:42)
	at com.carrotsearch.randomizedtesting.rules.SystemPropertiesInvariantRule$1.evaluate(SystemPropertiesInvariantRule.java:55)
	at com.carrotsearch.randomizedtesting.rules.NoShadowingOrOverridesOnMethodsRule$1.evaluate(NoShadowingOrOverridesOnMethodsRule.java:39)
	at com.carrotsearch.randomizedtesting.rules.NoShadowingOrOverridesOnMethodsRule$1.evaluate(NoShadowingOrOverridesOnMethodsRule.java:39)
	at com.carrotsearch.randomizedtesting.rules.StatementAdapter.evaluate(StatementAdapter.java:36)
	at com.carrotsearch.randomizedtesting.rules.StatementAdapter.evaluate(StatementAdapter.java:36)
	at com.carrotsearch.randomizedtesting.rules.StatementAdapter.evaluate(StatementAdapter.java:36)
	at org.apache.lucene.util.TestRuleAssertionsRequired$1.evaluate(TestRuleAssertionsRequired.java:43)
	at org.apache.lucene.util.TestRuleMarkFailure$1.evaluate(TestRuleMarkFailure.java:48)
	at org.apache.lucene.util.TestRuleIgnoreAfterMaxFailures$1.evaluate(TestRuleIgnoreAfterMaxFailures.java:65)
	at org.apache.lucene.util.TestRuleIgnoreTestSuites$1.evaluate(TestRuleIgnoreTestSuites.java:55)
	at com.carrotsearch.randomizedtesting.rules.StatementAdapter.evaluate(StatementAdapter.java:36)
	at com.carrotsearch.randomizedtesting.ThreadLeakControl$StatementRunner.run(ThreadLeakControl.java:360)
	at java.lang.Thread.run(Thread.java:745)




Build Log:
[...truncated 11859 lines...]
   [junit4] Suite: org.apache.solr.core.TestConfigSets
   [junit4]   2> Creating dataDir: C:\Users\JenkinsSlave\workspace\Lucene-Solr-trunk-Windows\solr\build\solr-core\test\J0\.\temp\solr.core.TestConfigSets-AC5C09D8931AE423-001\init-core-data-001
   [junit4]   2> 3992692 T14104 oas.SolrTestCaseJ4.buildSSLConfig Randomized ssl (false) and clientAuth (false)
   [junit4]   2> 3992696 T14104 oas.SolrTestCaseJ4.setUp ###Starting testNonExistentConfigSetThrowsException
   [junit4]   2> 3992700 T14104 oasc.SolrResourceLoader.<init> new SolrResourceLoader for directory: 'C:\Users\JenkinsSlave\workspace\Lucene-Solr-trunk-Windows\solr\build\solr-core\test\J0\.\temp\solr.core.TestConfigSets-AC5C09D8931AE423-001\tempDir-001\'
   [junit4]   2> 3992764 T14104 oasc.CorePropertiesLocator.<init> Config-defined core root directory: C:\Users\JenkinsSlave\workspace\Lucene-Solr-trunk-Windows\solr\build\solr-core\test\J0\.\temp\solr.core.TestConfigSets-AC5C09D8931AE423-001\tempDir-001
   [junit4]   2> 3992766 T14104 oasc.CoreContainer.<init> New CoreContainer 214043
   [junit4]   2> 3992766 T14104 oasc.CoreContainer.load Loading cores into CoreContainer [instanceDir=C:\Users\JenkinsSlave\workspace\Lucene-Solr-trunk-Windows\solr\build\solr-core\test\J0\.\temp\solr.core.TestConfigSets-AC5C09D8931AE423-001\tempDir-001\]
   [junit4]   2> 3992768 T14104 oashc.HttpShardHandlerFactory.getParameter Setting socketTimeout to: 0
   [junit4]   2> 3992768 T14104 oashc.HttpShardHandlerFactory.getParameter Setting urlScheme to: null
   [junit4]   2> 3992768 T14104 oashc.HttpShardHandlerFactory.getParameter Setting connTimeout to: 0
   [junit4]   2> 3992768 T14104 oashc.HttpShardHandlerFactory.getParameter Setting maxConnectionsPerHost to: 20
   [junit4]   2> 3992768 T14104 oashc.HttpShardHandlerFactory.getParameter Setting corePoolSize to: 0
   [junit4]   2> 3992768 T14104 oashc.HttpShardHandlerFactory.getParameter Setting maximumPoolSize to: 2147483647
   [junit4]   2> 3992769 T14104 oashc.HttpShardHandlerFactory.getParameter Setting maxThreadIdleTime to: 5
   [junit4]   2> 3992769 T14104 oashc.HttpShardHandlerFactory.getParameter Setting sizeOfQueue to: -1
   [junit4]   2> 3992769 T14104 oashc.HttpShardHandlerFactory.getParameter Setting fairnessPolicy to: false
   [junit4]   2> 3992769 T14104 oasl.LogWatcher.createWatcher SLF4J impl is org.slf4j.impl.Log4jLoggerFactory
   [junit4]   2> 3992769 T14104 oasl.LogWatcher.newRegisteredLogWatcher Registering Log Listener [Log4j (org.slf4j.impl.Log4jLoggerFactory)]
   [junit4]   2> 3992772 T14104 oasc.CoreContainer.load Host Name: null
   [junit4]   2> 3992775 T14104 oasc.CorePropertiesLocator.discover Looking for core definitions underneath C:\Users\JenkinsSlave\workspace\Lucene-Solr-trunk-Windows\solr\build\solr-core\test\J0\.\temp\solr.core.TestConfigSets-AC5C09D8931AE423-001\tempDir-001
   [junit4]   2> 3992775 T14104 oasc.CorePropertiesLocator.discover Found 0 core definitions
   [junit4]   2> 3992778 T14104 oasc.CoreContainer.recordAndThrow ERROR Unable to create core: core1 org.apache.solr.common.SolrException: Could not load configuration from directory C:\Users\JenkinsSlave\workspace\Lucene-Solr-trunk-Windows\solr\core\src\test-files\solr\configsets\nonexistent
   [junit4]   2> 	at org.apache.solr.core.ConfigSetService$Default.locateInstanceDir(ConfigSetService.java:158)
   [junit4]   2> 	at org.apache.solr.core.ConfigSetService$Default.createCoreResourceLoader(ConfigSetService.java:142)
   [junit4]   2> 	at org.apache.solr.core.ConfigSetService.getConfig(ConfigSetService.java:58)
   [junit4]   2> 	at org.apache.solr.core.CoreContainer.create(CoreContainer.java:554)
   [junit4]   2> 	at org.apache.solr.core.CoreContainer.create(CoreContainer.java:537)
   [junit4]   2> 	at org.apache.solr.core.TestConfigSets.testNonExistentConfigSetThrowsException(TestConfigSets.java:93)
   [junit4]   2> 	at sun.reflect.NativeMethodAccessorImpl.invoke0(Native Method)
   [junit4]   2> 	at sun.reflect.NativeMethodAccessorImpl.invoke(NativeMethodAccessorImpl.java:62)
   [junit4]   2> 	at sun.reflect.DelegatingMethodAccessorImpl.invoke(DelegatingMethodAccessorImpl.java:43)
   [junit4]   2> 	at java.lang.reflect.Method.invoke(Method.java:483)
   [junit4]   2> 	at com.carrotsearch.randomizedtesting.RandomizedRunner.invoke(RandomizedRunner.java:1618)
   [junit4]   2> 	at com.carrotsearch.randomizedtesting.RandomizedRunner$6.evaluate(RandomizedRunner.java:827)
   [junit4]   2> 	at com.carrotsearch.randomizedtesting.RandomizedRunner$7.evaluate(RandomizedRunner.java:863)
   [junit4]   2> 	at com.carrotsearch.randomizedtesting.RandomizedRunner$8.evaluate(RandomizedRunner.java:877)
   [junit4]   2> 	at com.carrotsearch.randomizedtesting.rules.SystemPropertiesRestoreRule$1.evaluate(SystemPropertiesRestoreRule.java:53)
   [junit4]   2> 	at com.carrotsearch.randomizedtesting.rules.SystemPropertiesRestoreRule$1.evaluate(SystemPropertiesRestoreRule.java:53)
   [junit4]   2> 	at org.apache.lucene.util.TestRuleSetupTeardownChained$1.evaluate(TestRuleSetupTeardownChained.java:50)
   [junit4]   2> 	at org.apache.lucene.util.AbstractBeforeAfterRule$1.evaluate(AbstractBeforeAfterRule.java:46)
   [junit4]   2> 	at com.carrotsearch.randomizedtesting.rules.SystemPropertiesInvariantRule$1.evaluate(SystemPropertiesInvariantRule.java:55)
   [junit4]   2> 	at org.apache.lucene.util.TestRuleThreadAndTestName$1.evaluate(TestRuleThreadAndTestName.java:49)
   [junit4]   2> 	at org.apache.lucene.util.TestRuleIgnoreAfterMaxFailures$1.evaluate(TestRuleIgnoreAfterMaxFailures.java:65)
   [junit4]   2> 	at org.apache.lucene.util.TestRuleMarkFailure$1.evaluate(TestRuleMarkFailure.java:48)
   [junit4]   2> 	at com.carrotsearch.randomizedtesting.rules.StatementAdapter.evaluate(StatementAdapter.java:36)
   [junit4]   2> 	at com.carrotsearch.randomizedtesting.ThreadLeakControl$StatementRunner.run(ThreadLeakControl.java:360)
   [junit4]   2> 	at com.carrotsearch.randomizedtesting.ThreadLeakControl.forkTimeoutingTask(ThreadLeakControl.java:793)
   [junit4]   2> 	at com.carrotsearch.randomizedtesting.ThreadLeakControl$3.evaluate(ThreadLeakControl.java:453)
   [junit4]   2> 	at com.carrotsearch.randomizedtesting.RandomizedRunner.runSingleTest(RandomizedRunner.java:836)
   [junit4]   2> 	at com.carrotsearch.randomizedtesting.RandomizedRunner$3.evaluate(RandomizedRunner.java:738)
   [junit4]   2> 	at com.carrotsearch.randomizedtesting.RandomizedRunner$4.evaluate(RandomizedRunner.java:772)
   [junit4]   2> 	at com.carrotsearch.randomizedtesting.RandomizedRunner$5.evaluate(RandomizedRunner.java:783)
   [junit4]   2> 	at com.carrotsearch.randomizedtesting.rules.StatementAdapter.evaluate(StatementAdapter.java:36)
   [junit4]   2> 	at com.carrotsearch.randomizedtesting.rules.SystemPropertiesRestoreRule$1.evaluate(SystemPropertiesRestoreRule.java:53)
   [junit4]   2> 	at org.apache.lucene.util.AbstractBeforeAfterRule$1.evaluate(AbstractBeforeAfterRule.java:46)
   [junit4]   2> 	at org.apache.lucene.util.TestRuleStoreClassName$1.evaluate(TestRuleStoreClassName.java:42)
   [junit4]   2> 	at com.carrotsearch.randomizedtesting.rules.SystemPropertiesInvariantRule$1.evaluate(SystemPropertiesInvariantRule.java:55)
   [junit4]   2> 	at com.carrotsearch.randomizedtesting.rules.NoShadowingOrOverridesOnMethodsRule$1.evaluate(NoShadowingOrOverridesOnMethodsRule.java:39)
   [junit4]   2> 	at com.carrotsearch.randomizedtesting.rules.NoShadowingOrOverridesOnMethodsRule$1.evaluate(NoShadowingOrOverridesOnMethodsRule.java:39)
   [junit4]   2> 	at com.carrotsearch.randomizedtesting.rules.StatementAdapter.evaluate(StatementAdapter.java:36)
   [junit4]   2> 	at com.carrotsearch.randomizedtesting.rules.StatementAdapter.evaluate(StatementAdapter.java:36)
   [junit4]   2> 	at com.carrotsearch.randomizedtesting.rules.StatementAdapter.evaluate(StatementAdapter.java:36)
   [junit4]   2> 	at org.apache.lucene.util.TestRuleAssertionsRequired$1.evaluate(TestRuleAssertionsRequired.java:43)
   [junit4]   2> 	at org.apache.lucene.util.TestRuleMarkFailure$1.evaluate(TestRuleMarkFailure.java:48)
   [junit4]   2> 	at org.apache.lucene.util.TestRuleIgnoreAfterMaxFailures$1.evaluate(TestRuleIgnoreAfterMaxFailures.java:65)
   [junit4]   2> 	at org.apache.lucene.util.TestRuleIgnoreTestSuites$1.evaluate(TestRuleIgnoreTestSuites.java:55)
   [junit4]   2> 	at com.carrotsearch.randomizedtesting.rules.StatementAdapter.evaluate(StatementAdapter.java:36)
   [junit4]   2> 	at com.carrotsearch.randomizedtesting.ThreadLeakControl$StatementRunner.run(ThreadLeakControl.java:360)
   [junit4]   2> 	at java.lang.Thread.run(Thread.java:745)
   [junit4]   2> 
   [junit4]   2> 3992780 T14104 oasc.CoreContainer.shutdown Shutting down CoreContainer instance=214043
   [junit4]   2> 3992781 T14104 oas.SolrTestCaseJ4.tearDown ###Ending testNonExistentConfigSetThrowsException
   [junit4]   2> 3992789 T14104 oas.SolrTestCaseJ4.setUp ###Starting testConfigSetOnCoreReload
   [junit4]   2> 3992943 T14104 oasc.SolrResourceLoader.<init> new SolrResourceLoader for directory: 'C:\Users\JenkinsSlave\workspace\Lucene-Solr-trunk-Windows\solr\build\solr-core\test\J0\.\temp\solr.core.TestConfigSets-AC5C09D8931AE423-001\init-core-data-001\core-reload\'
   [junit4]   2> 3992995 T14104 oasc.CorePropertiesLocator.<init> Config-defined core root directory: C:\Users\JenkinsSlave\workspace\Lucene-Solr-trunk-Windows\solr\build\solr-core\test\J0\.\temp\solr.core.TestConfigSets-AC5C09D8931AE423-001\init-core-data-001\core-reload
   [junit4]   2> 3992996 T14104 oasc.CoreContainer.<init> New CoreContainer 30019362
   [junit4]   2> 3992996 T14104 oasc.CoreContainer.load Loading cores into CoreContainer [instanceDir=C:\Users\JenkinsSlave\workspace\Lucene-Solr-trunk-Windows\solr\build\solr-core\test\J0\.\temp\solr.core.TestConfigSets-AC5C09D8931AE423-001\init-core-data-001\core-reload\]
   [junit4]   2> 3992997 T14104 oashc.HttpShardHandlerFactory.getParameter Setting socketTimeout to: 0
   [junit4]   2> 3992997 T14104 oashc.HttpShardHandlerFactory.getParameter Setting urlScheme to: null
   [junit4]   2> 3992997 T14104 oashc.HttpShardHandlerFactory.getParameter Setting connTimeout to: 0
   [junit4]   2> 3992998 T14104 oashc.HttpShardHandlerFactory.getParameter Setting maxConnectionsPerHost to: 20
   [junit4]   2> 3992998 T14104 oashc.HttpShardHandlerFactory.getParameter Setting corePoolSize to: 0
   [junit4]   2> 3992998 T14104 oashc.HttpShardHandlerFactory.getParameter Setting maximumPoolSize to: 2147483647
   [junit4]   2> 3992999 T14104 oashc.HttpShardHandlerFactory.getParameter Setting maxThreadIdleTime to: 5
   [junit4]   2> 3992999 T14104 oashc.HttpShardHandlerFactory.getParameter Setting sizeOfQueue to: -1
   [junit4]   2> 3993000 T14104 oashc.HttpShardHandlerFactory.getParameter Setting fairnessPolicy to: false
   [junit4]   2> 3993000 T14104 oasl.LogWatcher.createWatcher SLF4J impl is org.slf4j.impl.Log4jLoggerFactory
   [junit4]   2> 3993001 T14104 oasl.LogWatcher.newRegisteredLogWatcher Registering Log Listener [Log4j (org.slf4j.impl.Log4jLoggerFactory)]
   [junit4]   2> 3993001 T14104 oasc.CoreContainer.load Host Name: null
   [junit4]   2> 3993003 T14104 oasc.CorePropertiesLocator.discover Looking for core definitions underneath C:\Users\JenkinsSlave\workspace\Lucene-Solr-trunk-Windows\solr\build\solr-core\test\J0\.\temp\solr.core.TestConfigSets-AC5C09D8931AE423-001\init-core-data-001\core-reload
   [junit4]   2> 3993149 T14104 oasc.CorePropertiesLocator.discover Found 0 core definitions
   [junit4]   2> 3993151 T14104 oasc.SolrResourceLoader.<init> new SolrResourceLoader for directory: 'C:\Users\JenkinsSlave\workspace\Lucene-Solr-trunk-Windows\solr\build\solr-core\test\J0\.\temp\solr.core.TestConfigSets-AC5C09D8931AE423-001\init-core-data-001\core-reload\configsets\configset-2\'
   [junit4]   2> 3993209 T14104 oasc.SolrConfig.<init> Using Lucene MatchVersion: LUCENE_5_0
   [junit4]   2> 3993217 T14104 oasc.SolrConfig.<init> Loaded SolrConfig: solrconfig.xml
   [junit4]   2> 3993219 T14104 oass.IndexSchema.readSchema Reading Solr Schema from schema.xml
   [junit4]   2> 3993223 T14104 oass.IndexSchema.readSchema [core1] Schema name=minimal
   [junit4]   2> 3993228 T14104 oass.IndexSchema.readSchema WARN no uniqueKey specified in schema.
   [junit4]   2> 3993230 T14104 oasc.CoreContainer.create Creating SolrCore 'core1' using configuration from configset C:\Users\JenkinsSlave\workspace\Lucene-Solr-trunk-Windows\solr\build\solr-core\test\J0\.\temp\solr.core.TestConfigSets-AC5C09D8931AE423-001\init-core-data-001\core-reload\configsets\configset-2
   [junit4]   2> 3993230 T14104 oasc.SolrCore.initDirectoryFactory org.apache.solr.core.MockDirectoryFactory
   [junit4]   2> 3993231 T14104 oasc.SolrCore.<init> [core1] Opening new SolrCore at C:\Users\JenkinsSlave\workspace\Lucene-Solr-trunk-Windows\solr\build\solr-core\test\J0\.\temp\solr.core.TestConfigSets-AC5C09D8931AE423-001\init-core-data-001\core-reload\configsets\configset-2\, dataDir=C:\Users\JenkinsSlave\workspace\Lucene-Solr-trunk-Windows\solr\build\solr-core\test\J0\.\temp\solr.core.TestConfigSets-AC5C09D8931AE423-001\init-core-data-001\core-reload\core\data\
   [junit4]   2> 3993231 T14104 oasc.SolrCore.<init> JMX monitoring not detected for core: core1
   [junit4]   2> 3993234 T14104 oasc.CachingDirectoryFactory.get return new directory for C:\Users\JenkinsSlave\workspace\Lucene-Solr-trunk-Windows\solr\build\solr-core\test\J0\.\temp\solr.core.TestConfigSets-AC5C09D8931AE423-001\init-core-data-001\core-reload\core\data\
   [junit4]   2> 3993234 T14104 oasc.SolrCore.getNewIndexDir New index directory detected: old=null new=C:\Users\JenkinsSlave\workspace\Lucene-Solr-trunk-Windows\solr\build\solr-core\test\J0\.\temp\solr.core.TestConfigSets-AC5C09D8931AE423-001\init-core-data-001\core-reload\core\data\index/
   [junit4]   2> 3993234 T14104 oasc.SolrCore.initIndex WARN [core1] Solr index directory 'C:\Users\JenkinsSlave\workspace\Lucene-Solr-trunk-Windows\solr\build\solr-core\test\J0\.\temp\solr.core.TestConfigSets-AC5C09D8931AE423-001\init-core-data-001\core-reload\core\data\index' doesn't exist. Creating new index...
   [junit4]   2> 3993237 T14104 oasc.CachingDirectoryFactory.get return new directory for C:\Users\JenkinsSlave\workspace\Lucene-Solr-trunk-Windows\solr\build\solr-core\test\J0\.\temp\solr.core.TestConfigSets-AC5C09D8931AE423-001\init-core-data-001\core-reload\core\data\index
   [junit4]   2> 3993245 T14104 oasc.SolrDeletionPolicy.onCommit SolrDeletionPolicy.onCommit: commits: num=1
   [junit4]   2> 		commit{dir=MockDirectoryWrapper(RAMDirectory@889374 lockFactory=NativeFSLockFactory@C:\Users\JenkinsSlave\workspace\Lucene-Solr-trunk-Windows\solr\build\solr-core\test\J0\.\temp\solr.core.TestConfigSets-AC5C09D8931AE423-001\init-core-data-001\core-reload\core\data\index),segFN=segments_1,generation=1}
   [junit4]   2> 3993245 T14104 oasc.SolrDeletionPolicy.updateCommits newest commit generation = 1
   [junit4]   2> 3993247 T14104 oasc.SolrCore.loadUpdateProcessorChains no updateRequestProcessorChain defined as default, creating implicit default
   [junit4]   2> 3993248 T14104 oasc.RequestHandlers.initHandlersFromConfig created /select: solr.SearchHandler
   [junit4]   2> 3993248 T14104 oasc.RequestHandlers.initHandlersFromConfig created /admin/: org.apache.solr.handler.admin.AdminHandlers
   [junit4]   2> 3993249 T14104 oasc.RequestHandlers.initHandlersFromConfig created /update: solr.UpdateRequestHandler
   [junit4]   2> 3993254 T14104 oashl.XMLLoader.init xsltCacheLifetimeSeconds=60
   [junit4]   2> 3993257 T14104 oasu.CommitTracker.<init> Hard AutoCommit: disabled
   [junit4]   2> 3993257 T14104 oasu.CommitTracker.<init> Soft AutoCommit: disabled
   [junit4]   2> 3993259 T14104 oasc.SolrDeletionPolicy.onInit SolrDeletionPolicy.onInit: commits: num=1
   [junit4]   2> 		commit{dir=MockDirectoryWrapper(RAMDirectory@889374 lockFactory=NativeFSLockFactory@C:\Users\JenkinsSlave\workspace\Lucene-Solr-trunk-Windows\solr\build\solr-core\test\J0\.\temp\solr.core.TestConfigSets-AC5C09D8931AE423-001\init-core-data-001\core-reload\core\data\index),segFN=segments_1,generation=1}
   [junit4]   2> 3993259 T14104 oasc.SolrDeletionPolicy.updateCommits newest commit generation = 1
   [junit4]   2> 3993260 T14104 oass.SolrIndexSearcher.<init> Opening Searcher@7b771a[core1] main
   [junit4]   2> 3993260 T14104 oasr.ManagedResourceStorage$FileStorageIO.configure File-based storage initialized to use dir: C:\Users\JenkinsSlave\workspace\Lucene-Solr-trunk-Windows\solr\build\solr-core\test\J0\.\temp\solr.core.TestConfigSets-AC5C09D8931AE423-001\init-core-data-001\core-reload\configsets\configset-2\conf
   [junit4]   2> 3993260 T14104 oasr.RestManager.init Initializing RestManager with initArgs: {storageDir=C:\Users\JenkinsSlave\workspace\Lucene-Solr-trunk-Windows\solr\build\solr-core\test\J0\.\temp\solr.core.TestConfigSets-AC5C09D8931AE423-001\init-core-data-001\core-reload\configsets\configset-2\conf\}
   [junit4]   2> 3993261 T14104 oasr.ManagedResourceStorage.load Reading _rest_managed.json using file:dir=C:\Users\JenkinsSlave\workspace\Lucene-Solr-trunk-Windows\solr\build\solr-core\test\J0\.\temp\solr.core.TestConfigSets-AC5C09D8931AE423-001\init-core-data-001\core-reload\configsets\configset-2\conf
   [junit4]   2> 3993262 T14104 oasr.ManagedResource.reloadFromStorage WARN No stored data found for /rest/managed
   [junit4]   2> 3993262 T14104 oasr.ManagedResource.notifyObserversDuringInit WARN No registered observers for /rest/managed
   [junit4]   2> 3993263 T14104 oasr.RestManager.init Initializing 0 registered ManagedResources
   [junit4]   2> 3993264 T14104 oasc.CoreContainer.registerCore registering core: core1
   [junit4]   2> 3993266 T14107 oasc.SolrCore.registerSearcher [core1] Registered new searcher Searcher@7b771a[core1] main{UninvertingDirectoryReader()}
   [junit4]   2> 3993269 T14104 oasc.SolrResourceLoader.<init> new SolrResourceLoader for directory: 'C:\Users\JenkinsSlave\workspace\Lucene-Solr-trunk-Windows\solr\build\solr-core\test\J0\.\temp\solr.core.TestConfigSets-AC5C09D8931AE423-001\init-core-data-001\core-reload\configsets\configset-2\'
   [junit4]   2> 3993296 T14104 oasc.SolrConfig.<init> Using Lucene MatchVersion: LUCENE_5_0
   [junit4]   2> 3993311 T14104 oasc.SolrConfig.<init> Loaded SolrConfig: solrconfig.xml
   [junit4]   2> 3993311 T14104 oass.IndexSchema.readSchema Reading Solr Schema from schema.xml
   [junit4]   2> 3993316 T14104 oass.IndexSchema.readSchema [core1] Schema name=minimal
   [junit4]   2> 3993319 T14104 oass.IndexSchema.readSchema WARN no uniqueKey specified in schema.
   [junit4]   2> 3993320 T14104 oasc.CoreContainer.reload Reloading SolrCore 'core1' using configuration from configset C:\Users\JenkinsSlave\workspace\Lucene-Solr-trunk-Windows\solr\build\solr-core\test\J0\.\temp\solr.core.TestConfigSets-AC5C09D8931AE423-001\init-core-data-001\core-reload\configsets\configset-2
   [junit4]   2> 3993321 T14104 oasc.SolrCore.<init> [core1] Opening new SolrCore at C:\Users\JenkinsSlave\workspace\Lucene-Solr-trunk-Windows\solr\build\solr-core\test\J0\.\temp\solr.core.TestConfigSets-AC5C09D8931AE423-001\init-core-data-001\core-reload\configsets\configset-2\, dataDir=C:\Users\JenkinsSlave\workspace\Lucene-Solr-trunk-Windows\solr\build\solr-core\test\J0\.\temp\solr.core.TestConfigSets-AC5C09D8931AE423-001\init-core-data-001\core-reload\core\data\
   [junit4]   2> 3993321 T14104 oasc.SolrCore.<init> JMX monitoring not detected for core: core1
   [junit4]   2> 3993321 T14104 oasc.SolrCore.getNewIndexDir New index directory detected: old=null new=C:\Users\JenkinsSlave\workspace\Lucene-Solr-trunk-Windows\solr\build\solr-core\test\J0\.\temp\solr.core.TestConfigSets-AC5C09D8931AE423-001\init-core-data-001\core-reload\core\data\index/
   [junit4]   2> 3993323 T14104 oasc.SolrCore.loadUpdateProcessorChains no updateRequestProcessorChain defined as default, creating implicit default
   [junit4]   2> 3993324 T14104 oasc.RequestHandlers.initHandlersFromConfig created /select: solr.SearchHandler
   [junit4]   2> 3993324 T14104 oasc.RequestHandlers.initHandlersFromConfig created /admin/: org.apache.solr.handler.admin.AdminHandlers
   [junit4]   2> 3993325 T14104 oasc.RequestHandlers.initHandlersFromConfig created /update: solr.UpdateRequestHandler
   [junit4]   2> 3993325 T14104 oasc.RequestHandlers.initHandlersFromConfig created /get: solr.RealTimeGetHandler
   [junit4]   2> 3993327 T14104 oashl.XMLLoader.init xsltCacheLifetimeSeconds=60
   [junit4]   2> 3993328 T14104 oasu.CommitTracker.<init> Hard AutoCommit: disabled
   [junit4]   2> 3993329 T14104 oasu.CommitTracker.<init> Soft AutoCommit: disabled
   [junit4]   2> 3993329 T14104 oass.SolrIndexSearcher.<init> Opening Searcher@18e5788[core1] main
   [junit4]   2> 3993329 T14104 oasr.ManagedResourceStorage$FileStorageIO.configure File-based storage initialized to use dir: C:\Users\JenkinsSlave\workspace\Lucene-Solr-trunk-Windows\solr\build\solr-core\test\J0\.\temp\solr.core.TestConfigSets-AC5C09D8931AE423-001\init-core-data-001\core-reload\configsets\configset-2\conf
   [junit4]   2> 3993329 T14104 oasr.RestManager.init Initializing RestManager with initArgs: {storageDir=C:\Users\JenkinsSlave\workspace\Lucene-Solr-trunk-Windows\solr\build\solr-core\test\J0\.\temp\solr.core.TestConfigSets-AC5C09D8931AE423-001\init-core-data-001\core-reload\configsets\configset-2\conf\}
   [junit4]   2> 3993329 T14104 oasr.ManagedResourceStorage.load Reading _rest_managed.json using file:dir=C:\Users\JenkinsSlave\workspace\Lucene-Solr-trunk-Windows\solr\build\solr-core\test\J0\.\temp\solr.core.TestConfigSets-AC5C09D8931AE423-001\init-core-data-001\core-reload\configsets\configset-2\conf
   [junit4]   2> 3993331 T14104 oasr.ManagedResource.reloadFromStorage WARN No stored data found for /rest/managed
   [junit4]   2> 3993331 T14104 oasr.ManagedResource.notifyObserversDuringInit WARN No registered observers for /rest/managed
   [junit4]   2> 3993331 T14104 oasr.RestManager.init Initializing 0 registered ManagedResources
   [junit4]   2> 3993333 T14104 oasu.DefaultSolrCoreState.newIndexWriter Creating new IndexWriter...
   [junit4]   2> 3993334 T14104 oasu.DefaultSolrCoreState.newIndexWriter Waiting until IndexWriter is unused... core=core1
   [junit4]   2> 3993334 T14104 oasu.DefaultSolrCoreState.newIndexWriter Closing old IndexWriter... core=core1
   [junit4]   2> 3993333 T14109 oasc.SolrCore.registerSearcher [core1] Registered new searcher Searcher@18e5788[core1] main{UninvertingDirectoryReader()}
   [junit4]   2> 3993335 T14104 oasc.SolrDeletionPolicy.onInit SolrDeletionPolicy.onInit: commits: num=1
   [junit4]   2> 		commit{dir=MockDirectoryWrapper(RAMDirectory@889374 lockFactory=NativeFSLockFactory@C:\Users\JenkinsSlave\workspace\Lucene-Solr-trunk-Windows\solr\build\solr-core\test\J0\.\temp\solr.core.TestConfigSets-AC5C09D8931AE423-001\init-core-data-001\core-reload\core\data\index),segFN=segments_1,generation=1}
   [junit4]   2> 3993335 T14104 oasc.SolrDeletionPolicy.updateCommits newest commit generation = 1
   [junit4]   2> 3993335 T14104 oasu.DefaultSolrCoreState.newIndexWriter New IndexWriter is ready to be used.
   [junit4]   2> 3993337 T14104 oass.SolrIndexSearcher.<init> Opening Searcher@29e62f[core1] main
   [junit4]   2> 3993338 T14104 oasc.CoreContainer.registerCore replacing core: core1
   [junit4]   2> 3993338 T14104 oasc.SolrCore.close [core1]  CLOSING SolrCore org.apache.solr.core.SolrCore@12fb1f9
   [junit4]   2> 3993338 T14104 oasu.DirectUpdateHandler2.close closing DirectUpdateHandler2{commits=0,autocommits=0,soft autocommits=0,optimizes=0,rollbacks=0,expungeDeletes=0,docsPending=0,adds=0,deletesById=0,deletesByQuery=0,errors=0,cumulative_adds=0,cumulative_deletesById=0,cumulative_deletesByQuery=0,cumulative_errors=0}
   [junit4]   2> 3993338 T14109 oasc.SolrCore.registerSearcher [core1] Registered new searcher Searcher@29e62f[core1] main{UninvertingDirectoryReader()}
   [junit4]   2> 3993339 T14104 oasc.SolrCore.closeSearcher [core1] Closing main searcher on request.
   [junit4]   2> 3993340 T14104 oasc.CoreContainer.shutdown Shutting down CoreContainer instance=30019362
   [junit4]   2> 3993340 T14104 oasc.SolrCore.close [core1]  CLOSING SolrCore org.apache.solr.core.SolrCore@30d60a
   [junit4]   2> 3993341 T14104 oasu.DirectUpdateHandler2.close closing DirectUpdateHandler2{commits=0,autocommits=0,soft autocommits=0,optimizes=0,rollbacks=0,expungeDeletes=0,docsPending=0,adds=0,deletesById=0,deletesByQuery=0,errors=0,cumulative_adds=0,cumulative_deletesById=0,cumulative_deletesByQuery=0,cumulative_errors=0}
   [junit4]   2> 3993341 T14104 oasu.SolrCoreState.decrefSolrCoreState Closing SolrCoreState
   [junit4]   2> 3993342 T14104 oasu.DefaultSolrCoreState.closeIndexWriter SolrCoreState ref count has reached 0 - closing IndexWriter
   [junit4]   2> 3993342 T14104 oasu.DefaultSolrCoreState.closeIndexWriter closing IndexWriter with IndexWriterCloser
   [junit4]   2> 3993343 T14104 oasc.SolrCore.closeSearcher [core1] Closing main searcher on request.
   [junit4]   2> 3993343 T14104 oasc.CachingDirectoryFactory.close Closing MockDirectoryFactory - 2 directories currently being tracked
   [junit4]   2> 3993343 T14104 oasc.CachingDirectoryFactory.closeCacheValue looking to close C:\Users\JenkinsSlave\workspace\Lucene-Solr-trunk-Windows\solr\build\solr-core\test\J0\.\temp\solr.core.TestConfigSets-AC5C09D8931AE423-001\init-core-data-001\core-reload\core\data\index [CachedDir<<refCount=0;path=C:\Users\JenkinsSlave\workspace\Lucene-Solr-trunk-Windows\solr\build\solr-core\test\J0\.\temp\solr.core.TestConfigSets-AC5C09D8931AE423-001\init-core-data-001\core-reload\core\data\index;done=false>>]
   [junit4]   2> 3993343 T14104 oasc.CachingDirectoryFactory.close Closing directory: C:\Users\JenkinsSlave\workspace\Lucene-Solr-trunk-Windows\solr\build\solr-core\test\J0\.\temp\solr.core.TestConfigSets-AC5C09D8931AE423-001\init-core-data-001\core-reload\core\data\index
   [junit4]   2> 3993345 T14104 oasc.CachingDirectoryFactory.closeCacheValue looking to close C:\Users\JenkinsSlave\workspace\Lucene-Solr-trunk-Windows\solr\build\solr-core\test\J0\.\temp\solr.core.TestConfigSets-AC5C09D8931AE423-001\init-core-data-001\core-reload\core\data\ [CachedDir<<refCount=0;path=C:\Users\JenkinsSlave\workspace\Lucene-Solr-trunk-Windows\solr\build\solr-core\test\J0\.\temp\solr.core.TestConfigSets-AC5C09D8931AE423-001\init-core-data-001\core-reload\core\data\;done=false>>]
   [junit4]   2> 3993345 T14104 oasc.CachingDirectoryFactory.close Closing directory: C:\Users\JenkinsSlave\workspace\Lucene-Solr-trunk-Windows\solr\build\solr-core\test\J0\.\temp\solr.core.TestConfigSets-AC5C09D8931AE423-001\init-core-data-001\core-reload\core\data\
   [junit4]   2> 3993345 T14104 oas.SolrTestCaseJ4.tearDown ###Ending testConfigSetOnCoreReload
   [junit4]   2> 3993352 T14104 oas.SolrTestCaseJ4.setUp ###Starting testDefaultConfigSetBasePathResolution
   [junit4]   2> 3993352 T14104 oasc.SolrResourceLoader.<init> new SolrResourceLoader for directory: '/path/to/solr/home\'
   [junit4]   2> 3993380 T14104 oas.SolrTestCaseJ4.tearDown ###Ending testDefaultConfigSetBasePathResolution
   [junit4]   2> NOTE: reproduce with: ant test  -Dtestcase=TestConfigSets -Dtests.method=testDefaultConfigSetBasePathResolution -Dtests.seed=AC5C09D8931AE423 -Dtests.slow=true -Dtests.locale=en_IE -Dtests.timezone=America/Coral_Harbour -Dtests.file.encoding=UTF-8
   [junit4] FAILURE 0.04s | TestConfigSets.testDefaultConfigSetBasePathResolution <<<
   [junit4]    > Throwable #1: java.lang.AssertionError: 
   [junit4]    > Expected: is "/path/to/solr/home/configsets"
   [junit4]    >      got: "C:\path\to\solr\home\configsets"
   [junit4]    > 	at __randomizedtesting.SeedInfo.seed([AC5C09D8931AE423:F87AFB14EE220D2F]:0)
   [junit4]    > 	at org.apache.solr.core.TestConfigSets.testDefaultConfigSetBasePathResolution(TestConfigSets.java:59)
   [junit4]    > 	at java.lang.Thread.run(Thread.java:745)
   [junit4]   2> 3993396 T14104 oas.SolrTestCaseJ4.setUp ###Starting testConfigSetServiceFindsConfigSets
   [junit4]   2> 3993402 T14104 oasc.SolrResourceLoader.<init> new SolrResourceLoader for directory: 'C:\Users\JenkinsSlave\workspace\Lucene-Solr-trunk-Windows\solr\build\solr-core\test\J0\.\temp\solr.core.TestConfigSets-AC5C09D8931AE423-001\tempDir-002\'
   [junit4]   2> 3993446 T14104 oasc.CorePropertiesLocator.<init> Config-defined core root directory: C:\Users\JenkinsSlave\workspace\Lucene-Solr-trunk-Windows\solr\build\solr-core\test\J0\.\temp\solr.core.TestConfigSets-AC5C09D8931AE423-001\tempDir-002
   [junit4]   2> 3993446 T14104 oasc.CoreContainer.<init> New CoreContainer 24118993
   [junit4]   2> 3993446 T14104 oasc.CoreContainer.load Loading cores into CoreContainer [instanceDir=C:\Users\JenkinsSlave\workspace\Lucene-Solr-trunk-Windows\solr\build\solr-core\test\J0\.\temp\solr.core.TestConfigSets-AC5C09D8931AE423-001\tempDir-002\]
   [junit4]   2> 3993450 T14104 oashc.HttpShardHandlerFactory.getParameter Setting socketTimeout to: 0
   [junit4]   2> 3993450 T14104 oashc.HttpShardHandlerFactory.getParameter Setting urlScheme to: null
   [junit4]   2> 3993450 T14104 oashc.HttpShardHandlerFactory.getParameter Setting connTimeout to: 0
   [junit4]   2> 3993450 T14104 oashc.HttpShardHandlerFactory.getParameter Setting maxConnectionsPerHost to: 20
   [junit4]   2> 3993450 T14104 oashc.HttpShardHandlerFactory.getParameter Setting corePoolSize to: 0
   [junit4]   2> 3993450 T14104 oashc.HttpShardHandlerFactory.getParameter Setting maximumPoolSize to: 2147483647
   [junit4]   2> 3993450 T14104 oashc.HttpShardHandlerFactory.getParameter Setting maxThreadIdleTime to: 5
   [junit4]   2> 3993452 T14104 oashc.HttpShardHandlerFactory.getParameter Setting sizeOfQueue to: -1
   [junit4]   2> 3993453 T14104 oashc.HttpShardHandlerFactory.getParameter Setting fairnessPolicy to: false
   [junit4]   2> 3993454 T14104 oasl.LogWatcher.createWatcher SLF4J impl is org.slf4j.impl.Log4jLoggerFactory
   [junit4]   2> 3993454 T14104 oasl.LogWatcher.newRegisteredLogWatcher Registering Log Listener [Log4j (org.slf4j.impl.Log4jLoggerFactory)]
   [junit4]   2> 3993454 T14104 oasc.CoreContainer.load Host Name: null
   [junit4]   2> 3993456 T14104 oasc.CorePropertiesLocator.discover Looking for core definitions underneath C:\Users\JenkinsSlave\workspace\Lucene-Solr-trunk-Windows\solr\build\solr-core\test\J0\.\temp\solr.core.TestConfigSets-AC5C09D8931AE423-001\tempDir-002
   [junit4]   2> 3993457 T14104 oasc.CorePropertiesLocator.discover Found 0 core definitions
   [junit4]   2> 3993457 T14104 oasc.SolrResourceLoader.<init> new SolrResourceLoader for directory: 'C:\Users\JenkinsSlave\workspace\Lucene-Solr-trunk-Windows\solr\core\src\test-files\solr\configsets\configset-2\'
   [junit4]   2> 3993492 T14104 oasc.SolrConfig.<init> Using Lucene MatchVersion: LUCENE_5_0
   [junit4]   2> 3993501 T14104 oasc.SolrConfig.<init> Loaded SolrConfig: solrconfig.xml
   [junit4]   2> 3993501 T14104 oass.IndexSchema.readSchema Reading Solr Schema from schema.xml
   [junit4]   2> 3993506 T14104 oass.IndexSchema.readSchema [core1] Schema name=minimal
   [junit4]   2> 3993508 T14104 oass.IndexSchema.readSchema WARN no uniqueKey specified in schema.
   [junit4]   2> 3993508 T14104 oasc.CoreContainer.create Creating SolrCore 'core1' using configuration from configset C:\Users\JenkinsSlave\workspace\Lucene-Solr-trunk-Windows\solr\core\src\test-files\solr\configsets\configset-2
   [junit4]   2> 3993508 T14104 oasc.SolrCore.initDirectoryFactory org.apache.solr.core.MockDirectoryFactory
   [junit4]   2> 3993511 T14104 oasc.SolrCore.<init> [core1] Opening new SolrCore at C:\Users\JenkinsSlave\workspace\Lucene-Solr-trunk-Windows\solr\core\src\test-files\solr\configsets\configset-2\, dataDir=C:\Users\JenkinsSlave\workspace\Lucene-Solr-trunk-Windows\solr\build\solr-core\test\J0\.\temp\solr.core.TestConfigSets-AC5C09D8931AE423-001\tempDir-002core1\data\
   [junit4]   2> 3993511 T14104 oasc.SolrCore.<init> JMX monitoring not detected for core: core1
   [junit4]   2> 3993511 T14104 oasc.CachingDirectoryFactory.get return new directory for C:\Users\JenkinsSlave\workspace\Lucene-Solr-trunk-Windows\solr\build\solr-core\test\J0\.\temp\solr.core.TestConfigSets-AC5C09D8931AE423-001\tempDir-002core1\data\
   [junit4]   2> 3993511 T14104 oasc.SolrCore.getNewIndexDir New index directory detected: old=null new=C:\Users\JenkinsSlave\workspace\Lucene-Solr-trunk-Windows\solr\build\solr-core\test\J0\.\temp\solr.core.TestConfigSets-AC5C09D8931AE423-001\tempDir-002core1\data\index/
   [junit4]   2> 3993511 T14104 oasc.SolrCore.initIndex WARN [core1] Solr index directory 'C:\Users\JenkinsSlave\workspace\Lucene-Solr-trunk-Windows\solr\build\solr-core\test\J0\.\temp\solr.core.TestConfigSets-AC5C09D8931AE423-001\tempDir-002core1\data\index' doesn't exist. Creating new index...
   [junit4]   2> 3993513 T14104 oasc.CachingDirectoryFactory.get return new directory for C:\Users\JenkinsSlave\workspace\Lucene-Solr-trunk-Windows\solr\build\solr-core\test\J0\.\temp\solr.core.TestConfigSets-AC5C09D8931AE423-001\tempDir-002core1\data\index
   [junit4]   2> 3993518 T14104 oasc.SolrDeletionPolicy.onCommit SolrDeletionPolicy.onCommit: commits: num=1
   [junit4]   2> 		commit{dir=MockDirectoryWrapper(RAMDirectory@e78cc2 lockFactory=NativeFSLockFactory@C:\Users\JenkinsSlave\workspace\Lucene-Solr-trunk-Windows\solr\build\solr-core\test\J0\.\temp\solr.core.TestConfigSets-AC5C09D8931AE423-001\tempDir-002core1\data\index),segFN=segments_1,generation=1}
   [junit4]   2> 3993518 T14104 oasc.SolrDeletionPolicy.updateCommits newest commit generation = 1
   [junit4]   2> 3993520 T14104 oasc.SolrCore.loadUpdateProcessorChains no updateRequestProcessorChain defined as default, creating implicit default
   [junit4]   2> 3993522 T14104 oasc.RequestHandlers.initHandlersFromConfig created /select: solr.SearchHandler
   [junit4]   2> 3993522 T14104 oasc.RequestHandlers.initHandlersFromConfig created /admin/: org.apache.solr.handler.admin.AdminHandlers
   [junit4]   2> 3993522 T14104 oasc.RequestHandlers.initHandlersFromConfig created /update: solr.UpdateRequestHandler
   [junit4]   2> 3993523 T14104 oashl.XMLLoader.init xsltCacheLifetimeSeconds=60
   [junit4]   2> 3993526 T14104 oasu.CommitTracker.<init> Hard AutoCommit: disabled
   [junit4]   2> 3993526 T14104 oasu.CommitTracker.<init> Soft AutoCommit: disabled
   [junit4]   2> 3993527 T14104 oasc.SolrDeletionPolicy.onInit SolrDeletionPolicy.onInit: commits: num=1
   [junit4]   2> 		commit{dir=MockDirectoryWrapper(RAMDirectory@e78cc2 lockFactory=NativeFSLockFactory@C:\Users\JenkinsSlave\workspace\Lucene-Solr-trunk-Windows\solr\build\solr-core\test\J0\.\temp\solr.core.TestConfigSets-AC5C09D8931AE423-001\tempDir-002core1\data\index),segFN=segments_1,generation=1}
   [junit4]   2> 3993527 T14104 oasc.SolrDeletionPolicy.updateCommits newest commit generation = 1
   [junit4]   2> 3993528 T14104 oass.SolrIndexSearcher.<init> Opening Searcher@31789e[core1] main
   [junit4]   2> 3993528 T14104 oasr.ManagedResourceStorage$FileStorageIO.configure File-based storage initialized to use dir: C:\Users\JenkinsSlave\workspace\Lucene-Solr-trunk-Windows\solr\core\src\test-files\solr\configsets\configset-2\conf
   [junit4]   2> 3993528 T14104 oasr.RestManager.init Initializing RestManager with initArgs: {storageDir=C:\Users\JenkinsSlave\workspace\Lucene-Solr-trunk-Windows\solr\core\src\test-files\solr\configsets\configset-2\conf\}
   [junit4]   2> 3993528 T14104 oasr.ManagedResourceStorage.load Reading _rest_managed.json using file:dir=C:\Users\JenkinsSlave\workspace\Lucene-Solr-trunk-Windows\solr\core\src\test-files\solr\configsets\configset-2\conf
   [junit4]   2> 3993531 T14104 oasr.ManagedResource.reloadFromStorage WARN No stored data found for /rest/managed
   [junit4]   2> 3993532 T14104 oasr.ManagedResource.notifyObserversDuringInit WARN No registered observers for /rest/managed
   [junit4]   2> 3993532 T14104 oasr.RestManager.init Initializing 0 registered ManagedResources
   [junit4]   2> 3993533 T14104 oasc.SolrCore.close [core1]  CLOSING SolrCore org.apache.solr.core.SolrCore@259236
   [junit4]   2> 3993533 T14104 oasu.DirectUpdateHandler2.close closing DirectUpdateHandler2{commits=0,autocommits=0,soft autocommits=0,optimizes=0,rollbacks=0,expungeDeletes=0,docsPending=0,adds=0,deletesById=0,deletesByQuery=0,errors=0,cumulative_adds=0,cumulative_deletesById=0,cumulative_deletesByQuery=0,cumulative_errors=0}
   [junit4]   2> 3993533 T14104 oasu.SolrCoreState.decrefSolrCoreState Closing SolrCoreState
   [junit4]   2> 3993533 T14104 oasu.DefaultSolrCoreState.closeIndexWriter SolrCoreState ref count has reached 0 - closing IndexWriter
   [junit4]   2> 3993535 T14104 oasu.DefaultSolrCoreState.closeIndexWriter closing IndexWriter with IndexWriterCloser
   [junit4]   2> 3993536 T14111 oasc.SolrCore.registerSearcher [core1] Registered new searcher Searcher@31789e[core1] main{UninvertingDirectoryReader()}
   [junit4]   2> 3993536 T14104 oasc.SolrCore.closeSearcher [core1] Closing main searcher on request.
   [junit4]   2> 3993536 T14104 oasc.CachingDirectoryFactory.close Closing MockDirectoryFactory - 2 directories currently being tracked
   [junit4]   2> 3993536 T14104 oasc.CachingDirectoryFactory.closeCacheValue looking to close C:\Users\JenkinsSlave\workspace\Lucene-Solr-trunk-Windows\solr\build\solr-core\test\J0\.\temp\solr.core.TestConfigSets-AC5C09D8931AE423-001\tempDir-002core1\data\ [CachedDir<<refCount=0;path=C:\Users\JenkinsSlave\workspace\Lucene-Solr-trunk-Windows\solr\build\solr-core\test\J0\.\temp\solr.core.TestConfigSets-AC5C09D8931AE423-001\tempDir-002core1\data\;done=false>>]
   [junit4]   2> 3993536 T14104 oasc.CachingDirectoryFactory.close Closing directory: C:\Users\JenkinsSlave\workspace\Lucene-Solr-trunk-Windows\solr\build\solr-core\test\J0\.\temp\solr.core.TestConfigSets-AC5C09D8931AE423-001\tempDir-002core1\data\
   [junit4]   2> 3993536 T14104 oasc.CachingDirectoryFactory.closeCacheValue looking to close C:\Users\JenkinsSlave\workspace\Lucene-Solr-trunk-Windows\solr\build\solr-core\test\J0\.\temp\solr.core.TestConfigSets-AC5C09D8931AE423-001\tempDir-002core1\data\index [CachedDir<<refCount=0;path=C:\Users\JenkinsSlave\workspace\Lucene-Solr-trunk-Windows\solr\build\solr-core\test\J0\.\temp\solr.core.TestConfigSets-AC5C09D8931AE423-001\tempDir-002core1\data\index;done=false>>]
   [junit4]   2> 3993536 T14104 oasc.CachingDirectoryFactory.close Closing directory: C:\Users\JenkinsSlave\workspace\Lucene-Solr-trunk-Windows\solr\build\solr-core\test\J0\.\temp\solr.core.TestConfigSets-AC5C09D8931AE423-001\tempDir-002core1\data\index
   [junit4]   2> 3993538 T14104 oasc.CoreContainer.shutdown Shutting down CoreContainer instance=24118993
   [junit4]   2> 3993539 T14104 oas.SolrTestCaseJ4.tearDown ###Ending testConfigSetServiceFindsConfigSets
   [junit4]   2> 3993541 T14104 oas.SolrTestCaseJ4.deleteCore ###deleteCore
   [junit4]   2> NOTE: leaving temporary files on disk at: C:\Users\JenkinsSlave\workspace\Lucene-Solr-trunk-Windows\solr\build\solr-core\test\J0\.\temp\solr.core.TestConfigSets-AC5C09D8931AE423-001
   [junit4]   2> NOTE: test params are: codec=Asserting(Lucene49), sim=RandomSimilarityProvider(queryNorm=false,coord=yes): {}, locale=en_IE, timezone=America/Coral_Harbour
   [junit4]   2> NOTE: Windows 7 6.1 x86/Oracle Corporation 1.8.0_20-ea (32-bit)/cpus=2,threads=1,free=104544568,total=319193088
   [junit4]   2> NOTE: All tests run in this JVM: [TestSolrCoreProperties, TestUtils, CoreAdminHandlerTest, TestUniqueKeyFieldResource, DistributedQueryElevationComponentTest, AliasIntegrationTest, TestValueSourceCache, TestPerFieldSimilarity, TestCustomSort, TestSchemaResource, SuggesterWFSTTest, TestRecoveryHdfs, URLClassifyProcessorTest, SortByFunctionTest, TestDefaultSimilarityFactory, CoreContainerCoreInitFailuresTest, TestAnalyzedSuggestions, TestFreeTextSuggestions, SuggesterTSTTest, TestCoreContainer, BasicFunctionalityTest, CachingDirectoryFactoryTest, SpellingQueryConverterTest, TestMultiCoreConfBootstrap, TestAtomicUpdateErrorCases, NotRequiredUniqueKeyTest, FunctionTest, TestModifyConfFiles, DistributedTermsComponentTest, TestManagedResourceStorage, TestImplicitCoreProperties, TestJmxMonitoredMap, TestDynamicFieldResource, TestHashPartitioner, TestFieldCollectionResource, PrimitiveFieldTypeTest, TestDocBasedVersionConstraints, UpdateRequestProcessorFactoryTest, TermVectorComponentDistributedTest, HdfsChaosMonkeySafeLeaderTest, ConnectionManagerTest, IndexSchemaRuntimeFieldTest, TestLMDirichletSimilarityFactory, TestStressUserVersions, TestReplicationHandler, FullSolrCloudDistribCmdsTest, PrimUtilsTest, TestCoreDiscovery, DirectSolrConnectionTest, CoreMergeIndexesAdminHandlerTest, TestFiltering, TestQuerySenderListener, TestStandardQParsers, UniqFieldsUpdateProcessorFactoryTest, OverseerStatusTest, ClusterStateUpdateTest, TestSerializedLuceneMatchVersion, InfoHandlerTest, AutoCommitTest, BasicDistributedZk2Test, DistributedExpandComponentTest, TestRTGBase, TestClassNameShortening, LoggingHandlerTest, IndexBasedSpellCheckerTest, CSVRequestHandlerTest, TestRealTimeGet, DocumentAnalysisRequestHandlerTest, DefaultValueUpdateProcessorTest, TestSolrJ, SignatureUpdateProcessorFactoryTest, HdfsUnloadDistributedZkTest, TestReload, SuggestComponentTest, TestDFRSimilarityFactory, TestMiniSolrCloudCluster, TestNonNRTOpen, PreAnalyzedFieldTest, AtomicUpdatesTest, TestStressLucene, TestQuerySenderNoQuery, DirectUpdateHandlerTest, TestSimpleQParserPlugin, ZkSolrClientTest, NumericFieldsTest, TestConfig, ConvertedLegacyTest, TestBM25SimilarityFactory, SuggesterTest, PingRequestHandlerTest, BinaryUpdateRequestHandlerTest, TestRestManager, TestMaxScoreQueryParser, QueryElevationComponentTest, TestHighlightDedupGrouping, HdfsSyncSliceTest, FieldFacetTest, SolrRequestParserTest, HdfsBasicDistributedZkTest, TestLMJelinekMercerSimilarityFactory, ClusterStateTest, TestWriterPerf, TestFastLRUCache, TestNonDefinedSimilarityFactory, SliceStateUpdateTest, JsonLoaderTest, TestSolrXml, CoreAdminCreateDiscoverTest, AlternateDirectoryTest, TestSolrXmlPersistence, TestNoOpRegenerator, QueryFacetTest, ModifyConfFileTest, TestIndexingPerformance, OverseerRolesTest, DocValuesMissingTest, TestBlendedInfixSuggestions, SolrCoreCheckLockOnStartupTest, ChangedSchemaMergeTest, TestReversedWildcardFilterFactory, DistributedQueryComponentOptimizationTest, SolrInfoMBeanTest, SynonymTokenizerTest, BlockDirectoryTest, DeleteInactiveReplicaTest, PreAnalyzedUpdateProcessorTest, StatelessScriptUpdateProcessorFactoryTest, CacheHeaderTest, TestLRUCache, MultiTermTest, TestCopyFieldCollectionResource, TestPseudoReturnFields, ReplicationFactorTest, AnalyticsMergeStrategyTest, TestSchemaSimilarityResource, TestLFUCache, TestRangeQuery, SchemaVersionSpecificBehaviorTest, TestCollationFieldDocValues, TestMergePolicyConfig, TestSolrQueryParser, ZkControllerTest, SearchHandlerTest, RequiredFieldsTest, TestArbitraryIndexDir, TestSolrDeletionPolicy1, SpatialFilterTest, TestCloudInspectUtil, TestOmitPositions, MinimalSchemaTest, TestSystemIdResolver, HdfsRecoveryZkTest, XmlUpdateRequestHandlerTest, IndexSchemaTest, TestIndexSearcher, TestZkChroot, StressHdfsTest, TestJoin, TestOverriddenPrefixQueryForCustomFieldType, TestFieldResource, CircularListTest, ResponseLogComponentTest, LukeRequestHandlerTest, CursorMarkTest, UUIDFieldTest, BadCopyFieldTest, TestFieldSortValues, OverseerCollectionProcessorTest, TestSolrDeletionPolicy2, DisMaxRequestHandlerTest, NoFacetTest, TestManagedSchema, MBeansHandlerTest, TestManagedStopFilterFactory, TestReloadAndDeleteDocs, TestFieldTypeCollectionResource, SolrCmdDistributorTest, TestSolrQueryParserDefaultOperatorResource, TestDefaultSearchFieldResource, TestCharFilters, TestManagedSchemaFieldResource, QueryParsingTest, TestDistributedMissingSort, TestManagedSynonymFilterFactory, ShardRoutingTest, DistributedSuggestComponentTest, TriLevelCompositeIdRoutingTest, EnumFieldTest, HttpPartitionTest, TestWordDelimiterFilterFactory, TestSolrXMLSerializer, CursorPagingTest, DateFieldTest, TestRandomMergePolicy, SOLR749Test, SliceStateTest, TestDocSet, AbstractAnalyticsStatsTest, DistributedQueryComponentCustomSortTest, CoreAdminRequestStatusTest, BasicDistributedZkTest, ChaosMonkeySafeLeaderTest, UnloadDistributedZkTest, CollectionsAPIDistributedZkTest, SyncSliceTest, OpenCloseCoreStressTest, OverseerTest, LeaderElectionIntegrationTest, BasicZkTest, RecoveryZkTest, TestRandomFaceting, LeaderElectionTest, TestRandomDVFaceting, ZkCLITest, ShardRoutingCustomTest, TestDistributedSearch, TestDistributedGrouping, TestFaceting, TestRecovery, DistributedSpellCheckComponentTest, TestStressReorder, TestStressVersions, HardAutoCommitTest, SimpleFacetsTest, TestSolr4Spatial, SolrCoreTest, StatsComponentTest, SpellCheckComponentTest, TestGroupingSearch, PeerSyncTest, BadIndexSchemaTest, TestSort, TestFunctionQuery, TestLazyCores, TestBadConfig, HighlighterTest, SoftAutoCommitTest, ShowFileRequestHandlerTest, CurrencyFieldOpenExchangeTest, CurrencyFieldXmlFileTest, SolrIndexSplitterTest, SimplePostToolTest, AnalysisAfterCoreReloadTest, TestExtendedDismaxParser, SpellCheckCollatorTest, SuggesterFSTTest, TestFoldingMultitermQuery, DocValuesTest, TestTrie, TestCSVLoader, PolyFieldTest, NoCacheHeaderTest, WordBreakSolrSpellCheckerTest, TestUpdate, FieldMutatingUpdateProcessorTest, QueryEqualityTest, DirectUpdateHandlerOptimizeTest, TestRemoteStreaming, DocValuesMultiTest, DistanceFunctionTest, XsltUpdateRequestHandlerTest, DebugComponentTest, TestSurroundQueryParser, TestQueryUtils, StandardRequestHandlerTest, DirectSolrSpellCheckerTest, TestQueryTypes, FileBasedSpellCheckerTest, TermsComponentTest, RequestHandlersTest, DocumentBuilderTest, PathHierarchyTokenizerFactoryTest, TermVectorComponentTest, MoreLikeThisHandlerTest, FieldAnalysisRequestHandlerTest, FastVectorHighlighterTest, RegexBoostProcessorTest, SolrPluginUtilsTest, TestJmxIntegration, TestCollationField, ReturnFieldsTest, JSONWriterTest, TestCSVResponseWriter, TestPartialUpdateDeduplication, TestPHPSerializedResponseWriter, TestComponentsName, TestBinaryResponseWriter, HighlighterConfigTest, UpdateParamsTest, TestSolrIndexConfig, CopyFieldTest, SolrIndexConfigTest, BadComponentTest, TestStressRecovery, SampleTest, TestBinaryField, TestSearchPerf, TestElisionMultitermQuery, OutputWriterTest, TestFuzzyAnalyzedSuggestions, ExternalFileFieldSortTest, TestPostingsSolrHighlighter, TestLuceneMatchVersion, TestPhraseSuggestions, SpellPossibilityIteratorTest, TestCodecSupport, TestXIncludeConfig, EchoParamsTest, TestSweetSpotSimilarityFactory, TestIBSimilarityFactory, TestFastWriter, LegacyHTMLStripCharFilterTest, TimeZoneUtilsTest, ResourceLoaderTest, TestFastOutputStream, ScriptEngineTest, OpenExchangeRatesOrgProviderTest, PluginInfoTest, DateMathParserTest, ChaosMonkeyNothingIsSafeTest, TestSuggestSpellingConverter, DOMUtilTest, RAMDirectoryFactoryTest, TestDocumentBuilder, ZkNodePropsTest, SystemInfoHandlerTest, FileUtilsTest, SolrTestCaseJ4Test, TestCursorMarkWithoutUniqueKey, ExpressionTest, AbstractAnalyticsFacetTest, FieldFacetExtrasTest, RangeFacetTest, AssignTest, AsyncMigrateRouteKeyTest, CollectionsAPIAsyncDistributedZkTest, CustomCollectionTest, DeleteReplicaTest, DeleteShardTest, DistribCursorPagingTest, DistribDocExpirationUpdateProcessorTest, MigrateRouteKeyTest, MultiThreadedOCPTest, RemoteQueryErrorTest, SSLMigrationTest, ShardSplitTest, SolrXmlInZkTest, TestCollectionAPI, TestDistribDocBasedVersion, TestRequestStatusCollectionAPI, TestShortCircuitedRequests, HdfsBasicDistributedZk2Test, HdfsCollectionsAPIDistributedZkTest, HdfsWriteToMultipleCollectionsTest, QueryResultKeyTest, TestConfigSets]
   [junit4] Completed in 0.89s, 4 tests, 1 failure <<< FAILURES!

[...truncated 147 lines...]
BUILD FAILED
C:\Users\JenkinsSlave\workspace\Lucene-Solr-trunk-Windows\build.xml:467: The following error occurred while executing this line:
C:\Users\JenkinsSlave\workspace\Lucene-Solr-trunk-Windows\build.xml:447: The following error occurred while executing this line:
C:\Users\JenkinsSlave\workspace\Lucene-Solr-trunk-Windows\build.xml:45: The following error occurred while executing this line:
C:\Users\JenkinsSlave\workspace\Lucene-Solr-trunk-Windows\extra-targets.xml:37: The following error occurred while executing this line:
C:\Users\JenkinsSlave\workspace\Lucene-Solr-trunk-Windows\solr\build.xml:189: The following error occurred while executing this line:
C:\Users\JenkinsSlave\workspace\Lucene-Solr-trunk-Windows\solr\common-build.xml:496: The following error occurred while executing this line:
C:\Users\JenkinsSlave\workspace\Lucene-Solr-trunk-Windows\lucene\common-build.xml:1296: The following error occurred while executing this line:
C:\Users\JenkinsSlave\workspace\Lucene-Solr-trunk-Windows\lucene\common-build.xml:920: There were test failures: 415 suites, 1697 tests, 1 failure, 42 ignored (21 assumptions)

Total time: 111 minutes 50 seconds
Build step 'Invoke Ant' marked build as failure
Description set: Java: 32bit/jdk1.8.0_20-ea-b15 -client -XX:+UseConcMarkSweepGC
Archiving artifacts
Recording test results
Email was triggered for: Failure - Any
Sending email for trigger: Failure - Any



Mime
View raw message