lucene-dev mailing list archives

Site index · List index
Message view « Date » · « Thread »
Top « Date » · « Thread »
From Apache Jenkins Server <jenk...@builds.apache.org>
Subject [JENKINS-MAVEN] Lucene-Solr-Maven-trunk #1148: POMs out of sync
Date Sat, 31 May 2014 02:04:31 GMT
Build: https://builds.apache.org/job/Lucene-Solr-Maven-trunk/1148/

2 tests failed.
FAILED:  org.apache.solr.cloud.CollectionsAPIDistributedZkTest.testDistribSearch

Error Message:
There are still nodes recoverying - waited for 330 seconds

Stack Trace:
java.lang.AssertionError: There are still nodes recoverying - waited for 330 seconds
	at __randomizedtesting.SeedInfo.seed([9B6D809ADDE3BF0C:1A8B0E82AABCDF30]:0)
	at org.junit.Assert.fail(Assert.java:93)
	at org.apache.solr.cloud.AbstractDistribZkTestBase.waitForRecoveriesToFinish(AbstractDistribZkTestBase.java:178)
	at org.apache.solr.cloud.AbstractDistribZkTestBase.waitForRecoveriesToFinish(AbstractDistribZkTestBase.java:137)
	at org.apache.solr.cloud.AbstractDistribZkTestBase.waitForRecoveriesToFinish(AbstractDistribZkTestBase.java:132)
	at org.apache.solr.cloud.CollectionsAPIDistributedZkTest.testCollectionsAPI(CollectionsAPIDistributedZkTest.java:770)
	at org.apache.solr.cloud.CollectionsAPIDistributedZkTest.doTest(CollectionsAPIDistributedZkTest.java:203)


FAILED:  org.apache.solr.cloud.HttpPartitionTest.testDistribSearch

Error Message:
No registered leader was found after waiting for 60000ms , collection: c8n_1x3_lf slice: shard1

Stack Trace:
org.apache.solr.common.SolrException: No registered leader was found after waiting for 60000ms
, collection: c8n_1x3_lf slice: shard1
	at __randomizedtesting.SeedInfo.seed([75D3F100E960383D:F4357F189E3F5801]:0)
	at org.apache.solr.common.cloud.ZkStateReader.getLeaderRetry(ZkStateReader.java:567)
	at org.apache.solr.cloud.HttpPartitionTest.testRf3WithLeaderFailover(HttpPartitionTest.java:349)
	at org.apache.solr.cloud.HttpPartitionTest.doTest(HttpPartitionTest.java:148)




Build Log:
[...truncated 54639 lines...]
BUILD FAILED
/usr/home/hudson/hudson-slave/workspace/Lucene-Solr-Maven-trunk/build.xml:490: The following
error occurred while executing this line:
/usr/home/hudson/hudson-slave/workspace/Lucene-Solr-Maven-trunk/build.xml:182: The following
error occurred while executing this line:
/usr/home/hudson/hudson-slave/workspace/Lucene-Solr-Maven-trunk/extra-targets.xml:77: Java
returned: 1

Total time: 244 minutes 51 seconds
Build step 'Invoke Ant' marked build as failure
Recording test results
Email was triggered for: Failure
Sending email for trigger: Failure



Mime
View raw message