lucene-dev mailing list archives

Site index · List index
Message view « Date » · « Thread »
Top « Date » · « Thread »
From Policeman Jenkins Server <jenk...@thetaphi.de>
Subject [JENKINS] Lucene-Solr-4.x-Linux (32bit/jdk1.8.0_05) - Build # 10283 - Failure!
Date Tue, 27 May 2014 16:30:16 GMT
Build: http://jenkins.thetaphi.de/job/Lucene-Solr-4.x-Linux/10283/
Java: 32bit/jdk1.8.0_05 -server -XX:+UseG1GC

7 tests failed.
FAILED:  junit.framework.TestSuite.org.apache.lucene.search.TestControlledRealTimeReopenThread

Error Message:
Suite timeout exceeded (>= 7200000 msec).

Stack Trace:
java.lang.Exception: Suite timeout exceeded (>= 7200000 msec).
	at __randomizedtesting.SeedInfo.seed([CAAA2F0D6BFBABE]:0)


FAILED:  junit.framework.TestSuite.org.apache.lucene.search.TestControlledRealTimeReopenThread

Error Message:
Captured an uncaught exception in thread: Thread[id=575, name=Thread-477, state=RUNNABLE, group=TGRP-TestControlledRealTimeReopenThread]

Stack Trace:
com.carrotsearch.randomizedtesting.UncaughtExceptionError: Captured an uncaught exception in thread: Thread[id=575, name=Thread-477, state=RUNNABLE, group=TGRP-TestControlledRealTimeReopenThread]
Caused by: java.lang.RuntimeException: java.lang.AssertionError
	at __randomizedtesting.SeedInfo.seed([CAAA2F0D6BFBABE]:0)
	at org.apache.lucene.index.ThreadedIndexingAndSearchingTestCase$1.run(ThreadedIndexingAndSearchingTestCase.java:301)
Caused by: java.lang.AssertionError
	at org.apache.lucene.index.ByteSliceReader.readByte(ByteSliceReader.java:73)
	at org.apache.lucene.store.DataInput.readVInt(DataInput.java:120)
	at org.apache.lucene.index.FreqProxTermsWriterPerField.flush(FreqProxTermsWriterPerField.java:406)
	at org.apache.lucene.index.FreqProxTermsWriter.flush(FreqProxTermsWriter.java:80)
	at org.apache.lucene.index.DefaultIndexingChain.flush(DefaultIndexingChain.java:117)
	at org.apache.lucene.index.DocumentsWriterPerThread.flush(DocumentsWriterPerThread.java:415)
	at org.apache.lucene.index.DocumentsWriter.doFlush(DocumentsWriter.java:512)
	at org.apache.lucene.index.DocumentsWriter.preUpdate(DocumentsWriter.java:362)
	at org.apache.lucene.index.DocumentsWriter.updateDocument(DocumentsWriter.java:444)
	at org.apache.lucene.index.IndexWriter.updateDocument(IndexWriter.java:1496)
	at org.apache.lucene.index.IndexWriter.updateDocument(IndexWriter.java:1469)
	at org.apache.lucene.index.TrackingIndexWriter.updateDocument(TrackingIndexWriter.java:64)
	at org.apache.lucene.search.TestControlledRealTimeReopenThread.updateDocument(TestControlledRealTimeReopenThread.java:168)
	at org.apache.lucene.index.ThreadedIndexingAndSearchingTestCase$1.run(ThreadedIndexingAndSearchingTestCase.java:253)


FAILED:  junit.framework.TestSuite.org.apache.lucene.search.TestControlledRealTimeReopenThread

Error Message:
Captured an uncaught exception in thread: Thread[id=573, name=NRTDeletes Reopen Thread, state=RUNNABLE, group=TGRP-TestControlledRealTimeReopenThread]

Stack Trace:
com.carrotsearch.randomizedtesting.UncaughtExceptionError: Captured an uncaught exception in thread: Thread[id=573, name=NRTDeletes Reopen Thread, state=RUNNABLE, group=TGRP-TestControlledRealTimeReopenThread]
Caused by: java.lang.AssertionError
	at __randomizedtesting.SeedInfo.seed([CAAA2F0D6BFBABE]:0)
	at org.apache.lucene.index.ByteSliceReader.readByte(ByteSliceReader.java:73)
	at org.apache.lucene.store.DataInput.readVInt(DataInput.java:120)
	at org.apache.lucene.index.FreqProxTermsWriterPerField.flush(FreqProxTermsWriterPerField.java:458)
	at org.apache.lucene.index.FreqProxTermsWriter.flush(FreqProxTermsWriter.java:80)
	at org.apache.lucene.index.DefaultIndexingChain.flush(DefaultIndexingChain.java:117)
	at org.apache.lucene.index.DocumentsWriterPerThread.flush(DocumentsWriterPerThread.java:415)
	at org.apache.lucene.index.DocumentsWriter.doFlush(DocumentsWriter.java:512)
	at org.apache.lucene.index.DocumentsWriter.flushAllThreads(DocumentsWriter.java:622)
	at org.apache.lucene.index.IndexWriter.getReader(IndexWriter.java:377)
	at org.apache.lucene.index.StandardDirectoryReader.doOpenFromWriter(StandardDirectoryReader.java:286)
	at org.apache.lucene.index.StandardDirectoryReader.doOpenIfChanged(StandardDirectoryReader.java:261)
	at org.apache.lucene.index.StandardDirectoryReader.doOpenIfChanged(StandardDirectoryReader.java:251)
	at org.apache.lucene.index.DirectoryReader.openIfChanged(DirectoryReader.java:171)
	at org.apache.lucene.search.SearcherManager.refreshIfNeeded(SearcherManager.java:118)
	at org.apache.lucene.search.SearcherManager.refreshIfNeeded(SearcherManager.java:58)
	at org.apache.lucene.search.ReferenceManager.doMaybeRefresh(ReferenceManager.java:176)
	at org.apache.lucene.search.ReferenceManager.maybeRefreshBlocking(ReferenceManager.java:253)
	at org.apache.lucene.search.ControlledRealTimeReopenThread.run(ControlledRealTimeReopenThread.java:245)


FAILED:  junit.framework.TestSuite.org.apache.lucene.search.TestControlledRealTimeReopenThread

Error Message:
Captured an uncaught exception in thread: Thread[id=576, name=Thread-478, state=RUNNABLE, group=TGRP-TestControlledRealTimeReopenThread]

Stack Trace:
com.carrotsearch.randomizedtesting.UncaughtExceptionError: Captured an uncaught exception in thread: Thread[id=576, name=Thread-478, state=RUNNABLE, group=TGRP-TestControlledRealTimeReopenThread]
Caused by: java.lang.RuntimeException: java.lang.AssertionError: expected:<1> but was:<0>
	at __randomizedtesting.SeedInfo.seed([CAAA2F0D6BFBABE]:0)
	at org.apache.lucene.index.ThreadedIndexingAndSearchingTestCase$1.run(ThreadedIndexingAndSearchingTestCase.java:301)
Caused by: java.lang.AssertionError: expected:<1> but was:<0>
	at org.junit.Assert.fail(Assert.java:93)
	at org.junit.Assert.failNotEquals(Assert.java:647)
	at org.junit.Assert.assertEquals(Assert.java:128)
	at org.junit.Assert.assertEquals(Assert.java:472)
	at org.junit.Assert.assertEquals(Assert.java:456)
	at org.apache.lucene.search.TestControlledRealTimeReopenThread.updateDocument(TestControlledRealTimeReopenThread.java:180)
	at org.apache.lucene.index.ThreadedIndexingAndSearchingTestCase$1.run(ThreadedIndexingAndSearchingTestCase.java:253)


FAILED:  junit.framework.TestSuite.org.apache.lucene.search.TestControlledRealTimeReopenThread

Error Message:
Captured an uncaught exception in thread: Thread[id=578, name=Thread-480, state=RUNNABLE, group=TGRP-TestControlledRealTimeReopenThread]

Stack Trace:
com.carrotsearch.randomizedtesting.UncaughtExceptionError: Captured an uncaught exception in thread: Thread[id=578, name=Thread-480, state=RUNNABLE, group=TGRP-TestControlledRealTimeReopenThread]
Caused by: java.lang.RuntimeException: java.lang.AssertionError
	at __randomizedtesting.SeedInfo.seed([CAAA2F0D6BFBABE]:0)
	at org.apache.lucene.index.ThreadedIndexingAndSearchingTestCase$1.run(ThreadedIndexingAndSearchingTestCase.java:301)
Caused by: java.lang.AssertionError
	at org.apache.lucene.index.ByteSliceReader.readByte(ByteSliceReader.java:73)
	at org.apache.lucene.store.DataInput.readVInt(DataInput.java:120)
	at org.apache.lucene.index.FreqProxTermsWriterPerField.flush(FreqProxTermsWriterPerField.java:458)
	at org.apache.lucene.index.FreqProxTermsWriter.flush(FreqProxTermsWriter.java:80)
	at org.apache.lucene.index.DefaultIndexingChain.flush(DefaultIndexingChain.java:117)
	at org.apache.lucene.index.DocumentsWriterPerThread.flush(DocumentsWriterPerThread.java:415)
	at org.apache.lucene.index.DocumentsWriter.doFlush(DocumentsWriter.java:512)
	at org.apache.lucene.index.DocumentsWriter.postUpdate(DocumentsWriter.java:388)
	at org.apache.lucene.index.DocumentsWriter.updateDocuments(DocumentsWriter.java:438)
	at org.apache.lucene.index.IndexWriter.updateDocuments(IndexWriter.java:1310)
	at org.apache.lucene.index.IndexWriter.updateDocuments(IndexWriter.java:1288)
	at org.apache.lucene.index.TrackingIndexWriter.updateDocuments(TrackingIndexWriter.java:82)
	at org.apache.lucene.search.TestControlledRealTimeReopenThread.updateDocuments(TestControlledRealTimeReopenThread.java:99)
	at org.apache.lucene.index.ThreadedIndexingAndSearchingTestCase$1.run(ThreadedIndexingAndSearchingTestCase.java:212)


REGRESSION:  org.apache.lucene.search.TestControlledRealTimeReopenThread.testControlledRealTimeReopenThread

Error Message:
Test abandoned because suite timeout was reached.

Stack Trace:
java.lang.Exception: Test abandoned because suite timeout was reached.
	at __randomizedtesting.SeedInfo.seed([CAAA2F0D6BFBABE]:0)


REGRESSION:  org.apache.lucene.search.TestSort.testMaxScore

Error Message:


Stack Trace:
java.lang.AssertionError
	at __randomizedtesting.SeedInfo.seed([CAAA2F0D6BFBABE:68D831A3F7E0A5A3]:0)
	at org.apache.lucene.index.FreqProxTermsWriterPerField.flush(FreqProxTermsWriterPerField.java:410)
	at org.apache.lucene.index.FreqProxTermsWriter.flush(FreqProxTermsWriter.java:80)
	at org.apache.lucene.index.DefaultIndexingChain.flush(DefaultIndexingChain.java:117)
	at org.apache.lucene.index.DocumentsWriterPerThread.flush(DocumentsWriterPerThread.java:415)
	at org.apache.lucene.index.DocumentsWriter.doFlush(DocumentsWriter.java:512)
	at org.apache.lucene.index.DocumentsWriter.flushAllThreads(DocumentsWriter.java:622)
	at org.apache.lucene.index.IndexWriter.prepareCommitInternal(IndexWriter.java:2897)
	at org.apache.lucene.index.IndexWriter.commitInternal(IndexWriter.java:3056)
	at org.apache.lucene.index.IndexWriter.commit(IndexWriter.java:3023)
	at org.apache.lucene.search.TestSort.testMaxScore(TestSort.java:1289)
	at sun.reflect.NativeMethodAccessorImpl.invoke0(Native Method)
	at sun.reflect.NativeMethodAccessorImpl.invoke(NativeMethodAccessorImpl.java:62)
	at sun.reflect.DelegatingMethodAccessorImpl.invoke(DelegatingMethodAccessorImpl.java:43)
	at java.lang.reflect.Method.invoke(Method.java:483)
	at com.carrotsearch.randomizedtesting.RandomizedRunner.invoke(RandomizedRunner.java:1618)
	at com.carrotsearch.randomizedtesting.RandomizedRunner$6.evaluate(RandomizedRunner.java:827)
	at com.carrotsearch.randomizedtesting.RandomizedRunner$7.evaluate(RandomizedRunner.java:863)
	at com.carrotsearch.randomizedtesting.RandomizedRunner$8.evaluate(RandomizedRunner.java:877)
	at org.apache.lucene.util.TestRuleSetupTeardownChained$1.evaluate(TestRuleSetupTeardownChained.java:50)
	at org.apache.lucene.util.TestRuleFieldCacheSanity$1.evaluate(TestRuleFieldCacheSanity.java:51)
	at org.apache.lucene.util.AbstractBeforeAfterRule$1.evaluate(AbstractBeforeAfterRule.java:46)
	at com.carrotsearch.randomizedtesting.rules.SystemPropertiesInvariantRule$1.evaluate(SystemPropertiesInvariantRule.java:55)
	at org.apache.lucene.util.TestRuleThreadAndTestName$1.evaluate(TestRuleThreadAndTestName.java:49)
	at org.apache.lucene.util.TestRuleIgnoreAfterMaxFailures$1.evaluate(TestRuleIgnoreAfterMaxFailures.java:65)
	at org.apache.lucene.util.TestRuleMarkFailure$1.evaluate(TestRuleMarkFailure.java:48)
	at com.carrotsearch.randomizedtesting.rules.StatementAdapter.evaluate(StatementAdapter.java:36)
	at com.carrotsearch.randomizedtesting.ThreadLeakControl$StatementRunner.run(ThreadLeakControl.java:360)
	at com.carrotsearch.randomizedtesting.ThreadLeakControl.forkTimeoutingTask(ThreadLeakControl.java:793)
	at com.carrotsearch.randomizedtesting.ThreadLeakControl$3.evaluate(ThreadLeakControl.java:453)
	at com.carrotsearch.randomizedtesting.RandomizedRunner.runSingleTest(RandomizedRunner.java:836)
	at com.carrotsearch.randomizedtesting.RandomizedRunner$3.evaluate(RandomizedRunner.java:738)
	at com.carrotsearch.randomizedtesting.RandomizedRunner$4.evaluate(RandomizedRunner.java:772)
	at com.carrotsearch.randomizedtesting.RandomizedRunner$5.evaluate(RandomizedRunner.java:783)
	at org.apache.lucene.util.AbstractBeforeAfterRule$1.evaluate(AbstractBeforeAfterRule.java:46)
	at org.apache.lucene.util.TestRuleStoreClassName$1.evaluate(TestRuleStoreClassName.java:42)
	at com.carrotsearch.randomizedtesting.rules.SystemPropertiesInvariantRule$1.evaluate(SystemPropertiesInvariantRule.java:55)
	at com.carrotsearch.randomizedtesting.rules.NoShadowingOrOverridesOnMethodsRule$1.evaluate(NoShadowingOrOverridesOnMethodsRule.java:39)
	at com.carrotsearch.randomizedtesting.rules.NoShadowingOrOverridesOnMethodsRule$1.evaluate(NoShadowingOrOverridesOnMethodsRule.java:39)
	at com.carrotsearch.randomizedtesting.rules.StatementAdapter.evaluate(StatementAdapter.java:36)
	at com.carrotsearch.randomizedtesting.rules.StatementAdapter.evaluate(StatementAdapter.java:36)
	at com.carrotsearch.randomizedtesting.rules.StatementAdapter.evaluate(StatementAdapter.java:36)
	at org.apache.lucene.util.TestRuleAssertionsRequired$1.evaluate(TestRuleAssertionsRequired.java:43)
	at org.apache.lucene.util.TestRuleMarkFailure$1.evaluate(TestRuleMarkFailure.java:48)
	at org.apache.lucene.util.TestRuleIgnoreAfterMaxFailures$1.evaluate(TestRuleIgnoreAfterMaxFailures.java:65)
	at org.apache.lucene.util.TestRuleIgnoreTestSuites$1.evaluate(TestRuleIgnoreTestSuites.java:55)
	at com.carrotsearch.randomizedtesting.rules.StatementAdapter.evaluate(StatementAdapter.java:36)
	at com.carrotsearch.randomizedtesting.ThreadLeakControl$StatementRunner.run(ThreadLeakControl.java:360)
	at java.lang.Thread.run(Thread.java:745)




Build Log:
[...truncated 613 lines...]
   [junit4] Suite: org.apache.lucene.search.TestSort
   [junit4]   2> NOTE: reproduce with: ant test  -Dtestcase=TestSort -Dtests.method=testMaxScore -Dtests.seed=CAAA2F0D6BFBABE -Dtests.multiplier=3 -Dtests.slow=true -Dtests.locale=es_PY -Dtests.timezone=Africa/Monrovia -Dtests.file.encoding=US-ASCII
   [junit4] FAILURE 0.01s J0 | TestSort.testMaxScore <<<
   [junit4]    > Throwable #1: java.lang.AssertionError
   [junit4]    > 	at __randomizedtesting.SeedInfo.seed([CAAA2F0D6BFBABE:68D831A3F7E0A5A3]:0)
   [junit4]    > 	at org.apache.lucene.index.FreqProxTermsWriterPerField.flush(FreqProxTermsWriterPerField.java:410)
   [junit4]    > 	at org.apache.lucene.index.FreqProxTermsWriter.flush(FreqProxTermsWriter.java:80)
   [junit4]    > 	at org.apache.lucene.index.DefaultIndexingChain.flush(DefaultIndexingChain.java:117)
   [junit4]    > 	at org.apache.lucene.index.DocumentsWriterPerThread.flush(DocumentsWriterPerThread.java:415)
   [junit4]    > 	at org.apache.lucene.index.DocumentsWriter.doFlush(DocumentsWriter.java:512)
   [junit4]    > 	at org.apache.lucene.index.DocumentsWriter.flushAllThreads(DocumentsWriter.java:622)
   [junit4]    > 	at org.apache.lucene.index.IndexWriter.prepareCommitInternal(IndexWriter.java:2897)
   [junit4]    > 	at org.apache.lucene.index.IndexWriter.commitInternal(IndexWriter.java:3056)
   [junit4]    > 	at org.apache.lucene.index.IndexWriter.commit(IndexWriter.java:3023)
   [junit4]    > 	at org.apache.lucene.search.TestSort.testMaxScore(TestSort.java:1289)
   [junit4]    > 	at java.lang.Thread.run(Thread.java:745)
   [junit4]   2> NOTE: test params are: codec=Lucene40, sim=DefaultSimilarity, locale=es_PY, timezone=Africa/Monrovia
   [junit4]   2> NOTE: Linux 3.8.0-39-generic i386/Oracle Corporation 1.8.0_05 (32-bit)/cpus=8,threads=1,free=107444184,total=536870912
   [junit4]   2> NOTE: All tests run in this JVM: [TestFieldCacheSanityChecker, Test2BPostings, TestSpansAdvanced, TestArrayUtil, TestIndexReaderClose, TestIndexWriterOutOfFileDescriptors, TestFlushByRamOrCountsPolicy, TestNumericTokenStream, TestMultiLevelSkipList, TestFixedBitSet, TestCompressingTermVectorsFormat, TestPositiveScoresOnlyCollector, Test2BNumericDocValues, TestDeterminism, TestShardSearching, Test2BSortedDocValues, TestNIOFSDirectory, TestLucene3xPostingsFormat, TestPagedBytes, TestBinaryDocument, TestPayloadNearQuery, TestBytesRef, TestMatchAllDocsQuery, TestDeletionPolicy, TestStressIndexing, TestFieldReuse, FuzzyTermOnShortTermsTest, TestBytesStore, TestIndexWriterCommit, TestRegexpQuery, TestIndexWriterMerging, Test4GBStoredFields, TestBufferedChecksum, TestSimilarity, TestSort]
   [junit4] Completed on J0 in 0.40s, 53 tests, 1 failure <<< FAILURES!

[...truncated 1064 lines...]
   [junit4] Suite: org.apache.lucene.search.TestControlledRealTimeReopenThread
   [junit4]   1> Thread-477: hit exc
   [junit4]   2> java.lang.AssertionError
   [junit4]   2> 	at org.apache.lucene.index.ByteSliceReader.readByte(ByteSliceReader.java:73)
   [junit4]   2> 	at org.apache.lucene.store.DataInput.readVInt(DataInput.java:120)
   [junit4]   2> 	at org.apache.lucene.index.FreqProxTermsWriterPerField.flush(FreqProxTermsWriterPerField.java:406)
   [junit4]   2> 	at org.apache.lucene.index.FreqProxTermsWriter.flush(FreqProxTermsWriter.java:80)
   [junit4]   2> 	at org.apache.lucene.index.DefaultIndexingChain.flush(DefaultIndexingChain.java:117)
   [junit4]   2> 	at org.apache.lucene.index.DocumentsWriterPerThread.flush(DocumentsWriterPerThread.java:415)
   [junit4]   2> 	at org.apache.lucene.index.DocumentsWriter.doFlush(DocumentsWriter.java:512)
   [junit4]   2> 	at org.apache.lucene.index.DocumentsWriter.preUpdate(DocumentsWriter.java:362)
   [junit4]   2> 	at org.apache.lucene.index.DocumentsWriter.updateDocument(DocumentsWriter.java:444)
   [junit4]   2> 	at org.apache.lucene.index.IndexWriter.updateDocument(IndexWriter.java:1496)
   [junit4]   2> 	at org.apache.lucene.index.IndexWriter.updateDocument(IndexWriter.java:1469)
   [junit4]   2> 	at org.apache.lucene.index.TrackingIndexWriter.updateDocument(TrackingIndexWriter.java:64)
   [junit4]   2> 	at org.apache.lucene.search.TestControlledRealTimeReopenThread.updateDocument(TestControlledRealTimeReopenThread.java:168)
   [junit4]   2> 	at org.apache.lucene.index.ThreadedIndexingAndSearchingTestCase$1.run(ThreadedIndexingAndSearchingTestCase.java:253)
   [junit4]   1> Thread-478: hit exc
   [junit4]   2> java.lang.AssertionError: expected:<1> but was:<0>
   [junit4]   2> 	at org.junit.Assert.fail(Assert.java:93)
   [junit4]   2> 	at org.junit.Assert.failNotEquals(Assert.java:647)
   [junit4]   2> 	at org.junit.Assert.assertEquals(Assert.java:128)
   [junit4]   2> 	at org.junit.Assert.assertEquals(Assert.java:472)
   [junit4]   2> 	at org.junit.Assert.assertEquals(Assert.java:456)
   [junit4]   1> Thread-480: hit exc
   [junit4]   2> 	at org.apache.lucene.search.TestControlledRealTimeReopenThread.updateDocument(TestControlledRealTimeReopenThread.java:180)
   [junit4]   2> 	at org.apache.lucene.index.ThreadedIndexingAndSearchingTestCase$1.run(ThreadedIndexingAndSearchingTestCase.java:253)
   [junit4]   2> java.lang.AssertionError
   [junit4]   2> 	at org.apache.lucene.index.ByteSliceReader.readByte(ByteSliceReader.java:73)
   [junit4]   2> 	at org.apache.lucene.store.DataInput.readVInt(DataInput.java:120)
   [junit4]   2> 	at org.apache.lucene.index.FreqProxTermsWriterPerField.flush(FreqProxTermsWriterPerField.java:458)
   [junit4]   2> 	at org.apache.lucene.index.FreqProxTermsWriter.flush(FreqProxTermsWriter.java:80)
   [junit4]   2> 	at org.apache.lucene.index.DefaultIndexingChain.flush(DefaultIndexingChain.java:117)
   [junit4]   2> 	at org.apache.lucene.index.DocumentsWriterPerThread.flush(DocumentsWriterPerThread.java:415)
   [junit4]   2> 	at org.apache.lucene.index.DocumentsWriter.doFlush(DocumentsWriter.java:512)
   [junit4]   2> 	at org.apache.lucene.index.DocumentsWriter.postUpdate(DocumentsWriter.java:388)
   [junit4]   2> 	at org.apache.lucene.index.DocumentsWriter.updateDocuments(DocumentsWriter.java:438)
   [junit4]   2> 	at org.apache.lucene.index.IndexWriter.updateDocuments(IndexWriter.java:1310)
   [junit4]   2> 	at org.apache.lucene.index.IndexWriter.updateDocuments(IndexWriter.java:1288)
   [junit4]   2> 	at org.apache.lucene.index.TrackingIndexWriter.updateDocuments(TrackingIndexWriter.java:82)
   [junit4]   2> 	at org.apache.lucene.search.TestControlledRealTimeReopenThread.updateDocuments(TestControlledRealTimeReopenThread.java:99)
   [junit4]   2> 	at org.apache.lucene.index.ThreadedIndexingAndSearchingTestCase$1.run(ThreadedIndexingAndSearchingTestCase.java:212)
   [junit4]   2> Mai 27, 2014 5:23:23 PM com.carrotsearch.randomizedtesting.RandomizedRunner$QueueUncaughtExceptionsHandler uncaughtException
   [junit4]   2> WARNUNG: Uncaught exception in thread: Thread[Thread-477,5,TGRP-TestControlledRealTimeReopenThread]
   [junit4]   2> java.lang.RuntimeException: java.lang.AssertionError
   [junit4]   2> 	at __randomizedtesting.SeedInfo.seed([CAAA2F0D6BFBABE]:0)
   [junit4]   2> 	at org.apache.lucene.index.ThreadedIndexingAndSearchingTestCase$1.run(ThreadedIndexingAndSearchingTestCase.java:301)
   [junit4]   2> Caused by: java.lang.AssertionError
   [junit4]   2> 	at org.apache.lucene.index.ByteSliceReader.readByte(ByteSliceReader.java:73)
   [junit4]   2> 	at org.apache.lucene.store.DataInput.readVInt(DataInput.java:120)
   [junit4]   2> 	at org.apache.lucene.index.FreqProxTermsWriterPerField.flush(FreqProxTermsWriterPerField.java:406)
   [junit4]   2> 	at org.apache.lucene.index.FreqProxTermsWriter.flush(FreqProxTermsWriter.java:80)
   [junit4]   2> 	at org.apache.lucene.index.DefaultIndexingChain.flush(DefaultIndexingChain.java:117)
   [junit4]   2> 	at org.apache.lucene.index.DocumentsWriterPerThread.flush(DocumentsWriterPerThread.java:415)
   [junit4]   2> 	at org.apache.lucene.index.DocumentsWriter.doFlush(DocumentsWriter.java:512)
   [junit4]   2> 	at org.apache.lucene.index.DocumentsWriter.preUpdate(DocumentsWriter.java:362)
   [junit4]   2> 	at org.apache.lucene.index.DocumentsWriter.updateDocument(DocumentsWriter.java:444)
   [junit4]   2> 	at org.apache.lucene.index.IndexWriter.updateDocument(IndexWriter.java:1496)
   [junit4]   2> 	at org.apache.lucene.index.IndexWriter.updateDocument(IndexWriter.java:1469)
   [junit4]   2> 	at org.apache.lucene.index.TrackingIndexWriter.updateDocument(TrackingIndexWriter.java:64)
   [junit4]   2> 	at org.apache.lucene.search.TestControlledRealTimeReopenThread.updateDocument(TestControlledRealTimeReopenThread.java:168)
   [junit4]   2> 	at org.apache.lucene.index.ThreadedIndexingAndSearchingTestCase$1.run(ThreadedIndexingAndSearchingTestCase.java:253)
   [junit4]   2> 
   [junit4]   2> Mai 27, 2014 5:23:23 PM com.carrotsearch.randomizedtesting.RandomizedRunner$QueueUncaughtExceptionsHandler uncaughtException
   [junit4]   2> WARNUNG: Uncaught exception in thread: Thread[Thread-480,5,TGRP-TestControlledRealTimeReopenThread]
   [junit4]   2> java.lang.RuntimeException: java.lang.AssertionError
   [junit4]   2> 	at __randomizedtesting.SeedInfo.seed([CAAA2F0D6BFBABE]:0)
   [junit4]   2> 	at org.apache.lucene.index.ThreadedIndexingAndSearchingTestCase$1.run(ThreadedIndexingAndSearchingTestCase.java:301)
   [junit4]   2> Caused by: java.lang.AssertionError
   [junit4]   2> 	at org.apache.lucene.index.ByteSliceReader.readByte(ByteSliceReader.java:73)
   [junit4]   2> 	at org.apache.lucene.store.DataInput.readVInt(DataInput.java:120)
   [junit4]   2> 	at org.apache.lucene.index.FreqProxTermsWriterPerField.flush(FreqProxTermsWriterPerField.java:458)
   [junit4]   2> 	at org.apache.lucene.index.FreqProxTermsWriter.flush(FreqProxTermsWriter.java:80)
   [junit4]   2> 	at org.apache.lucene.index.DefaultIndexingChain.flush(DefaultIndexingChain.java:117)
   [junit4]   2> 	at org.apache.lucene.index.DocumentsWriterPerThread.flush(DocumentsWriterPerThread.java:415)
   [junit4]   2> 	at org.apache.lucene.index.DocumentsWriter.doFlush(DocumentsWriter.java:512)
   [junit4]   2> 	at org.apache.lucene.index.DocumentsWriter.postUpdate(DocumentsWriter.java:388)
   [junit4]   2> 	at org.apache.lucene.index.DocumentsWriter.updateDocuments(DocumentsWriter.java:438)
   [junit4]   2> 	at org.apache.lucene.index.IndexWriter.updateDocuments(IndexWriter.java:1310)
   [junit4]   2> 	at org.apache.lucene.index.IndexWriter.updateDocuments(IndexWriter.java:1288)
   [junit4]   2> 	at org.apache.lucene.index.TrackingIndexWriter.updateDocuments(TrackingIndexWriter.java:82)
   [junit4]   2> 	at org.apache.lucene.search.TestControlledRealTimeReopenThread.updateDocuments(TestControlledRealTimeReopenThread.java:99)
   [junit4]   2> 	at org.apache.lucene.index.ThreadedIndexingAndSearchingTestCase$1.run(ThreadedIndexingAndSearchingTestCase.java:212)
   [junit4]   2> 
   [junit4]   2> Mai 27, 2014 5:23:23 PM com.carrotsearch.randomizedtesting.RandomizedRunner$QueueUncaughtExceptionsHandler uncaughtException
   [junit4]   2> WARNUNG: Uncaught exception in thread: Thread[Thread-478,5,TGRP-TestControlledRealTimeReopenThread]
   [junit4]   2> java.lang.RuntimeException: java.lang.AssertionError: expected:<1> but was:<0>
   [junit4]   2> 	at __randomizedtesting.SeedInfo.seed([CAAA2F0D6BFBABE]:0)
   [junit4]   2> 	at org.apache.lucene.index.ThreadedIndexingAndSearchingTestCase$1.run(ThreadedIndexingAndSearchingTestCase.java:301)
   [junit4]   2> Caused by: java.lang.AssertionError: expected:<1> but was:<0>
   [junit4]   2> 	at org.junit.Assert.fail(Assert.java:93)
   [junit4]   2> 	at org.junit.Assert.failNotEquals(Assert.java:647)
   [junit4]   2> 	at org.junit.Assert.assertEquals(Assert.java:128)
   [junit4]   2> 	at org.junit.Assert.assertEquals(Assert.java:472)
   [junit4]   2> 	at org.junit.Assert.assertEquals(Assert.java:456)
   [junit4]   2> 	at org.apache.lucene.search.TestControlledRealTimeReopenThread.updateDocument(TestControlledRealTimeReopenThread.java:180)
   [junit4]   2> 	at org.apache.lucene.index.ThreadedIndexingAndSearchingTestCase$1.run(ThreadedIndexingAndSearchingTestCase.java:253)
   [junit4]   2> 
   [junit4]   2> Mai 27, 2014 5:23:23 PM com.carrotsearch.randomizedtesting.RandomizedRunner$QueueUncaughtExceptionsHandler uncaughtException
   [junit4]   2> WARNUNG: Uncaught exception in thread: Thread[NRTDeletes Reopen Thread,7,TGRP-TestControlledRealTimeReopenThread]
   [junit4]   2> java.lang.AssertionError
   [junit4]   2> 	at __randomizedtesting.SeedInfo.seed([CAAA2F0D6BFBABE]:0)
   [junit4]   2> 	at org.apache.lucene.index.ByteSliceReader.readByte(ByteSliceReader.java:73)
   [junit4]   2> 	at org.apache.lucene.store.DataInput.readVInt(DataInput.java:120)
   [junit4]   2> 	at org.apache.lucene.index.FreqProxTermsWriterPerField.flush(FreqProxTermsWriterPerField.java:458)
   [junit4]   2> 	at org.apache.lucene.index.FreqProxTermsWriter.flush(FreqProxTermsWriter.java:80)
   [junit4]   2> 	at org.apache.lucene.index.DefaultIndexingChain.flush(DefaultIndexingChain.java:117)
   [junit4]   2> 	at org.apache.lucene.index.DocumentsWriterPerThread.flush(DocumentsWriterPerThread.java:415)
   [junit4]   2> 	at org.apache.lucene.index.DocumentsWriter.doFlush(DocumentsWriter.java:512)
   [junit4]   2> 	at org.apache.lucene.index.DocumentsWriter.flushAllThreads(DocumentsWriter.java:622)
   [junit4]   2> 	at org.apache.lucene.index.IndexWriter.getReader(IndexWriter.java:377)
   [junit4]   2> 	at org.apache.lucene.index.StandardDirectoryReader.doOpenFromWriter(StandardDirectoryReader.java:286)
   [junit4]   2> 	at org.apache.lucene.index.StandardDirectoryReader.doOpenIfChanged(StandardDirectoryReader.java:261)
   [junit4]   2> 	at org.apache.lucene.index.StandardDirectoryReader.doOpenIfChanged(StandardDirectoryReader.java:251)
   [junit4]   2> 	at org.apache.lucene.index.DirectoryReader.openIfChanged(DirectoryReader.java:171)
   [junit4]   2> 	at org.apache.lucene.search.SearcherManager.refreshIfNeeded(SearcherManager.java:118)
   [junit4]   2> 	at org.apache.lucene.search.SearcherManager.refreshIfNeeded(SearcherManager.java:58)
   [junit4]   2> 	at org.apache.lucene.search.ReferenceManager.doMaybeRefresh(ReferenceManager.java:176)
   [junit4]   2> 	at org.apache.lucene.search.ReferenceManager.maybeRefreshBlocking(ReferenceManager.java:253)
   [junit4]   2> 	at org.apache.lucene.search.ControlledRealTimeReopenThread.run(ControlledRealTimeReopenThread.java:245)
   [junit4]   2> 
   [junit4]   2> Mai 27, 2014 7:23:20 PM com.carrotsearch.randomizedtesting.ThreadLeakControl$2 evaluate
   [junit4]   2> WARNUNG: Suite execution timed out: org.apache.lucene.search.TestControlledRealTimeReopenThread
   [junit4]   2> ==== jstack at approximately timeout time ====
   [junit4]   2> "Thread-479" ID=577 WAITING on org.apache.lucene.search.ControlledRealTimeReopenThread@12b653
   [junit4]   2> 	at java.lang.Object.wait(Native Method)
   [junit4]   2> 	- waiting on org.apache.lucene.search.ControlledRealTimeReopenThread@12b653
   [junit4]   2> 	at java.lang.Object.wait(Object.java:502)
   [junit4]   2> 	at org.apache.lucene.search.ControlledRealTimeReopenThread.waitForGeneration(ControlledRealTimeReopenThread.java:182)
   [junit4]   2> 	at org.apache.lucene.search.ControlledRealTimeReopenThread.waitForGeneration(ControlledRealTimeReopenThread.java:135)
   [junit4]   2> 	at org.apache.lucene.search.TestControlledRealTimeReopenThread.updateDocument(TestControlledRealTimeReopenThread.java:174)
   [junit4]   2> 	at org.apache.lucene.index.ThreadedIndexingAndSearchingTestCase$1.run(ThreadedIndexingAndSearchingTestCase.java:253)
   [junit4]   2> 
   [junit4]   2> "NRTNoDeletes Reopen Thread" ID=574 TIMED_WAITING on java.util.concurrent.locks.AbstractQueuedSynchronizer$ConditionObject@30f0f1
   [junit4]   2> 	at sun.misc.Unsafe.park(Native Method)
   [junit4]   2> 	- timed waiting on java.util.concurrent.locks.AbstractQueuedSynchronizer$ConditionObject@30f0f1
   [junit4]   2> 	at java.util.concurrent.locks.LockSupport.parkNanos(LockSupport.java:215)
   [junit4]   2> 	at java.util.concurrent.locks.AbstractQueuedSynchronizer$ConditionObject.awaitNanos(AbstractQueuedSynchronizer.java:2078)
   [junit4]   2> 	at org.apache.lucene.search.ControlledRealTimeReopenThread.run(ControlledRealTimeReopenThread.java:223)
   [junit4]   2> 
   [junit4]   2> "TEST-TestControlledRealTimeReopenThread.testControlledRealTimeReopenThread-seed#[CAAA2F0D6BFBABE]" ID=512 WAITING on org.apache.lucene.index.ThreadedIndexingAndSearchingTestCase$1@1266d44
   [junit4]   2> 	at java.lang.Object.wait(Native Method)
   [junit4]   2> 	- waiting on org.apache.lucene.index.ThreadedIndexingAndSearchingTestCase$1@1266d44
   [junit4]   2> 	at java.lang.Thread.join(Thread.java:1245)
   [junit4]   2> 	at java.lang.Thread.join(Thread.java:1319)
   [junit4]   2> 	at org.apache.lucene.index.ThreadedIndexingAndSearchingTestCase.runTest(ThreadedIndexingAndSearchingTestCase.java:536)
   [junit4]   2> 	at org.apache.lucene.search.TestControlledRealTimeReopenThread.testControlledRealTimeReopenThread(TestControlledRealTimeReopenThread.java:71)
   [junit4]   2> 	at sun.reflect.NativeMethodAccessorImpl.invoke0(Native Method)
   [junit4]   2> 	at sun.reflect.NativeMethodAccessorImpl.invoke(NativeMethodAccessorImpl.java:62)
   [junit4]   2> 	at sun.reflect.DelegatingMethodAccessorImpl.invoke(DelegatingMethodAccessorImpl.java:43)
   [junit4]   2> 	at java.lang.reflect.Method.invoke(Method.java:483)
   [junit4]   2> 	at com.carrotsearch.randomizedtesting.RandomizedRunner.invoke(RandomizedRunner.java:1618)
   [junit4]   2> 	at com.carrotsearch.randomizedtesting.RandomizedRunner$6.evaluate(RandomizedRunner.java:827)
   [junit4]   2> 	at com.carrotsearch.randomizedtesting.RandomizedRunner$7.evaluate(RandomizedRunner.java:863)
   [junit4]   2> 	at com.carrotsearch.randomizedtesting.RandomizedRunner$8.evaluate(RandomizedRunner.java:877)
   [junit4]   2> 	at org.apache.lucene.util.TestRuleSetupTeardownChained$1.evaluate(TestRuleSetupTeardownChained.java:50)
   [junit4]   2> 	at org.apache.lucene.util.TestRuleFieldCacheSanity$1.evaluate(TestRuleFieldCacheSanity.java:51)
   [junit4]   2> 	at org.apache.lucene.util.AbstractBeforeAfterRule$1.evaluate(AbstractBeforeAfterRule.java:46)
   [junit4]   2> 	at com.carrotsearch.randomizedtesting.rules.SystemPropertiesInvariantRule$1.evaluate(SystemPropertiesInvariantRule.java:55)
   [junit4]   2> 	at org.apache.lucene.util.TestRuleThreadAndTestName$1.evaluate(TestRuleThreadAndTestName.java:49)
   [junit4]   2> 	at org.apache.lucene.util.TestRuleIgnoreAfterMaxFailures$1.evaluate(TestRuleIgnoreAfterMaxFailures.java:65)
   [junit4]   2> 	at org.apache.lucene.util.TestRuleMarkFailure$1.evaluate(TestRuleMarkFailure.java:48)
   [junit4]   2> 	at com.carrotsearch.randomizedtesting.rules.StatementAdapter.evaluate(StatementAdapter.java:36)
   [junit4]   2> 	at com.carrotsearch.randomizedtesting.ThreadLeakControl$StatementRunner.run(ThreadLeakControl.java:360)
   [junit4]   2> 	at com.carrotsearch.randomizedtesting.ThreadLeakControl.forkTimeoutingTask(ThreadLeakControl.java:793)
   [junit4]   2> 	at com.carrotsearch.randomizedtesting.ThreadLeakControl$3.evaluate(ThreadLeakControl.java:453)
   [junit4]   2> 	at com.carrotsearch.randomizedtesting.RandomizedRunner.runSingleTest(RandomizedRunner.java:836)
   [junit4]   2> 	at com.carrotsearch.randomizedtesting.RandomizedRunner$3.evaluate(RandomizedRunner.java:738)
   [junit4]   2> 	at com.carrotsearch.randomizedtesting.RandomizedRunner$4.evaluate(RandomizedRunner.java:772)
   [junit4]   2> 	at com.carrotsearch.randomizedtesting.RandomizedRunner$5.evaluate(RandomizedRunner.java:783)
   [junit4]   2> 	at org.apache.lucene.util.AbstractBeforeAfterRule$1.evaluate(AbstractBeforeAfterRule.java:46)
   [junit4]   2> 	at org.apache.lucene.util.TestRuleStoreClassName$1.evaluate(TestRuleStoreClassName.java:42)
   [junit4]   2> 	at com.carrotsearch.randomizedtesting.rules.SystemPropertiesInvariantRule$1.evaluate(SystemPropertiesInvariantRule.java:55)
   [junit4]   2> 	at com.carrotsearch.randomizedtesting.rules.NoShadowingOrOverridesOnMethodsRule$1.evaluate(NoShadowingOrOverridesOnMethodsRule.java:39)
   [junit4]   2> 	at com.carrotsearch.randomizedtesting.rules.NoShadowingOrOverridesOnMethodsRule$1.evaluate(NoShadowingOrOverridesOnMethodsRule.java:39)
   [junit4]   2> 	at com.carrotsearch.randomizedtesting.rules.StatementAdapter.evaluate(StatementAdapter.java:36)
   [junit4]   2> 	at com.carrotsearch.randomizedtesting.rules.StatementAdapter.evaluate(StatementAdapter.java:36)
   [junit4]   2> 	at com.carrotsearch.randomizedtesting.rules.StatementAdapter.evaluate(StatementAdapter.java:36)
   [junit4]   2> 	at org.apache.lucene.util.TestRuleAssertionsRequired$1.evaluate(TestRuleAssertionsRequired.java:43)
   [junit4]   2> 	at org.apache.lucene.util.TestRuleMarkFailure$1.evaluate(TestRuleMarkFailure.java:48)
   [junit4]   2> 	at org.apache.lucene.util.TestRuleIgnoreAfterMaxFailures$1.evaluate(TestRuleIgnoreAfterMaxFailures.java:65)
   [junit4]   2> 	at org.apache.lucene.util.TestRuleIgnoreTestSuites$1.evaluate(TestRuleIgnoreTestSuites.java:55)
   [junit4]   2> 	at com.carrotsearch.randomizedtesting.rules.StatementAdapter.evaluate(StatementAdapter.java:36)
   [junit4]   2> 	at com.carrotsearch.randomizedtesting.ThreadLeakControl$StatementRunner.run(ThreadLeakControl.java:360)
   [junit4]   2> 	at java.lang.Thread.run(Thread.java:745)
   [junit4]   2> 
   [junit4]   2> "SUITE-TestControlledRealTimeReopenThread-seed#[CAAA2F0D6BFBABE]" ID=511 RUNNABLE
   [junit4]   2> 	at sun.management.ThreadImpl.dumpThreads0(Native Method)
   [junit4]   2> 	at sun.management.ThreadImpl.dumpAllThreads(ThreadImpl.java:446)
   [junit4]   2> 	at com.carrotsearch.randomizedtesting.ThreadLeakControl.formatThreadStacksFull(ThreadLeakControl.java:666)
   [junit4]   2> 	at com.carrotsearch.randomizedtesting.ThreadLeakControl.access$900(ThreadLeakControl.java:62)
   [junit4]   2> 	at com.carrotsearch.randomizedtesting.ThreadLeakControl$2.evaluate(ThreadLeakControl.java:407)
   [junit4]   2> 	- locked java.lang.Object@18fa9be
   [junit4]   2> 	at com.carrotsearch.randomizedtesting.RandomizedRunner.runSuite(RandomizedRunner.java:642)
   [junit4]   2> 	at com.carrotsearch.randomizedtesting.RandomizedRunner.access$200(RandomizedRunner.java:129)
   [junit4]   2> 	at com.carrotsearch.randomizedtesting.RandomizedRunner$1.run(RandomizedRunner.java:559)
   [junit4]   2> 
   [junit4]   2> "Signal Dispatcher" ID=5 RUNNABLE
   [junit4]   2> 
   [junit4]   2> "Finalizer" ID=3 WAITING on java.lang.ref.ReferenceQueue$Lock@106cb2f
   [junit4]   2> 	at java.lang.Object.wait(Native Method)
   [junit4]   2> 	- waiting on java.lang.ref.ReferenceQueue$Lock@106cb2f
   [junit4]   2> 	at java.lang.ref.ReferenceQueue.remove(ReferenceQueue.java:142)
   [junit4]   2> 	at java.lang.ref.ReferenceQueue.remove(ReferenceQueue.java:158)
   [junit4]   2> 	at java.lang.ref.Finalizer$FinalizerThread.run(Finalizer.java:209)
   [junit4]   2> 
   [junit4]   2> "Reference Handler" ID=2 WAITING on java.lang.ref.Reference$Lock@153ccdd
   [junit4]   2> 	at java.lang.Object.wait(Native Method)
   [junit4]   2> 	- waiting on java.lang.ref.Reference$Lock@153ccdd
   [junit4]   2> 	at java.lang.Object.wait(Object.java:502)
   [junit4]   2> 	at java.lang.ref.Reference$ReferenceHandler.run(Reference.java:157)
   [junit4]   2> 
   [junit4]   2> "main" ID=1 WAITING on com.carrotsearch.randomizedtesting.RandomizedRunner$1@10dfaca
   [junit4]   2> 	at java.lang.Object.wait(Native Method)
   [junit4]   2> 	- waiting on com.carrotsearch.randomizedtesting.RandomizedRunner$1@10dfaca
   [junit4]   2> 	at java.lang.Thread.join(Thread.java:1245)
   [junit4]   2> 	at java.lang.Thread.join(Thread.java:1319)
   [junit4]   2> 	at com.carrotsearch.randomizedtesting.RandomizedRunner.runSuite(RandomizedRunner.java:569)
   [junit4]   2> 	at com.carrotsearch.randomizedtesting.RandomizedRunner.run(RandomizedRunner.java:435)
   [junit4]   2> 	at com.carrotsearch.ant.tasks.junit4.slave.SlaveMain.execute(SlaveMain.java:180)
   [junit4]   2> 	at com.carrotsearch.ant.tasks.junit4.slave.SlaveMain.main(SlaveMain.java:276)
   [junit4]   2> 	at com.carrotsearch.ant.tasks.junit4.slave.SlaveMainSafe.main(SlaveMainSafe.java:12)
   [junit4]   2> 
   [junit4]   2> ^^==============================================
   [junit4]   2> 
   [junit4]   2> NOTE: reproduce with: ant test  -Dtestcase=TestControlledRealTimeReopenThread -Dtests.method=testControlledRealTimeReopenThread -Dtests.seed=CAAA2F0D6BFBABE -Dtests.multiplier=3 -Dtests.slow=true -Dtests.locale=de_DE -Dtests.timezone=Asia/Hebron -Dtests.file.encoding=US-ASCII
   [junit4] ERROR   7198s J0 | TestControlledRealTimeReopenThread.testControlledRealTimeReopenThread <<<
   [junit4]    > Throwable #1: java.lang.Exception: Test abandoned because suite timeout was reached.
   [junit4]    > 	at __randomizedtesting.SeedInfo.seed([CAAA2F0D6BFBABE]:0)
   [junit4]   2> Mai 27, 2014 7:23:20 PM com.carrotsearch.randomizedtesting.ThreadLeakControl checkThreadLeaks
   [junit4]   2> WARNUNG: Will linger awaiting termination of 3 leaked thread(s).
   [junit4]   2> Mai 27, 2014 7:23:40 PM com.carrotsearch.randomizedtesting.ThreadLeakControl checkThreadLeaks
   [junit4]   2> SCHWERWIEGEND: 3 threads leaked from SUITE scope at org.apache.lucene.search.TestControlledRealTimeReopenThread: 
   [junit4]   2>    1) Thread[id=512, name=TEST-TestControlledRealTimeReopenThread.testControlledRealTimeReopenThread-seed#[CAAA2F0D6BFBABE], state=WAITING, group=TGRP-TestControlledRealTimeReopenThread]
   [junit4]   2>         at java.lang.Object.wait(Native Method)
   [junit4]   2>         at java.lang.Thread.join(Thread.java:1245)
   [junit4]   2>         at java.lang.Thread.join(Thread.java:1319)
   [junit4]   2>         at org.apache.lucene.index.ThreadedIndexingAndSearchingTestCase.runTest(ThreadedIndexingAndSearchingTestCase.java:536)
   [junit4]   2>         at org.apache.lucene.search.TestControlledRealTimeReopenThread.testControlledRealTimeReopenThread(TestControlledRealTimeReopenThread.java:71)
   [junit4]   2>         at sun.reflect.NativeMethodAccessorImpl.invoke0(Native Method)
   [junit4]   2>         at sun.reflect.NativeMethodAccessorImpl.invoke(NativeMethodAccessorImpl.java:62)
   [junit4]   2>         at sun.reflect.DelegatingMethodAccessorImpl.invoke(DelegatingMethodAccessorImpl.java:43)
   [junit4]   2>         at java.lang.reflect.Method.invoke(Method.java:483)
   [junit4]   2>         at com.carrotsearch.randomizedtesting.RandomizedRunner.invoke(RandomizedRunner.java:1618)
   [junit4]   2>         at com.carrotsearch.randomizedtesting.RandomizedRunner$6.evaluate(RandomizedRunner.java:827)
   [junit4]   2>         at com.carrotsearch.randomizedtesting.RandomizedRunner$7.evaluate(RandomizedRunner.java:863)
   [junit4]   2>         at com.carrotsearch.randomizedtesting.RandomizedRunner$8.evaluate(RandomizedRunner.java:877)
   [junit4]   2>         at org.apache.lucene.util.TestRuleSetupTeardownChained$1.evaluate(TestRuleSetupTeardownChained.java:50)
   [junit4]   2>         at org.apache.lucene.util.TestRuleFieldCacheSanity$1.evaluate(TestRuleFieldCacheSanity.java:51)
   [junit4]   2>         at org.apache.lucene.util.AbstractBeforeAfterRule$1.evaluate(AbstractBeforeAfterRule.java:46)
   [junit4]   2>         at com.carrotsearch.randomizedtesting.rules.SystemPropertiesInvariantRule$1.evaluate(SystemPropertiesInvariantRule.java:55)
   [junit4]   2>         at org.apache.lucene.util.TestRuleThreadAndTestName$1.evaluate(TestRuleThreadAndTestName.java:49)
   [junit4]   2>         at org.apache.lucene.util.TestRuleIgnoreAfterMaxFailures$1.evaluate(TestRuleIgnoreAfterMaxFailures.java:65)
   [junit4]   2>         at org.apache.lucene.util.TestRuleMarkFailure$1.evaluate(TestRuleMarkFailure.java:48)
   [junit4]   2>         at com.carrotsearch.randomizedtesting.rules.StatementAdapter.evaluate(StatementAdapter.java:36)
   [junit4]   2>         at com.carrotsearch.randomizedtesting.ThreadLeakControl$StatementRunner.run(ThreadLeakControl.java:360)
   [junit4]   2>         at com.carrotsearch.randomizedtesting.ThreadLeakControl.forkTimeoutingTask(ThreadLeakControl.java:793)
   [junit4]   2>         at com.carrotsearch.randomizedtesting.ThreadLeakControl$3.evaluate(ThreadLeakControl.java:453)
   [junit4]   2>         at com.carrotsearch.randomizedtesting.RandomizedRunner.runSingleTest(RandomizedRunner.java:836)
   [junit4]   2>         at com.carrotsearch.randomizedtesting.RandomizedRunner$3.evaluate(RandomizedRunner.java:738)
   [junit4]   2>         at com.carrotsearch.randomizedtesting.RandomizedRunner$4.evaluate(RandomizedRunner.java:772)
   [junit4]   2>         at com.carrotsearch.randomizedtesting.RandomizedRunner$5.evaluate(RandomizedRunner.java:783)
   [junit4]   2>         at org.apache.lucene.util.AbstractBeforeAfterRule$1.evaluate(AbstractBeforeAfterRule.java:46)
   [junit4]   2>         at org.apache.lucene.util.TestRuleStoreClassName$1.evaluate(TestRuleStoreClassName.java:42)
   [junit4]   2>         at com.carrotsearch.randomizedtesting.rules.SystemPropertiesInvariantRule$1.evaluate(SystemPropertiesInvariantRule.java:55)
   [junit4]   2>         at com.carrotsearch.randomizedtesting.rules.NoShadowingOrOverridesOnMethodsRule$1.evaluate(NoShadowingOrOverridesOnMethodsRule.java:39)
   [junit4]   2>         at com.carrotsearch.randomizedtesting.rules.NoShadowingOrOverridesOnMethodsRule$1.evaluate(NoShadowingOrOverridesOnMethodsRule.java:39)
   [junit4]   2>         at com.carrotsearch.randomizedtesting.rules.StatementAdapter.evaluate(StatementAdapter.java:36)
   [junit4]   2>         at com.carrotsearch.randomizedtesting.rules.StatementAdapter.evaluate(StatementAdapter.java:36)
   [junit4]   2>         at com.carrotsearch.randomizedtesting.rules.StatementAdapter.evaluate(StatementAdapter.java:36)
   [junit4]   2>         at org.apache.lucene.util.TestRuleAssertionsRequired$1.evaluate(TestRuleAssertionsRequired.java:43)
   [junit4]   2>         at org.apache.lucene.util.TestRuleMarkFailure$1.evaluate(TestRuleMarkFailure.java:48)
   [junit4]   2>         at org.apache.lucene.util.TestRuleIgnoreAfterMaxFailures$1.evaluate(TestRuleIgnoreAfterMaxFailures.java:65)
   [junit4]   2>         at org.apache.lucene.util.TestRuleIgnoreTestSuites$1.evaluate(TestRuleIgnoreTestSuites.java:55)
   [junit4]   2>         at com.carrotsearch.randomizedtesting.rules.StatementAdapter.evaluate(StatementAdapter.java:36)
   [junit4]   2>         at com.carrotsearch.randomizedtesting.ThreadLeakControl$StatementRunner.run(ThreadLeakControl.java:360)
   [junit4]   2>         at java.lang.Thread.run(Thread.java:745)
   [junit4]   2>    2) Thread[id=577, name=Thread-479, state=WAITING, group=TGRP-TestControlledRealTimeReopenThread]
   [junit4]   2>         at java.lang.Object.wait(Native Method)
   [junit4]   2>         at java.lang.Object.wait(Object.java:502)
   [junit4]   2>         at org.apache.lucene.search.ControlledRealTimeReopenThread.waitForGeneration(ControlledRealTimeReopenThread.java:182)
   [junit4]   2>         at org.apache.lucene.search.ControlledRealTimeReopenThread.waitForGeneration(ControlledRealTimeReopenThread.java:135)
   [junit4]   2>         at org.apache.lucene.search.TestControlledRealTimeReopenThread.updateDocument(TestControlledRealTimeReopenThread.java:174)
   [junit4]   2>         at org.apache.lucene.index.ThreadedIndexingAndSearchingTestCase$1.run(ThreadedIndexingAndSearchingTestCase.java:253)
   [junit4]   2>    3) Thread[id=574, name=NRTNoDeletes Reopen Thread, state=TIMED_WAITING, group=TGRP-TestControlledRealTimeReopenThread]
   [junit4]   2>         at sun.misc.Unsafe.park(Native Method)
   [junit4]   2>         at java.util.concurrent.locks.LockSupport.parkNanos(LockSupport.java:215)
   [junit4]   2>         at java.util.concurrent.locks.AbstractQueuedSynchronizer$ConditionObject.awaitNanos(AbstractQueuedSynchronizer.java:2078)
   [junit4]   2>         at org.apache.lucene.search.ControlledRealTimeReopenThread.run(ControlledRealTimeReopenThread.java:223)
   [junit4]   2> Mai 27, 2014 7:23:40 PM com.carrotsearch.randomizedtesting.ThreadLeakControl tryToInterruptAll
   [junit4]   2> INFORMATION: Starting to interrupt leaked threads:
   [junit4]   2>    1) Thread[id=512, name=TEST-TestControlledRealTimeReopenThread.testControlledRealTimeReopenThread-seed#[CAAA2F0D6BFBABE], state=WAITING, group=TGRP-TestControlledRealTimeReopenThread]
   [junit4]   2>    2) Thread[id=577, name=Thread-479, state=WAITING, group=TGRP-TestControlledRealTimeReopenThread]
   [junit4]   2>    3) Thread[id=574, name=NRTNoDeletes Reopen Thread, state=TIMED_WAITING, group=TGRP-TestControlledRealTimeReopenThread]
   [junit4]   1> Thread-479: hit exc
   [junit4]   2> java.lang.InterruptedException
   [junit4]   2> 	at java.lang.Object.wait(Native Method)
   [junit4]   2> 	at java.lang.Object.wait(Object.java:502)
   [junit4]   2> 	at org.apache.lucene.search.ControlledRealTimeReopenThread.waitForGeneration(ControlledRealTimeReopenThread.java:182)
   [junit4]   2> 	at org.apache.lucene.search.ControlledRealTimeReopenThread.waitForGeneration(ControlledRealTimeReopenThread.java:135)
   [junit4]   2> 	at org.apache.lucene.search.TestControlledRealTimeReopenThread.updateDocument(TestControlledRealTimeReopenThread.java:174)
   [junit4]   2> 	at org.apache.lucene.index.ThreadedIndexingAndSearchingTestCase$1.run(ThreadedIndexingAndSearchingTestCase.java:253)
   [junit4]   2> NOTE: leaving temporary files on disk at: /mnt/ssd/jenkins/workspace/Lucene-Solr-4.x-Linux/lucene/build/core/test/J0/./lucene.search.TestControlledRealTimeReopenThread-CAAA2F0D6BFBABE-001
   [junit4]   2> May 27, 2014 4:23:40 PM com.carrotsearch.randomizedtesting.ThreadLeakControl tryToInterruptAll
   [junit4]   2> INFO: All leaked threads terminated.
   [junit4]   2> NOTE: test params are: codec=Lucene45, sim=DefaultSimilarity, locale=de_DE, timezone=Asia/Hebron
   [junit4]   2> NOTE: Linux 3.8.0-39-generic i386/Oracle Corporation 1.8.0_05 (32-bit)/cpus=8,threads=1,free=315682832,total=536870912
   [junit4]   2> NOTE: All tests run in this JVM: [TestFieldCacheSanityChecker, Test2BPostings, TestSpansAdvanced, TestArrayUtil, TestIndexReaderClose, TestIndexWriterOutOfFileDescriptors, TestFlushByRamOrCountsPolicy, TestNumericTokenStream, TestMultiLevelSkipList, TestFixedBitSet, TestCompressingTermVectorsFormat, TestPositiveScoresOnlyCollector, Test2BNumericDocValues, TestDeterminism, TestShardSearching, Test2BSortedDocValues, TestNIOFSDirectory, TestLucene3xPostingsFormat, TestPagedBytes, TestBinaryDocument, TestPayloadNearQuery, TestBytesRef, TestMatchAllDocsQuery, TestDeletionPolicy, TestStressIndexing, TestFieldReuse, FuzzyTermOnShortTermsTest, TestBytesStore, TestIndexWriterCommit, TestRegexpQuery, TestIndexWriterMerging, Test4GBStoredFields, TestBufferedChecksum, TestSimilarity, TestSort, TestIndexCommit, TestPhrasePrefixQuery, TestRollingBuffer, TestBytesRefArray, TestSimpleExplanations, TestLock, TestFastDecompressionMode, TestCachingWrapperFilter, TestPostingsFormat, TestControlledRealTimeReopenThread]
   [junit4]   2> NOTE: reproduce with: ant test  -Dtestcase=TestControlledRealTimeReopenThread -Dtests.seed=CAAA2F0D6BFBABE -Dtests.multiplier=3 -Dtests.slow=true -Dtests.locale=de_DE -Dtests.timezone=Asia/Hebron -Dtests.file.encoding=US-ASCII
   [junit4] ERROR   0.00s J0 | TestControlledRealTimeReopenThread (suite) <<<
   [junit4]    > Throwable #1: java.lang.Exception: Suite timeout exceeded (>= 7200000 msec).
   [junit4]    > 	at __randomizedtesting.SeedInfo.seed([CAAA2F0D6BFBABE]:0)Throwable #2: com.carrotsearch.randomizedtesting.UncaughtExceptionError: Captured an uncaught exception in thread: Thread[id=575, name=Thread-477, state=RUNNABLE, group=TGRP-TestControlledRealTimeReopenThread]
   [junit4]    > Caused by: java.lang.RuntimeException: java.lang.AssertionError
   [junit4]    > 	at __randomizedtesting.SeedInfo.seed([CAAA2F0D6BFBABE]:0)
   [junit4]    > 	at org.apache.lucene.index.ThreadedIndexingAndSearchingTestCase$1.run(ThreadedIndexingAndSearchingTestCase.java:301)
   [junit4]    > Caused by: java.lang.AssertionError
   [junit4]    > 	at org.apache.lucene.index.ByteSliceReader.readByte(ByteSliceReader.java:73)
   [junit4]    > 	at org.apache.lucene.store.DataInput.readVInt(DataInput.java:120)
   [junit4]    > 	at org.apache.lucene.index.FreqProxTermsWriterPerField.flush(FreqProxTermsWriterPerField.java:406)
   [junit4]    > 	at org.apache.lucene.index.FreqProxTermsWriter.flush(FreqProxTermsWriter.java:80)
   [junit4]    > 	at org.apache.lucene.index.DefaultIndexingChain.flush(DefaultIndexingChain.java:117)
   [junit4]    > 	at org.apache.lucene.index.DocumentsWriterPerThread.flush(DocumentsWriterPerThread.java:415)
   [junit4]    > 	at org.apache.lucene.index.DocumentsWriter.doFlush(DocumentsWriter.java:512)
   [junit4]    > 	at org.apache.lucene.index.DocumentsWriter.preUpdate(DocumentsWriter.java:362)
   [junit4]    > 	at org.apache.lucene.index.DocumentsWriter.updateDocument(DocumentsWriter.java:444)
   [junit4]    > 	at org.apache.lucene.index.IndexWriter.updateDocument(IndexWriter.java:1496)
   [junit4]    > 	at org.apache.lucene.index.IndexWriter.updateDocument(IndexWriter.java:1469)
   [junit4]    > 	at org.apache.lucene.index.TrackingIndexWriter.updateDocument(TrackingIndexWriter.java:64)
   [junit4]    > 	at org.apache.lucene.search.TestControlledRealTimeReopenThread.updateDocument(TestControlledRealTimeReopenThread.java:168)
   [junit4]    > 	at org.apache.lucene.index.ThreadedIndexingAndSearchingTestCase$1.run(ThreadedIndexingAndSearchingTestCase.java:253)Throwable #3: com.carrotsearch.randomizedtesting.UncaughtExceptionError: Captured an uncaught exception in thread: Thread[id=573, name=NRTDeletes Reopen Thread, state=RUNNABLE, group=TGRP-TestControlledRealTimeReopenThread]
   [junit4]    > Caused by: java.lang.AssertionError
   [junit4]    > 	at __randomizedtesting.SeedInfo.seed([CAAA2F0D6BFBABE]:0)
   [junit4]    > 	at org.apache.lucene.index.ByteSliceReader.readByte(ByteSliceReader.java:73)
   [junit4]    > 	at org.apache.lucene.store.DataInput.readVInt(DataInput.java:120)
   [junit4]    > 	at org.apache.lucene.index.FreqProxTermsWriterPerField.flush(FreqProxTermsWriterPerField.java:458)
   [junit4]    > 	at org.apache.lucene.index.FreqProxTermsWriter.flush(FreqProxTermsWriter.java:80)
   [junit4]    > 	at org.apache.lucene.index.DefaultIndexingChain.flush(DefaultIndexingChain.java:117)
   [junit4]    > 	at org.apache.lucene.index.DocumentsWriterPerThread.flush(DocumentsWriterPerThread.java:415)
   [junit4]    > 	at org.apache.lucene.index.DocumentsWriter.doFlush(DocumentsWriter.java:512)
   [junit4]    > 	at org.apache.lucene.index.DocumentsWriter.flushAllThreads(DocumentsWriter.java:622)
   [junit4]    > 	at org.apache.lucene.index.IndexWriter.getReader(IndexWriter.java:377)
   [junit4]    > 	at org.apache.lucene.index.StandardDirectoryReader.doOpenFromWriter(StandardDirectoryReader.java:286)
   [junit4]    > 	at org.apache.lucene.index.StandardDirectoryReader.doOpenIfChanged(StandardDirectoryReader.java:261)
   [junit4]    > 	at org.apache.lucene.index.StandardDirectoryReader.doOpenIfChanged(StandardDirectoryReader.java:251)
   [junit4]    > 	at org.apache.lucene.index.DirectoryReader.openIfChanged(DirectoryReader.java:171)
   [junit4]    > 	at org.apache.lucene.search.SearcherManager.refreshIfNeeded(SearcherManager.java:118)
   [junit4]    > 	at org.apache.lucene.search.SearcherManager.refreshIfNeeded(SearcherManager.java:58)
   [junit4]    > 	at org.apache.lucene.search.ReferenceManager.doMaybeRefresh(ReferenceManager.java:176)
   [junit4]    > 	at org.apache.lucene.search.ReferenceManager.maybeRefreshBlocking(ReferenceManager.java:253)
   [junit4]    > 	at org.apache.lucene.search.ControlledRealTimeReopenThread.run(ControlledRealTimeReopenThread.java:245)Throwable #4: com.carrotsearch.randomizedtesting.UncaughtExceptionError: Captured an uncaught exception in thread: Thread[id=576, name=Thread-478, state=RUNNABLE, group=TGRP-TestControlledRealTimeReopenThread]
   [junit4]    > Caused by: java.lang.RuntimeException: java.lang.AssertionError: expected:<1> but was:<0>
   [junit4]    > 	at __randomizedtesting.SeedInfo.seed([CAAA2F0D6BFBABE]:0)
   [junit4]    > 	at org.apache.lucene.index.ThreadedIndexingAndSearchingTestCase$1.run(ThreadedIndexingAndSearchingTestCase.java:301)
   [junit4]    > Caused by: java.lang.AssertionError: expected:<1> but was:<0>
   [junit4]    > 	at org.apache.lucene.search.TestControlledRealTimeReopenThread.updateDocument(TestControlledRealTimeReopenThread.java:180)
   [junit4]    > 	at org.apache.lucene.index.ThreadedIndexingAndSearchingTestCase$1.run(ThreadedIndexingAndSearchingTestCase.java:253)Throwable #5: com.carrotsearch.randomizedtesting.UncaughtExceptionError: Captured an uncaught exception in thread: Thread[id=578, name=Thread-480, state=RUNNABLE, group=TGRP-TestControlledRealTimeReopenThread]
   [junit4]    > Caused by: java.lang.RuntimeException: java.lang.AssertionError
   [junit4]    > 	at __randomizedtesting.SeedInfo.seed([CAAA2F0D6BFBABE]:0)
   [junit4]    > 	at org.apache.lucene.index.ThreadedIndexingAndSearchingTestCase$1.run(ThreadedIndexingAndSearchingTestCase.java:301)
   [junit4]    > Caused by: java.lang.AssertionError
   [junit4]    > 	at org.apache.lucene.index.ByteSliceReader.readByte(ByteSliceReader.java:73)
   [junit4]    > 	at org.apache.lucene.store.DataInput.readVInt(DataInput.java:120)
   [junit4]    > 	at org.apache.lucene.index.FreqProxTermsWriterPerField.flush(FreqProxTermsWriterPerField.java:458)
   [junit4]    > 	at org.apache.lucene.index.FreqProxTermsWriter.flush(FreqProxTermsWriter.java:80)
   [junit4]    > 	at org.apache.lucene.index.DefaultIndexingChain.flush(DefaultIndexingChain.java:117)
   [junit4]    > 	at org.apache.lucene.index.DocumentsWriterPerThread.flush(DocumentsWriterPerThread.java:415)
   [junit4]    > 	at org.apache.lucene.index.DocumentsWriter.doFlush(DocumentsWriter.java:512)
   [junit4]    > 	at org.apache.lucene.index.DocumentsWriter.postUpdate(DocumentsWriter.java:388)
   [junit4]    > 	at org.apache.lucene.index.DocumentsWriter.updateDocuments(DocumentsWriter.java:438)
   [junit4]    > 	at org.apache.lucene.index.IndexWriter.updateDocuments(IndexWriter.java:1310)
   [junit4]    > 	at org.apache.lucene.index.IndexWriter.updateDocuments(IndexWriter.java:1288)
   [junit4]    > 	at org.apache.lucene.index.TrackingIndexWriter.updateDocuments(TrackingIndexWriter.java:82)
   [junit4]    > 	at org.apache.lucene.search.TestControlledRealTimeReopenThread.updateDocuments(TestControlledRealTimeReopenThread.java:99)
   [junit4]    > 	at org.apache.lucene.index.ThreadedIndexingAndSearchingTestCase$1.run(ThreadedIndexingAndSearchingTestCase.java:212)
   [junit4] Completed on J0 in 7220.33s, 3 tests, 6 errors <<< FAILURES!

[...truncated 280 lines...]
BUILD FAILED
/mnt/ssd/jenkins/workspace/Lucene-Solr-4.x-Linux/build.xml:467: The following error occurred while executing this line:
/mnt/ssd/jenkins/workspace/Lucene-Solr-4.x-Linux/build.xml:447: The following error occurred while executing this line:
/mnt/ssd/jenkins/workspace/Lucene-Solr-4.x-Linux/build.xml:45: The following error occurred while executing this line:
/mnt/ssd/jenkins/workspace/Lucene-Solr-4.x-Linux/extra-targets.xml:37: The following error occurred while executing this line:
/mnt/ssd/jenkins/workspace/Lucene-Solr-4.x-Linux/lucene/build.xml:49: The following error occurred while executing this line:
/mnt/ssd/jenkins/workspace/Lucene-Solr-4.x-Linux/lucene/common-build.xml:1297: The following error occurred while executing this line:
/mnt/ssd/jenkins/workspace/Lucene-Solr-4.x-Linux/lucene/common-build.xml:921: There were test failures: 405 suites, 3217 tests, 5 suite-level errors, 1 error, 1 failure, 99 ignored (89 assumptions)

Total time: 129 minutes 55 seconds
Build step 'Invoke Ant' marked build as failure
Description set: Java: 32bit/jdk1.8.0_05 -server -XX:+UseG1GC
Archiving artifacts
Recording test results
Email was triggered for: Failure
Sending email for trigger: Failure



Mime
View raw message