lucene-dev mailing list archives

Site index · List index
Message view « Date » · « Thread »
Top « Date » · « Thread »
From Apache Jenkins Server <jenk...@builds.apache.org>
Subject [JENKINS] Lucene-Solr-NightlyTests-trunk - Build # 561 - Still Failing
Date Fri, 09 May 2014 04:25:52 GMT
Build: https://builds.apache.org/job/Lucene-Solr-NightlyTests-trunk/561/

5 tests failed.
REGRESSION:  org.apache.lucene.index.TestBagOfPositions.test

Error Message:
Captured an uncaught exception in thread: Thread[id=6634, name=Thread-5938, state=RUNNABLE, group=TGRP-TestBagOfPositions]

Stack Trace:
com.carrotsearch.randomizedtesting.UncaughtExceptionError: Captured an uncaught exception in thread: Thread[id=6634, name=Thread-5938, state=RUNNABLE, group=TGRP-TestBagOfPositions]
Caused by: java.lang.RuntimeException: java.lang.IllegalArgumentException: at least one of ramBufferSize and maxBufferedDocs must be enabled
	at __randomizedtesting.SeedInfo.seed([AE6C3EFA0CEB6D9E]:0)
	at org.apache.lucene.index.TestBagOfPositions$1.run(TestBagOfPositions.java:123)
Caused by: java.lang.IllegalArgumentException: at least one of ramBufferSize and maxBufferedDocs must be enabled
	at org.apache.lucene.index.LiveIndexWriterConfig.setMaxBufferedDocs(LiveIndexWriterConfig.java:298)
	at org.apache.lucene.util.LuceneTestCase.maybeChangeLiveIndexWriterConfig(LuceneTestCase.java:1046)
	at org.apache.lucene.index.RandomIndexWriter.addDocument(RandomIndexWriter.java:113)
	at org.apache.lucene.index.RandomIndexWriter.addDocument(RandomIndexWriter.java:109)
	at org.apache.lucene.index.TestBagOfPositions$1.run(TestBagOfPositions.java:120)


REGRESSION:  org.apache.lucene.index.TestIndexWriterDelete.testDeleteAllNoDeadLock

Error Message:
Captured an uncaught exception in thread: Thread[id=4425, name=Thread-4027, state=RUNNABLE, group=TGRP-TestIndexWriterDelete]

Stack Trace:
com.carrotsearch.randomizedtesting.UncaughtExceptionError: Captured an uncaught exception in thread: Thread[id=4425, name=Thread-4027, state=RUNNABLE, group=TGRP-TestIndexWriterDelete]
Caused by: java.lang.RuntimeException: java.lang.IllegalArgumentException: at least one of ramBufferSize and maxBufferedDocs must be enabled
	at __randomizedtesting.SeedInfo.seed([AE6C3EFA0CEB6D9E]:0)
	at org.apache.lucene.index.TestIndexWriterDelete$1.run(TestIndexWriterDelete.java:339)
Caused by: java.lang.IllegalArgumentException: at least one of ramBufferSize and maxBufferedDocs must be enabled
	at org.apache.lucene.index.LiveIndexWriterConfig.setRAMBufferSizeMB(LiveIndexWriterConfig.java:257)
	at org.apache.lucene.util.LuceneTestCase.maybeChangeLiveIndexWriterConfig(LuceneTestCase.java:1055)
	at org.apache.lucene.index.RandomIndexWriter.addDocument(RandomIndexWriter.java:108)
	at org.apache.lucene.index.TestIndexWriterDelete$1.run(TestIndexWriterDelete.java:333)


FAILED:  junit.framework.TestSuite.org.apache.lucene.index.TestIndexWriterDelete

Error Message:
The test or suite printed 20288 bytes to stdout and stderr, even though the limit was set to 8192 bytes. Increase the limit with @Limit, ignore it completely with @SuppressSysoutChecks or run with -Dtests.verbose=true

Stack Trace:
java.lang.AssertionError: The test or suite printed 20288 bytes to stdout and stderr, even though the limit was set to 8192 bytes. Increase the limit with @Limit, ignore it completely with @SuppressSysoutChecks or run with -Dtests.verbose=true
	at __randomizedtesting.SeedInfo.seed([AE6C3EFA0CEB6D9E]:0)
	at org.apache.lucene.util.TestRuleLimitSysouts.afterIfSuccessful(TestRuleLimitSysouts.java:210)
	at com.carrotsearch.randomizedtesting.rules.TestRuleAdapter$1.afterIfSuccessful(TestRuleAdapter.java:36)
	at com.carrotsearch.randomizedtesting.rules.StatementAdapter.evaluate(StatementAdapter.java:37)
	at org.apache.lucene.util.TestRuleAssertionsRequired$1.evaluate(TestRuleAssertionsRequired.java:43)
	at org.apache.lucene.util.TestRuleMarkFailure$1.evaluate(TestRuleMarkFailure.java:48)
	at org.apache.lucene.util.TestRuleIgnoreAfterMaxFailures$1.evaluate(TestRuleIgnoreAfterMaxFailures.java:65)
	at org.apache.lucene.util.TestRuleIgnoreTestSuites$1.evaluate(TestRuleIgnoreTestSuites.java:55)
	at com.carrotsearch.randomizedtesting.rules.StatementAdapter.evaluate(StatementAdapter.java:36)
	at com.carrotsearch.randomizedtesting.ThreadLeakControl$StatementRunner.run(ThreadLeakControl.java:360)
	at java.lang.Thread.run(Thread.java:724)


REGRESSION:  org.apache.lucene.index.TestIndexWriterExceptions2.testBasics

Error Message:
Test abandoned because suite timeout was reached.

Stack Trace:
java.lang.Exception: Test abandoned because suite timeout was reached.
	at __randomizedtesting.SeedInfo.seed([AE6C3EFA0CEB6D9E]:0)


FAILED:  junit.framework.TestSuite.org.apache.lucene.index.TestIndexWriterExceptions2

Error Message:
Suite timeout exceeded (>= 7200000 msec).

Stack Trace:
java.lang.Exception: Suite timeout exceeded (>= 7200000 msec).
	at __randomizedtesting.SeedInfo.seed([AE6C3EFA0CEB6D9E]:0)




Build Log:
[...truncated 756 lines...]
   [junit4] Suite: org.apache.lucene.index.TestIndexWriterDelete
   [junit4]   2> May 09, 2014 7:28:42 AM com.carrotsearch.randomizedtesting.RandomizedRunner$QueueUncaughtExceptionsHandler uncaughtException
   [junit4]   2> WARNING: Uncaught exception in thread: Thread[Thread-4026,5,TGRP-TestIndexWriterDelete]
   [junit4]   2> java.lang.RuntimeException: java.lang.IllegalArgumentException: at least one of ramBufferSize and maxBufferedDocs must be enabled
   [junit4]   2> 	at __randomizedtesting.SeedInfo.seed([AE6C3EFA0CEB6D9E]:0)
   [junit4]   2> 	at org.apache.lucene.index.TestIndexWriterDelete$1.run(TestIndexWriterDelete.java:339)
   [junit4]   2> Caused by: java.lang.IllegalArgumentException: at least one of ramBufferSize and maxBufferedDocs must be enabled
   [junit4]   2> 	at org.apache.lucene.index.LiveIndexWriterConfig.setMaxBufferedDocs(LiveIndexWriterConfig.java:298)
   [junit4]   2> 	at org.apache.lucene.util.LuceneTestCase.maybeChangeLiveIndexWriterConfig(LuceneTestCase.java:1046)
   [junit4]   2> 	at org.apache.lucene.index.RandomIndexWriter.maybeCommit(RandomIndexWriter.java:155)
   [junit4]   2> 	at org.apache.lucene.index.RandomIndexWriter.addDocument(RandomIndexWriter.java:151)
   [junit4]   2> 	at org.apache.lucene.index.RandomIndexWriter.addDocument(RandomIndexWriter.java:109)
   [junit4]   2> 	at org.apache.lucene.index.TestIndexWriterDelete$1.run(TestIndexWriterDelete.java:333)
   [junit4]   2> 
   [junit4]   2> May 09, 2014 7:28:42 AM com.carrotsearch.randomizedtesting.RandomizedRunner$QueueUncaughtExceptionsHandler uncaughtException
   [junit4]   2> WARNING: Uncaught exception in thread: Thread[Thread-4028,5,TGRP-TestIndexWriterDelete]
   [junit4]   2> java.lang.RuntimeException: java.lang.IllegalArgumentException: at least one of ramBufferSize and maxBufferedDocs must be enabled
   [junit4]   2> 	at __randomizedtesting.SeedInfo.seed([AE6C3EFA0CEB6D9E]:0)
   [junit4]   2> 	at org.apache.lucene.index.TestIndexWriterDelete$1.run(TestIndexWriterDelete.java:339)
   [junit4]   2> Caused by: java.lang.IllegalArgumentException: at least one of ramBufferSize and maxBufferedDocs must be enabled
   [junit4]   2> 	at org.apache.lucene.index.LiveIndexWriterConfig.setRAMBufferSizeMB(LiveIndexWriterConfig.java:257)
   [junit4]   2> 	at org.apache.lucene.util.LuceneTestCase.maybeChangeLiveIndexWriterConfig(LuceneTestCase.java:1055)
   [junit4]   2> 	at org.apache.lucene.index.RandomIndexWriter.maybeCommit(RandomIndexWriter.java:155)
   [junit4]   2> 	at org.apache.lucene.index.RandomIndexWriter.addDocument(RandomIndexWriter.java:151)
   [junit4]   2> 	at org.apache.lucene.index.RandomIndexWriter.addDocument(RandomIndexWriter.java:109)
   [junit4]   2> 	at org.apache.lucene.index.TestIndexWriterDelete$1.run(TestIndexWriterDelete.java:333)
   [junit4]   2> 
   [junit4]   2> May 09, 2014 7:28:42 AM com.carrotsearch.randomizedtesting.RandomizedRunner$QueueUncaughtExceptionsHandler uncaughtException
   [junit4]   2> WARNING: Uncaught exception in thread: Thread[Thread-4023,5,TGRP-TestIndexWriterDelete]
   [junit4]   2> java.lang.RuntimeException: java.lang.IllegalArgumentException: at least one of ramBufferSize and maxBufferedDocs must be enabled
   [junit4]   2> 	at __randomizedtesting.SeedInfo.seed([AE6C3EFA0CEB6D9E]:0)
   [junit4]   2> 	at org.apache.lucene.index.TestIndexWriterDelete$1.run(TestIndexWriterDelete.java:339)
   [junit4]   2> Caused by: java.lang.IllegalArgumentException: at least one of ramBufferSize and maxBufferedDocs must be enabled
   [junit4]   2> 	at org.apache.lucene.index.LiveIndexWriterConfig.setRAMBufferSizeMB(LiveIndexWriterConfig.java:257)
   [junit4]   2> 	at org.apache.lucene.util.LuceneTestCase.maybeChangeLiveIndexWriterConfig(LuceneTestCase.java:1055)
   [junit4]   2> 	at org.apache.lucene.index.RandomIndexWriter.maybeCommit(RandomIndexWriter.java:155)
   [junit4]   2> 	at org.apache.lucene.index.RandomIndexWriter.addDocument(RandomIndexWriter.java:151)
   [junit4]   2> 	at org.apache.lucene.index.RandomIndexWriter.addDocument(RandomIndexWriter.java:109)
   [junit4]   2> 	at org.apache.lucene.index.TestIndexWriterDelete$1.run(TestIndexWriterDelete.java:333)
   [junit4]   2> 
   [junit4]   2> May 09, 2014 7:28:42 AM com.carrotsearch.randomizedtesting.RandomizedRunner$QueueUncaughtExceptionsHandler uncaughtException
   [junit4]   2> WARNING: Uncaught exception in thread: Thread[Thread-4027,5,TGRP-TestIndexWriterDelete]
   [junit4]   2> java.lang.RuntimeException: java.lang.IllegalArgumentException: at least one of ramBufferSize and maxBufferedDocs must be enabled
   [junit4]   2> 	at __randomizedtesting.SeedInfo.seed([AE6C3EFA0CEB6D9E]:0)
   [junit4]   2> 	at org.apache.lucene.index.TestIndexWriterDelete$1.run(TestIndexWriterDelete.java:339)
   [junit4]   2> Caused by: java.lang.IllegalArgumentException: at least one of ramBufferSize and maxBufferedDocs must be enabled
   [junit4]   2> 	at org.apache.lucene.index.LiveIndexWriterConfig.setRAMBufferSizeMB(LiveIndexWriterConfig.java:257)
   [junit4]   2> 	at org.apache.lucene.util.LuceneTestCase.maybeChangeLiveIndexWriterConfig(LuceneTestCase.java:1055)
   [junit4]   2> 	at org.apache.lucene.index.RandomIndexWriter.addDocument(RandomIndexWriter.java:108)
   [junit4]   2> 	at org.apache.lucene.index.TestIndexWriterDelete$1.run(TestIndexWriterDelete.java:333)
   [junit4]   2> 
   [junit4]   2> May 09, 2014 7:28:42 AM com.carrotsearch.randomizedtesting.RandomizedRunner$QueueUncaughtExceptionsHandler uncaughtException
   [junit4]   2> WARNING: Uncaught exception in thread: Thread[Thread-4029,5,TGRP-TestIndexWriterDelete]
   [junit4]   2> java.lang.RuntimeException: java.lang.IllegalArgumentException: at least one of ramBufferSize and maxBufferedDocs must be enabled
   [junit4]   2> 	at __randomizedtesting.SeedInfo.seed([AE6C3EFA0CEB6D9E]:0)
   [junit4]   2> 	at org.apache.lucene.index.TestIndexWriterDelete$1.run(TestIndexWriterDelete.java:339)
   [junit4]   2> Caused by: java.lang.IllegalArgumentException: at least one of ramBufferSize and maxBufferedDocs must be enabled
   [junit4]   2> 	at org.apache.lucene.index.LiveIndexWriterConfig.setRAMBufferSizeMB(LiveIndexWriterConfig.java:257)
   [junit4]   2> 	at org.apache.lucene.util.LuceneTestCase.maybeChangeLiveIndexWriterConfig(LuceneTestCase.java:1055)
   [junit4]   2> 	at org.apache.lucene.index.RandomIndexWriter.maybeCommit(RandomIndexWriter.java:155)
   [junit4]   2> 	at org.apache.lucene.index.RandomIndexWriter.addDocument(RandomIndexWriter.java:151)
   [junit4]   2> 	at org.apache.lucene.index.RandomIndexWriter.addDocument(RandomIndexWriter.java:109)
   [junit4]   2> 	at org.apache.lucene.index.TestIndexWriterDelete$1.run(TestIndexWriterDelete.java:333)
   [junit4]   2> 
   [junit4]   2> May 09, 2014 7:28:42 AM com.carrotsearch.randomizedtesting.RandomizedRunner$QueueUncaughtExceptionsHandler uncaughtException
   [junit4]   2> WARNING: Uncaught exception in thread: Thread[Thread-4025,5,TGRP-TestIndexWriterDelete]
   [junit4]   2> java.lang.RuntimeException: java.lang.IllegalArgumentException: at least one of ramBufferSize and maxBufferedDocs must be enabled
   [junit4]   2> 	at __randomizedtesting.SeedInfo.seed([AE6C3EFA0CEB6D9E]:0)
   [junit4]   2> 	at org.apache.lucene.index.TestIndexWriterDelete$1.run(TestIndexWriterDelete.java:339)
   [junit4]   2> Caused by: java.lang.IllegalArgumentException: at least one of ramBufferSize and maxBufferedDocs must be enabled
   [junit4]   2> 	at org.apache.lucene.index.LiveIndexWriterConfig.setMaxBufferedDocs(LiveIndexWriterConfig.java:298)
   [junit4]   2> 	at org.apache.lucene.util.LuceneTestCase.maybeChangeLiveIndexWriterConfig(LuceneTestCase.java:1046)
   [junit4]   2> 	at org.apache.lucene.index.RandomIndexWriter.addDocument(RandomIndexWriter.java:113)
   [junit4]   2> 	at org.apache.lucene.index.RandomIndexWriter.addDocument(RandomIndexWriter.java:109)
   [junit4]   2> 	at org.apache.lucene.index.TestIndexWriterDelete$1.run(TestIndexWriterDelete.java:333)
   [junit4]   2> 
   [junit4]   2> May 09, 2014 7:28:42 AM com.carrotsearch.randomizedtesting.RandomizedRunner$QueueUncaughtExceptionsHandler uncaughtException
   [junit4]   2> WARNING: Uncaught exception in thread: Thread[Thread-4024,5,TGRP-TestIndexWriterDelete]
   [junit4]   2> java.lang.RuntimeException: java.lang.IllegalArgumentException: at least one of ramBufferSize and maxBufferedDocs must be enabled
   [junit4]   2> 	at __randomizedtesting.SeedInfo.seed([AE6C3EFA0CEB6D9E]:0)
   [junit4]   2> 	at org.apache.lucene.index.TestIndexWriterDelete$1.run(TestIndexWriterDelete.java:339)
   [junit4]   2> Caused by: java.lang.IllegalArgumentException: at least one of ramBufferSize and maxBufferedDocs must be enabled
   [junit4]   2> 	at org.apache.lucene.index.LiveIndexWriterConfig.setMaxBufferedDocs(LiveIndexWriterConfig.java:298)
   [junit4]   2> 	at org.apache.lucene.util.LuceneTestCase.maybeChangeLiveIndexWriterConfig(LuceneTestCase.java:1046)
   [junit4]   2> 	at org.apache.lucene.index.RandomIndexWriter.addDocument(RandomIndexWriter.java:108)
   [junit4]   2> 	at org.apache.lucene.index.TestIndexWriterDelete$1.run(TestIndexWriterDelete.java:333)
   [junit4]   2> 
   [junit4]   2> May 09, 2014 7:28:42 AM com.carrotsearch.randomizedtesting.RandomizedRunner$QueueUncaughtExceptionsHandler uncaughtException
   [junit4]   2> WARNING: Uncaught exception in thread: Thread[Thread-4032,5,TGRP-TestIndexWriterDelete]
   [junit4]   2> java.lang.RuntimeException: java.lang.IllegalArgumentException: at least one of ramBufferSize and maxBufferedDocs must be enabled
   [junit4]   2> 	at __randomizedtesting.SeedInfo.seed([AE6C3EFA0CEB6D9E]:0)
   [junit4]   2> 	at org.apache.lucene.index.TestIndexWriterDelete$1.run(TestIndexWriterDelete.java:339)
   [junit4]   2> Caused by: java.lang.IllegalArgumentException: at least one of ramBufferSize and maxBufferedDocs must be enabled
   [junit4]   2> 	at org.apache.lucene.index.LiveIndexWriterConfig.setMaxBufferedDocs(LiveIndexWriterConfig.java:298)
   [junit4]   2> 	at org.apache.lucene.util.LuceneTestCase.maybeChangeLiveIndexWriterConfig(LuceneTestCase.java:1046)
   [junit4]   2> 	at org.apache.lucene.index.RandomIndexWriter.addDocument(RandomIndexWriter.java:113)
   [junit4]   2> 	at org.apache.lucene.index.RandomIndexWriter.addDocument(RandomIndexWriter.java:109)
   [junit4]   2> 	at org.apache.lucene.index.TestIndexWriterDelete$1.run(TestIndexWriterDelete.java:333)
   [junit4]   2> 
   [junit4]   2> May 09, 2014 7:28:42 AM com.carrotsearch.randomizedtesting.RandomizedRunner$QueueUncaughtExceptionsHandler uncaughtException
   [junit4]   2> WARNING: Uncaught exception in thread: Thread[Thread-4030,5,TGRP-TestIndexWriterDelete]
   [junit4]   2> java.lang.RuntimeException: java.lang.IllegalArgumentException: at least one of ramBufferSize and maxBufferedDocs must be enabled
   [junit4]   2> 	at __randomizedtesting.SeedInfo.seed([AE6C3EFA0CEB6D9E]:0)
   [junit4]   2> 	at org.apache.lucene.index.TestIndexWriterDelete$1.run(TestIndexWriterDelete.java:339)
   [junit4]   2> Caused by: java.lang.IllegalArgumentException: at least one of ramBufferSize and maxBufferedDocs must be enabled
   [junit4]   2> 	at org.apache.lucene.index.LiveIndexWriterConfig.setMaxBufferedDocs(LiveIndexWriterConfig.java:298)
   [junit4]   2> 	at org.apache.lucene.util.LuceneTestCase.maybeChangeLiveIndexWriterConfig(LuceneTestCase.java:1046)
   [junit4]   2> 	at org.apache.lucene.index.RandomIndexWriter.addDocument(RandomIndexWriter.java:108)
   [junit4]   2> 	at org.apache.lucene.index.TestIndexWriterDelete$1.run(TestIndexWriterDelete.java:333)
   [junit4]   2> 
   [junit4]   2> NOTE: download the large Jenkins line-docs file by running 'ant get-jenkins-line-docs' in the lucene directory.
   [junit4]   2> NOTE: reproduce with: ant test  -Dtestcase=TestIndexWriterDelete -Dtests.method=testDeleteAllNoDeadLock -Dtests.seed=AE6C3EFA0CEB6D9E -Dtests.multiplier=2 -Dtests.nightly=true -Dtests.slow=true -Dtests.linedocsfile=/home/hudson/lucene-data/enwiki.random.lines.txt -Dtests.locale=en_CA -Dtests.timezone=Etc/GMT-4 -Dtests.file.encoding=US-ASCII
   [junit4] ERROR   0.32s J0 | TestIndexWriterDelete.testDeleteAllNoDeadLock <<<
   [junit4]    > Throwable #1: com.carrotsearch.randomizedtesting.UncaughtExceptionError: Captured an uncaught exception in thread: Thread[id=4425, name=Thread-4027, state=RUNNABLE, group=TGRP-TestIndexWriterDelete]
   [junit4]    > Caused by: java.lang.RuntimeException: java.lang.IllegalArgumentException: at least one of ramBufferSize and maxBufferedDocs must be enabled
   [junit4]    > 	at __randomizedtesting.SeedInfo.seed([AE6C3EFA0CEB6D9E]:0)
   [junit4]    > 	at org.apache.lucene.index.TestIndexWriterDelete$1.run(TestIndexWriterDelete.java:339)
   [junit4]    > Caused by: java.lang.IllegalArgumentException: at least one of ramBufferSize and maxBufferedDocs must be enabled
   [junit4]    > 	at org.apache.lucene.index.LiveIndexWriterConfig.setRAMBufferSizeMB(LiveIndexWriterConfig.java:257)
   [junit4]    > 	at org.apache.lucene.util.LuceneTestCase.maybeChangeLiveIndexWriterConfig(LuceneTestCase.java:1055)
   [junit4]    > 	at org.apache.lucene.index.RandomIndexWriter.addDocument(RandomIndexWriter.java:108)
   [junit4]    > 	at org.apache.lucene.index.TestIndexWriterDelete$1.run(TestIndexWriterDelete.java:333)Throwable #2: com.carrotsearch.randomizedtesting.UncaughtExceptionError: Captured an uncaught exception in thread: Thread[id=4424, name=Thread-4026, state=RUNNABLE, group=TGRP-TestIndexWriterDelete]
   [junit4]    > Caused by: java.lang.RuntimeException: java.lang.IllegalArgumentException: at least one of ramBufferSize and maxBufferedDocs must be enabled
   [junit4]    > 	at __randomizedtesting.SeedInfo.seed([AE6C3EFA0CEB6D9E]:0)
   [junit4]    > 	at org.apache.lucene.index.TestIndexWriterDelete$1.run(TestIndexWriterDelete.java:339)
   [junit4]    > Caused by: java.lang.IllegalArgumentException: at least one of ramBufferSize and maxBufferedDocs must be enabled
   [junit4]    > 	at org.apache.lucene.index.LiveIndexWriterConfig.setMaxBufferedDocs(LiveIndexWriterConfig.java:298)
   [junit4]    > 	at org.apache.lucene.util.LuceneTestCase.maybeChangeLiveIndexWriterConfig(LuceneTestCase.java:1046)
   [junit4]    > 	at org.apache.lucene.index.RandomIndexWriter.maybeCommit(RandomIndexWriter.java:155)
   [junit4]    > 	at org.apache.lucene.index.RandomIndexWriter.addDocument(RandomIndexWriter.java:151)
   [junit4]    > 	at org.apache.lucene.index.RandomIndexWriter.addDocument(RandomIndexWriter.java:109)
   [junit4]    > 	at org.apache.lucene.index.TestIndexWriterDelete$1.run(TestIndexWriterDelete.java:333)Throwable #3: com.carrotsearch.randomizedtesting.UncaughtExceptionError: Captured an uncaught exception in thread: Thread[id=4421, name=Thread-4023, state=RUNNABLE, group=TGRP-TestIndexWriterDelete]
   [junit4]    > Caused by: java.lang.RuntimeException: java.lang.IllegalArgumentException: at least one of ramBufferSize and maxBufferedDocs must be enabled
   [junit4]    > 	at __randomizedtesting.SeedInfo.seed([AE6C3EFA0CEB6D9E]:0)
   [junit4]    > 	at org.apache.lucene.index.TestIndexWriterDelete$1.run(TestIndexWriterDelete.java:339)
   [junit4]    > Caused by: java.lang.IllegalArgumentException: at least one of ramBufferSize and maxBufferedDocs must be enabled
   [junit4]    > 	at org.apache.lucene.index.LiveIndexWriterConfig.setRAMBufferSizeMB(LiveIndexWriterConfig.java:257)
   [junit4]    > 	at org.apache.lucene.util.LuceneTestCase.maybeChangeLiveIndexWriterConfig(LuceneTestCase.java:1055)
   [junit4]    > 	at org.apache.lucene.index.RandomIndexWriter.maybeCommit(RandomIndexWriter.java:155)
   [junit4]    > 	at org.apache.lucene.index.RandomIndexWriter.addDocument(RandomIndexWriter.java:151)
   [junit4]    > 	at org.apache.lucene.index.RandomIndexWriter.addDocument(RandomIndexWriter.java:109)
   [junit4]    > 	at org.apache.lucene.index.TestIndexWriterDelete$1.run(TestIndexWriterDelete.java:333)Throwable #4: com.carrotsearch.randomizedtesting.UncaughtExceptionError: Captured an uncaught exception in thread: Thread[id=4426, name=Thread-4028, state=RUNNABLE, group=TGRP-TestIndexWriterDelete]
   [junit4]    > Caused by: java.lang.RuntimeException: java.lang.IllegalArgumentException: at least one of ramBufferSize and maxBufferedDocs must be enabled
   [junit4]    > 	at __randomizedtesting.SeedInfo.seed([AE6C3EFA0CEB6D9E]:0)
   [junit4]    > 	at org.apache.lucene.index.TestIndexWriterDelete$1.run(TestIndexWriterDelete.java:339)
   [junit4]    > Caused by: java.lang.IllegalArgumentException: at least one of ramBufferSize and maxBufferedDocs must be enabled
   [junit4]    > 	at org.apache.lucene.index.LiveIndexWriterConfig.setRAMBufferSizeMB(LiveIndexWriterConfig.java:257)
   [junit4]    > 	at org.apache.lucene.util.LuceneTestCase.maybeChangeLiveIndexWriterConfig(LuceneTestCase.java:1055)
   [junit4]    > 	at org.apache.lucene.index.RandomIndexWriter.maybeCommit(RandomIndexWriter.java:155)
   [junit4]    > 	at org.apache.lucene.index.RandomIndexWriter.addDocument(RandomIndexWriter.java:151)
   [junit4]    > 	at org.apache.lucene.index.RandomIndexWriter.addDocument(RandomIndexWriter.java:109)
   [junit4]    > 	at org.apache.lucene.index.TestIndexWriterDelete$1.run(TestIndexWriterDelete.java:333)Throwable #5: com.carrotsearch.randomizedtesting.UncaughtExceptionError: Captured an uncaught exception in thread: Thread[id=4427, name=Thread-4029, state=RUNNABLE, group=TGRP-TestIndexWriterDelete]
   [junit4]    > Caused by: java.lang.RuntimeException: java.lang.IllegalArgumentException: at least one of ramBufferSize and maxBufferedDocs must be enabled
   [junit4]    > 	at __randomizedtesting.SeedInfo.seed([AE6C3EFA0CEB6D9E]:0)
   [junit4]    > 	at org.apache.lucene.index.TestIndexWriterDelete$1.run(TestIndexWriterDelete.java:339)
   [junit4]    > Caused by: java.lang.IllegalArgumentException: at least one of ramBufferSize and maxBufferedDocs must be enabled
   [junit4]    > 	at org.apache.lucene.index.LiveIndexWriterConfig.setRAMBufferSizeMB(LiveIndexWriterConfig.java:257)
   [junit4]    > 	at org.apache.lucene.util.LuceneTestCase.maybeChangeLiveIndexWriterConfig(LuceneTestCase.java:1055)
   [junit4]    > 	at org.apache.lucene.index.RandomIndexWriter.maybeCommit(RandomIndexWriter.java:155)
   [junit4]    > 	at org.apache.lucene.index.RandomIndexWriter.addDocument(RandomIndexWriter.java:151)
   [junit4]    > 	at org.apache.lucene.index.RandomIndexWriter.addDocument(RandomIndexWriter.java:109)
   [junit4]    > 	at org.apache.lucene.index.TestIndexWriterDelete$1.run(TestIndexWriterDelete.java:333)Throwable #6: com.carrotsearch.randomizedtesting.UncaughtExceptionError: Captured an uncaught exception in thread: Thread[id=4423, name=Thread-4025, state=RUNNABLE, group=TGRP-TestIndexWriterDelete]
   [junit4]    > Caused by: java.lang.RuntimeException: java.lang.IllegalArgumentException: at least one of ramBufferSize and maxBufferedDocs must be enabled
   [junit4]    > 	at __randomizedtesting.SeedInfo.seed([AE6C3EFA0CEB6D9E]:0)
   [junit4]    > 	at org.apache.lucene.index.TestIndexWriterDelete$1.run(TestIndexWriterDelete.java:339)
   [junit4]    > Caused by: java.lang.IllegalArgumentException: at least one of ramBufferSize and maxBufferedDocs must be enabled
   [junit4]    > 	at org.apache.lucene.index.LiveIndexWriterConfig.setMaxBufferedDocs(LiveIndexWriterConfig.java:298)
   [junit4]    > 	at org.apache.lucene.util.LuceneTestCase.maybeChangeLiveIndexWriterConfig(LuceneTestCase.java:1046)
   [junit4]    > 	at org.apache.lucene.index.RandomIndexWriter.addDocument(RandomIndexWriter.java:113)
   [junit4]    > 	at org.apache.lucene.index.RandomIndexWriter.addDocument(RandomIndexWriter.java:109)
   [junit4]    > 	at org.apache.lucene.index.TestIndexWriterDelete$1.run(TestIndexWriterDelete.java:333)Throwable #7: com.carrotsearch.randomizedtesting.UncaughtExceptionError: Captured an uncaught exception in thread: Thread[id=4422, name=Thread-4024, state=RUNNABLE, group=TGRP-TestIndexWriterDelete]
   [junit4]    > Caused by: java.lang.RuntimeException: java.lang.IllegalArgumentException: at least one of ramBufferSize and maxBufferedDocs must be enabled
   [junit4]    > 	at __randomizedtesting.SeedInfo.seed([AE6C3EFA0CEB6D9E]:0)
   [junit4]    > 	at org.apache.lucene.index.TestIndexWriterDelete$1.run(TestIndexWriterDelete.java:339)
   [junit4]    > Caused by: java.lang.IllegalArgumentException: at least one of ramBufferSize and maxBufferedDocs must be enabled
   [junit4]    > 	at org.apache.lucene.index.LiveIndexWriterConfig.setMaxBufferedDocs(LiveIndexWriterConfig.java:298)
   [junit4]    > 	at org.apache.lucene.util.LuceneTestCase.maybeChangeLiveIndexWriterConfig(LuceneTestCase.java:1046)
   [junit4]    > 	at org.apache.lucene.index.RandomIndexWriter.addDocument(RandomIndexWriter.java:108)
   [junit4]    > 	at org.apache.lucene.index.TestIndexWriterDelete$1.run(TestIndexWriterDelete.java:333)Throwable #8: com.carrotsearch.randomizedtesting.UncaughtExceptionError: Captured an uncaught exception in thread: Thread[id=4430, name=Thread-4032, state=RUNNABLE, group=TGRP-TestIndexWriterDelete]
   [junit4]    > Caused by: java.lang.RuntimeException: java.lang.IllegalArgumentException: at least one of ramBufferSize and maxBufferedDocs must be enabled
   [junit4]    > 	at __randomizedtesting.SeedInfo.seed([AE6C3EFA0CEB6D9E]:0)
   [junit4]    > 	at org.apache.lucene.index.TestIndexWriterDelete$1.run(TestIndexWriterDelete.java:339)
   [junit4]    > Caused by: java.lang.IllegalArgumentException: at least one of ramBufferSize and maxBufferedDocs must be enabled
   [junit4]    > 	at org.apache.lucene.index.LiveIndexWriterConfig.setMaxBufferedDocs(LiveIndexWriterConfig.java:298)
   [junit4]    > 	at org.apache.lucene.util.LuceneTestCase.maybeChangeLiveIndexWriterConfig(LuceneTestCase.java:1046)
   [junit4]    > 	at org.apache.lucene.index.RandomIndexWriter.addDocument(RandomIndexWriter.java:113)
   [junit4]    > 	at org.apache.lucene.index.RandomIndexWriter.addDocument(RandomIndexWriter.java:109)
   [junit4]    > 	at org.apache.lucene.index.TestIndexWriterDelete$1.run(TestIndexWriterDelete.java:333)Throwable #9: com.carrotsearch.randomizedtesting.UncaughtExceptionError: Captured an uncaught exception in thread: Thread[id=4428, name=Thread-4030, state=RUNNABLE, group=TGRP-TestIndexWriterDelete]
   [junit4]    > Caused by: java.lang.RuntimeException: java.lang.IllegalArgumentException: at least one of ramBufferSize and maxBufferedDocs must be enabled
   [junit4]    > 	at __randomizedtesting.SeedInfo.seed([AE6C3EFA0CEB6D9E]:0)
   [junit4]    > 	at org.apache.lucene.index.TestIndexWriterDelete$1.run(TestIndexWriterDelete.java:339)
   [junit4]    > Caused by: java.lang.IllegalArgumentException: at least one of ramBufferSize and maxBufferedDocs must be enabled
   [junit4]    > 	at org.apache.lucene.index.LiveIndexWriterConfig.setMaxBufferedDocs(LiveIndexWriterConfig.java:298)
   [junit4]    > 	at org.apache.lucene.util.LuceneTestCase.maybeChangeLiveIndexWriterConfig(LuceneTestCase.java:1046)
   [junit4]    > 	at org.apache.lucene.index.RandomIndexWriter.addDocument(RandomIndexWriter.java:108)
   [junit4]    > 	at org.apache.lucene.index.TestIndexWriterDelete$1.run(TestIndexWriterDelete.java:333)
   [junit4]   2> NOTE: test params are: codec=DummyCompressingStoredFields(storedFieldsFormat=CompressingStoredFieldsFormat(compressionMode=DUMMY, chunkSize=207), termVectorsFormat=CompressingTermVectorsFormat(compressionMode=DUMMY, chunkSize=207)), sim=RandomSimilarityProvider(queryNorm=false,coord=yes): {field=DFR I(F)1, contents=DFR GB2, id=DFR G2, content=IB SPL-L2, body=IB SPL-D2, city=IB LL-D2}, locale=en_CA, timezone=Etc/GMT-4
   [junit4]   2> NOTE: FreeBSD 9.1-RELEASE-p3 amd64/Oracle Corporation 1.7.0_25 (64-bit)/cpus=16,threads=1,free=238625968,total=427360256
   [junit4]   2> NOTE: All tests run in this JVM: [Nested1, TestMultiPhraseQuery, TestBytesRefHash, TestPagedBytes, TestDeterminism, TestScorerPerf, TestSortRandom, TestSimpleExplanationsOfNonMatches, TestPayloads, TestBooleanMinShouldMatch, TestDisjunctionMaxQuery, TestSegmentReader, TestSetOnce, TestLucene40PostingsReader, TestTopDocsMerge, TestCompressingTermVectorsFormat, TestMatchAllDocsQuery, Test4GBStoredFields, TestField, TestTermsEnum2, TestOfflineSorter, TestTermRangeFilter, TestNRTReaderWithThreads, TestAssertions, TestTopFieldCollector, TestNumericRangeQuery64, TestFastCompressionMode, TestRateLimitedDirectoryWrapper, TestBinaryDocValuesUpdates, TestCustomSearcherSort, TestFieldCacheRewriteMethod, TestRollback, TestDeterminizeLexicon, TestDemo, TestSizeBoundedForceMerge, TestUniqueTermCount, TestCachingTokenFilter, TestExternalCodecs, TestBasicOperations, TestCharTermAttributeImpl, TestNumericDocValuesUpdates, TestIndexWriterOutOfMemory, TestReuseDocsEnum, TestMultiTermConstantScore, TestSloppyPhraseQuery2, TestNumericRangeQuery32, TestByteSlices, TestPhraseQuery, TestPrefixRandom, TestComplexExplanations, TestBinaryDocument, TestSloppyMath, TestRamUsageEstimator, TestBroadWord, TestParallelReaderEmptyIndex, TestQueryWrapperFilter, TestPostingsOffsets, Test2BNumericDocValues, TestMergeSchedulerExternal, TestSort, TestRecyclingIntBlockAllocator, TestLucene40PostingsFormat, TestDirectoryReader, TestAutomatonQueryUnicode, TestPayloadTermQuery, TestFieldsReader, TestTermsEnum, Test2BPostings, TestDocBoost, TestFlushByRamOrCountsPolicy, TestWAH8DocIdSet, FuzzyTermOnShortTermsTest, TestCompiledAutomaton, TestParallelTermEnum, TestUTF32ToUTF8, TestIndexCommit, TestQueryRescorer, Nested1, TestFixedBitSet, TestStressIndexing2, TestDocTermOrdsRewriteMethod, TestEarlyTermination, TestControlledRealTimeReopenThread, TestDeletionPolicy, TestBytesRef, TestIndexWriterCommit, TestCustomNorms, Nested, Nested, TestTransactionRollback, TestLookaheadTokenFilter, TestCompoundFile, TestBooleanScorer, TestTermVectorsWriter, TestIndexWriterOutOfFileDescriptors, TestStressAdvance, TestPostingsFormat, TestSpansAdvanced2, TestDocumentsWriterStallControl, TestIntroSorter, TestCharsRef, TestIndexWriter, TestIndexWriterReader, TestTermVectorsFormat, TestIndexWriterMerging, TestFSTs, TestBytesStore, TestPackedInts, TestLucene42DocValuesFormat, TestBackwardsCompatibility, TestShardSearching, TestBlockPostingsFormat3, TestMultiMMap, TestSearcherManager, TestBooleanOr, TestBasics, TestSloppyPhraseQuery, TestIndexWriterDelete]
   [junit4]   2> NOTE: download the large Jenkins line-docs file by running 'ant get-jenkins-line-docs' in the lucene directory.
   [junit4]   2> NOTE: reproduce with: ant test  -Dtestcase=TestIndexWriterDelete -Dtests.seed=AE6C3EFA0CEB6D9E -Dtests.multiplier=2 -Dtests.nightly=true -Dtests.slow=true -Dtests.linedocsfile=/home/hudson/lucene-data/enwiki.random.lines.txt -Dtests.locale=en_CA -Dtests.timezone=Etc/GMT-4 -Dtests.file.encoding=US-ASCII
   [junit4] ERROR   0.00s J0 | TestIndexWriterDelete (suite) <<<
   [junit4]    > Throwable #1: java.lang.AssertionError: The test or suite printed 20288 bytes to stdout and stderr, even though the limit was set to 8192 bytes. Increase the limit with @Limit, ignore it completely with @SuppressSysoutChecks or run with -Dtests.verbose=true
   [junit4]    > 	at __randomizedtesting.SeedInfo.seed([AE6C3EFA0CEB6D9E]:0)
   [junit4]    > 	at java.lang.Thread.run(Thread.java:724)
   [junit4] Completed on J0 in 26.40s, 22 tests, 1 failure, 1 error <<< FAILURES!

[...truncated 155 lines...]
   [junit4] Suite: org.apache.lucene.index.TestBagOfPositions
   [junit4]   2> svi 09, 2014 6:42:56 AM com.carrotsearch.randomizedtesting.RandomizedRunner$QueueUncaughtExceptionsHandler uncaughtException
   [junit4]   2> WARNING: Uncaught exception in thread: Thread[Thread-5938,5,TGRP-TestBagOfPositions]
   [junit4]   2> java.lang.RuntimeException: java.lang.IllegalArgumentException: at least one of ramBufferSize and maxBufferedDocs must be enabled
   [junit4]   2> 	at __randomizedtesting.SeedInfo.seed([AE6C3EFA0CEB6D9E]:0)
   [junit4]   2> 	at org.apache.lucene.index.TestBagOfPositions$1.run(TestBagOfPositions.java:123)
   [junit4]   2> Caused by: java.lang.IllegalArgumentException: at least one of ramBufferSize and maxBufferedDocs must be enabled
   [junit4]   2> 	at org.apache.lucene.index.LiveIndexWriterConfig.setMaxBufferedDocs(LiveIndexWriterConfig.java:298)
   [junit4]   2> 	at org.apache.lucene.util.LuceneTestCase.maybeChangeLiveIndexWriterConfig(LuceneTestCase.java:1046)
   [junit4]   2> 	at org.apache.lucene.index.RandomIndexWriter.addDocument(RandomIndexWriter.java:113)
   [junit4]   2> 	at org.apache.lucene.index.RandomIndexWriter.addDocument(RandomIndexWriter.java:109)
   [junit4]   2> 	at org.apache.lucene.index.TestBagOfPositions$1.run(TestBagOfPositions.java:120)
   [junit4]   2> 
   [junit4]   2> svi 09, 2014 6:43:00 AM com.carrotsearch.randomizedtesting.RandomizedRunner$QueueUncaughtExceptionsHandler uncaughtException
   [junit4]   2> WARNING: Uncaught exception in thread: Thread[Thread-5937,5,TGRP-TestBagOfPositions]
   [junit4]   2> java.lang.RuntimeException: java.lang.IllegalArgumentException: at least one of ramBufferSize and maxBufferedDocs must be enabled
   [junit4]   2> 	at __randomizedtesting.SeedInfo.seed([AE6C3EFA0CEB6D9E]:0)
   [junit4]   2> 	at org.apache.lucene.index.TestBagOfPositions$1.run(TestBagOfPositions.java:123)
   [junit4]   2> Caused by: java.lang.IllegalArgumentException: at least one of ramBufferSize and maxBufferedDocs must be enabled
   [junit4]   2> 	at org.apache.lucene.index.LiveIndexWriterConfig.setRAMBufferSizeMB(LiveIndexWriterConfig.java:257)
   [junit4]   2> 	at org.apache.lucene.util.LuceneTestCase.maybeChangeLiveIndexWriterConfig(LuceneTestCase.java:1055)
   [junit4]   2> 	at org.apache.lucene.index.RandomIndexWriter.addDocument(RandomIndexWriter.java:113)
   [junit4]   2> 	at org.apache.lucene.index.RandomIndexWriter.addDocument(RandomIndexWriter.java:109)
   [junit4]   2> 	at org.apache.lucene.index.TestBagOfPositions$1.run(TestBagOfPositions.java:120)
   [junit4]   2> 
   [junit4]   2> NOTE: download the large Jenkins line-docs file by running 'ant get-jenkins-line-docs' in the lucene directory.
   [junit4]   2> NOTE: reproduce with: ant test  -Dtestcase=TestBagOfPositions -Dtests.method=test -Dtests.seed=AE6C3EFA0CEB6D9E -Dtests.multiplier=2 -Dtests.nightly=true -Dtests.slow=true -Dtests.linedocsfile=/home/hudson/lucene-data/enwiki.random.lines.txt -Dtests.locale=hr -Dtests.timezone=Europe/Zaporozhye -Dtests.file.encoding=US-ASCII
   [junit4] ERROR   21.4s J0 | TestBagOfPositions.test <<<
   [junit4]    > Throwable #1: java.lang.AssertionError: expected:<157> but was:<156>
   [junit4]    > 	at org.apache.lucene.index.TestBagOfPositions.test(TestBagOfPositions.java:145)
   [junit4]    > 	at java.lang.Thread.run(Thread.java:724)Throwable #2: com.carrotsearch.randomizedtesting.UncaughtExceptionError: Captured an uncaught exception in thread: Thread[id=6634, name=Thread-5938, state=RUNNABLE, group=TGRP-TestBagOfPositions]
   [junit4]    > Caused by: java.lang.RuntimeException: java.lang.IllegalArgumentException: at least one of ramBufferSize and maxBufferedDocs must be enabled
   [junit4]    > 	at __randomizedtesting.SeedInfo.seed([AE6C3EFA0CEB6D9E]:0)
   [junit4]    > 	at org.apache.lucene.index.TestBagOfPositions$1.run(TestBagOfPositions.java:123)
   [junit4]    > Caused by: java.lang.IllegalArgumentException: at least one of ramBufferSize and maxBufferedDocs must be enabled
   [junit4]    > 	at org.apache.lucene.index.LiveIndexWriterConfig.setMaxBufferedDocs(LiveIndexWriterConfig.java:298)
   [junit4]    > 	at org.apache.lucene.util.LuceneTestCase.maybeChangeLiveIndexWriterConfig(LuceneTestCase.java:1046)
   [junit4]    > 	at org.apache.lucene.index.RandomIndexWriter.addDocument(RandomIndexWriter.java:113)
   [junit4]    > 	at org.apache.lucene.index.RandomIndexWriter.addDocument(RandomIndexWriter.java:109)
   [junit4]    > 	at org.apache.lucene.index.TestBagOfPositions$1.run(TestBagOfPositions.java:120)Throwable #3: com.carrotsearch.randomizedtesting.UncaughtExceptionError: Captured an uncaught exception in thread: Thread[id=6633, name=Thread-5937, state=RUNNABLE, group=TGRP-TestBagOfPositions]
   [junit4]    > Caused by: java.lang.RuntimeException: java.lang.IllegalArgumentException: at least one of ramBufferSize and maxBufferedDocs must be enabled
   [junit4]    > 	at __randomizedtesting.SeedInfo.seed([AE6C3EFA0CEB6D9E]:0)
   [junit4]    > 	at org.apache.lucene.index.TestBagOfPositions$1.run(TestBagOfPositions.java:123)
   [junit4]    > Caused by: java.lang.IllegalArgumentException: at least one of ramBufferSize and maxBufferedDocs must be enabled
   [junit4]    > 	at org.apache.lucene.index.LiveIndexWriterConfig.setRAMBufferSizeMB(LiveIndexWriterConfig.java:257)
   [junit4]    > 	at org.apache.lucene.util.LuceneTestCase.maybeChangeLiveIndexWriterConfig(LuceneTestCase.java:1055)
   [junit4]    > 	at org.apache.lucene.index.RandomIndexWriter.addDocument(RandomIndexWriter.java:113)
   [junit4]    > 	at org.apache.lucene.index.RandomIndexWriter.addDocument(RandomIndexWriter.java:109)
   [junit4]    > 	at org.apache.lucene.index.TestBagOfPositions$1.run(TestBagOfPositions.java:120)
   [junit4]   2> NOTE: leaving temporary files on disk at: /usr/home/hudson/hudson-slave/workspace/Lucene-Solr-NightlyTests-trunk/lucene/build/core/test/J0/./lucene.index.TestBagOfPositions-AE6C3EFA0CEB6D9E-001
   [junit4]   2> NOTE: test params are: codec=CheapBastard, sim=DefaultSimilarity, locale=hr, timezone=Europe/Zaporozhye
   [junit4]   2> NOTE: FreeBSD 9.1-RELEASE-p3 amd64/Oracle Corporation 1.7.0_25 (64-bit)/cpus=16,threads=1,free=284153688,total=467599360
   [junit4]   2> NOTE: All tests run in this JVM: [Nested1, TestMultiPhraseQuery, TestBytesRefHash, TestPagedBytes, TestDeterminism, TestScorerPerf, TestSortRandom, TestSimpleExplanationsOfNonMatches, TestPayloads, TestBooleanMinShouldMatch, TestDisjunctionMaxQuery, TestSegmentReader, TestSetOnce, TestLucene40PostingsReader, TestTopDocsMerge, TestCompressingTermVectorsFormat, TestMatchAllDocsQuery, Test4GBStoredFields, TestField, TestTermsEnum2, TestOfflineSorter, TestTermRangeFilter, TestNRTReaderWithThreads, TestAssertions, TestTopFieldCollector, TestNumericRangeQuery64, TestFastCompressionMode, TestRateLimitedDirectoryWrapper, TestBinaryDocValuesUpdates, TestCustomSearcherSort, TestFieldCacheRewriteMethod, TestRollback, TestDeterminizeLexicon, TestDemo, TestSizeBoundedForceMerge, TestUniqueTermCount, TestCachingTokenFilter, TestExternalCodecs, TestBasicOperations, TestCharTermAttributeImpl, TestNumericDocValuesUpdates, TestIndexWriterOutOfMemory, TestReuseDocsEnum, TestMultiTermConstantScore, TestSloppyPhraseQuery2, TestNumericRangeQuery32, TestByteSlices, TestPhraseQuery, TestPrefixRandom, TestComplexExplanations, TestBinaryDocument, TestSloppyMath, TestRamUsageEstimator, TestBroadWord, TestParallelReaderEmptyIndex, TestQueryWrapperFilter, TestPostingsOffsets, Test2BNumericDocValues, TestMergeSchedulerExternal, TestSort, TestRecyclingIntBlockAllocator, TestLucene40PostingsFormat, TestDirectoryReader, TestAutomatonQueryUnicode, TestPayloadTermQuery, TestFieldsReader, TestTermsEnum, Test2BPostings, TestDocBoost, TestFlushByRamOrCountsPolicy, TestWAH8DocIdSet, FuzzyTermOnShortTermsTest, TestCompiledAutomaton, TestParallelTermEnum, TestUTF32ToUTF8, TestIndexCommit, TestQueryRescorer, Nested1, TestFixedBitSet, TestStressIndexing2, TestDocTermOrdsRewriteMethod, TestEarlyTermination, TestControlledRealTimeReopenThread, TestDeletionPolicy, TestBytesRef, TestIndexWriterCommit, TestCustomNorms, Nested, Nested, TestTransactionRollback, TestLookaheadTokenFilter, TestCompoundFile, TestBooleanScorer, TestTermVectorsWriter, TestIndexWriterOutOfFileDescriptors, TestStressAdvance, TestPostingsFormat, TestSpansAdvanced2, TestDocumentsWriterStallControl, TestIntroSorter, TestCharsRef, TestIndexWriter, TestIndexWriterReader, TestTermVectorsFormat, TestIndexWriterMerging, TestFSTs, TestBytesStore, TestPackedInts, TestLucene42DocValuesFormat, TestBackwardsCompatibility, TestShardSearching, TestBlockPostingsFormat3, TestMultiMMap, TestSearcherManager, TestBooleanOr, TestBasics, TestSloppyPhraseQuery, TestIndexWriterDelete, TestLucene40DocValuesFormat, TestIndexWriterMergePolicy, TestNRTThreads, TestDuelingCodecs, TestPersistentSnapshotDeletionPolicy, TestAtomicUpdate, TestTimeLimitingCollector, TestSearchWithThreads, TestSearchAfter, TestConcurrentMergeScheduler, TestHighCompressionMode, TestStressIndexing, TestMinimize, TestRollingUpdates, TestBlockPostingsFormat2, TestSnapshotDeletionPolicy, TestTieredMergePolicy, TestIndexWriterForceMerge, TestArrayUtil, TestBufferedIndexInput, TestConsistentFieldNumbers, TestSimpleExplanations, TestDocTermOrdsRangeFilter, TestLockFactory, TestCollectionUtil, TestBagOfPositions]
   [junit4] Completed on J0 in 21.45s, 1 test, 1 error <<< FAILURES!

[...truncated 510 lines...]
   [junit4] Suite: org.apache.lucene.index.TestIndexWriterExceptions2
   [junit4]   2> may 09, 2014 12:05:19 AM com.carrotsearch.randomizedtesting.ThreadLeakControl$2 evaluate
   [junit4]   2> WARNING: Suite execution timed out: org.apache.lucene.index.TestIndexWriterExceptions2
   [junit4]   2> ==== jstack at approximately timeout time ====
   [junit4]   2> "TEST-TestIndexWriterExceptions2.testBasics-seed#[AE6C3EFA0CEB6D9E]" ID=87 TIMED_WAITING on org.apache.lucene.index.IndexWriter@3578152e
   [junit4]   2> 	at java.lang.Object.wait(Native Method)
   [junit4]   2> 	- timed waiting on org.apache.lucene.index.IndexWriter@3578152e
   [junit4]   2> 	at org.apache.lucene.index.IndexWriter.doWait(IndexWriter.java:4200)
   [junit4]   2> 	at org.apache.lucene.index.IndexWriter.waitForMerges(IndexWriter.java:2237)
   [junit4]   2> 	at org.apache.lucene.index.IndexWriter.finishMerges(IndexWriter.java:2221)
   [junit4]   2> 	at org.apache.lucene.index.IndexWriter.shutdown(IndexWriter.java:885)
   [junit4]   2> 	at org.apache.lucene.index.IndexWriter.shutdown(IndexWriter.java:869)
   [junit4]   2> 	at org.apache.lucene.index.TestIndexWriterExceptions2.testBasics(TestIndexWriterExceptions2.java:198)
   [junit4]   2> 	at sun.reflect.NativeMethodAccessorImpl.invoke0(Native Method)
   [junit4]   2> 	at sun.reflect.NativeMethodAccessorImpl.invoke(NativeMethodAccessorImpl.java:57)
   [junit4]   2> 	at sun.reflect.DelegatingMethodAccessorImpl.invoke(DelegatingMethodAccessorImpl.java:43)
   [junit4]   2> 	at java.lang.reflect.Method.invoke(Method.java:606)
   [junit4]   2> 	at com.carrotsearch.randomizedtesting.RandomizedRunner.invoke(RandomizedRunner.java:1618)
   [junit4]   2> 	at com.carrotsearch.randomizedtesting.RandomizedRunner$6.evaluate(RandomizedRunner.java:827)
   [junit4]   2> 	at com.carrotsearch.randomizedtesting.RandomizedRunner$7.evaluate(RandomizedRunner.java:863)
   [junit4]   2> 	at com.carrotsearch.randomizedtesting.RandomizedRunner$8.evaluate(RandomizedRunner.java:877)
   [junit4]   2> 	at org.apache.lucene.util.TestRuleSetupTeardownChained$1.evaluate(TestRuleSetupTeardownChained.java:50)
   [junit4]   2> 	at org.apache.lucene.util.TestRuleFieldCacheSanity$1.evaluate(TestRuleFieldCacheSanity.java:51)
   [junit4]   2> 	at org.apache.lucene.util.AbstractBeforeAfterRule$1.evaluate(AbstractBeforeAfterRule.java:46)
   [junit4]   2> 	at com.carrotsearch.randomizedtesting.rules.SystemPropertiesInvariantRule$1.evaluate(SystemPropertiesInvariantRule.java:55)
   [junit4]   2> 	at org.apache.lucene.util.TestRuleThreadAndTestName$1.evaluate(TestRuleThreadAndTestName.java:49)
   [junit4]   2> 	at org.apache.lucene.util.TestRuleIgnoreAfterMaxFailures$1.evaluate(TestRuleIgnoreAfterMaxFailures.java:65)
   [junit4]   2> 	at org.apache.lucene.util.TestRuleMarkFailure$1.evaluate(TestRuleMarkFailure.java:48)
   [junit4]   2> 	at com.carrotsearch.randomizedtesting.rules.StatementAdapter.evaluate(StatementAdapter.java:36)
   [junit4]   2> 	at com.carrotsearch.randomizedtesting.ThreadLeakControl$StatementRunner.run(ThreadLeakControl.java:360)
   [junit4]   2> 	at com.carrotsearch.randomizedtesting.ThreadLeakControl.forkTimeoutingTask(ThreadLeakControl.java:793)
   [junit4]   2> 	at com.carrotsearch.randomizedtesting.ThreadLeakControl$3.evaluate(ThreadLeakControl.java:453)
   [junit4]   2> 	at com.carrotsearch.randomizedtesting.RandomizedRunner.runSingleTest(RandomizedRunner.java:836)
   [junit4]   2> 	at com.carrotsearch.randomizedtesting.RandomizedRunner$3.evaluate(RandomizedRunner.java:738)
   [junit4]   2> 	at com.carrotsearch.randomizedtesting.RandomizedRunner$4.evaluate(RandomizedRunner.java:772)
   [junit4]   2> 	at com.carrotsearch.randomizedtesting.RandomizedRunner$5.evaluate(RandomizedRunner.java:783)
   [junit4]   2> 	at org.apache.lucene.util.AbstractBeforeAfterRule$1.evaluate(AbstractBeforeAfterRule.java:46)
   [junit4]   2> 	at org.apache.lucene.util.TestRuleStoreClassName$1.evaluate(TestRuleStoreClassName.java:42)
   [junit4]   2> 	at com.carrotsearch.randomizedtesting.rules.SystemPropertiesInvariantRule$1.evaluate(SystemPropertiesInvariantRule.java:55)
   [junit4]   2> 	at com.carrotsearch.randomizedtesting.rules.NoShadowingOrOverridesOnMethodsRule$1.evaluate(NoShadowingOrOverridesOnMethodsRule.java:39)
   [junit4]   2> 	at com.carrotsearch.randomizedtesting.rules.NoShadowingOrOverridesOnMethodsRule$1.evaluate(NoShadowingOrOverridesOnMethodsRule.java:39)
   [junit4]   2> 	at com.carrotsearch.randomizedtesting.rules.StatementAdapter.evaluate(StatementAdapter.java:36)
   [junit4]   2> 	at com.carrotsearch.randomizedtesting.rules.StatementAdapter.evaluate(StatementAdapter.java:36)
   [junit4]   2> 	at com.carrotsearch.randomizedtesting.rules.StatementAdapter.evaluate(StatementAdapter.java:36)
   [junit4]   2> 	at org.apache.lucene.util.TestRuleAssertionsRequired$1.evaluate(TestRuleAssertionsRequired.java:43)
   [junit4]   2> 	at org.apache.lucene.util.TestRuleMarkFailure$1.evaluate(TestRuleMarkFailure.java:48)
   [junit4]   2> 	at org.apache.lucene.util.TestRuleIgnoreAfterMaxFailures$1.evaluate(TestRuleIgnoreAfterMaxFailures.java:65)
   [junit4]   2> 	at org.apache.lucene.util.TestRuleIgnoreTestSuites$1.evaluate(TestRuleIgnoreTestSuites.java:55)
   [junit4]   2> 	at com.carrotsearch.randomizedtesting.rules.StatementAdapter.evaluate(StatementAdapter.java:36)
   [junit4]   2> 	at com.carrotsearch.randomizedtesting.ThreadLeakControl$StatementRunner.run(ThreadLeakControl.java:360)
   [junit4]   2> 	at java.lang.Thread.run(Thread.java:724)
   [junit4]   2> 
   [junit4]   2> "SUITE-TestIndexWriterExceptions2-seed#[AE6C3EFA0CEB6D9E]" ID=86 RUNNABLE
   [junit4]   2> 	at sun.management.ThreadImpl.dumpThreads0(Native Method)
   [junit4]   2> 	at sun.management.ThreadImpl.dumpAllThreads(ThreadImpl.java:446)
   [junit4]   2> 	at com.carrotsearch.randomizedtesting.ThreadLeakControl.formatThreadStacksFull(ThreadLeakControl.java:666)
   [junit4]   2> 	at com.carrotsearch.randomizedtesting.ThreadLeakControl.access$900(ThreadLeakControl.java:62)
   [junit4]   2> 	at com.carrotsearch.randomizedtesting.ThreadLeakControl$2.evaluate(ThreadLeakControl.java:407)
   [junit4]   2> 	- locked java.lang.Object@5eb69a6e
   [junit4]   2> 	at com.carrotsearch.randomizedtesting.RandomizedRunner.runSuite(RandomizedRunner.java:642)
   [junit4]   2> 	at com.carrotsearch.randomizedtesting.RandomizedRunner.access$200(RandomizedRunner.java:129)
   [junit4]   2> 	at com.carrotsearch.randomizedtesting.RandomizedRunner$1.run(RandomizedRunner.java:559)
   [junit4]   2> 
   [junit4]   2> "Signal Dispatcher" ID=4 RUNNABLE
   [junit4]   2> 
   [junit4]   2> "Finalizer" ID=3 WAITING on java.lang.ref.ReferenceQueue$Lock@2654dc56
   [junit4]   2> 	at java.lang.Object.wait(Native Method)
   [junit4]   2> 	- waiting on java.lang.ref.ReferenceQueue$Lock@2654dc56
   [junit4]   2> 	at java.lang.ref.ReferenceQueue.remove(ReferenceQueue.java:135)
   [junit4]   2> 	at java.lang.ref.ReferenceQueue.remove(ReferenceQueue.java:151)
   [junit4]   2> 	at java.lang.ref.Finalizer$FinalizerThread.run(Finalizer.java:189)
   [junit4]   2> 
   [junit4]   2> "Reference Handler" ID=2 WAITING on java.lang.ref.Reference$Lock@d4da5c3
   [junit4]   2> 	at java.lang.Object.wait(Native Method)
   [junit4]   2> 	- waiting on java.lang.ref.Reference$Lock@d4da5c3
   [junit4]   2> 	at java.lang.Object.wait(Object.java:503)
   [junit4]   2> 	at java.lang.ref.Reference$ReferenceHandler.run(Reference.java:133)
   [junit4]   2> 
   [junit4]   2> "main" ID=1 WAITING on com.carrotsearch.randomizedtesting.RandomizedRunner$1@2c23db2
   [junit4]   2> 	at java.lang.Object.wait(Native Method)
   [junit4]   2> 	- waiting on com.carrotsearch.randomizedtesting.RandomizedRunner$1@2c23db2
   [junit4]   2> 	at java.lang.Thread.join(Thread.java:1260)
   [junit4]   2> 	at java.lang.Thread.join(Thread.java:1334)
   [junit4]   2> 	at com.carrotsearch.randomizedtesting.RandomizedRunner.runSuite(RandomizedRunner.java:569)
   [junit4]   2> 	at com.carrotsearch.randomizedtesting.RandomizedRunner.run(RandomizedRunner.java:435)
   [junit4]   2> 	at com.carrotsearch.ant.tasks.junit4.slave.SlaveMain.execute(SlaveMain.java:180)
   [junit4]   2> 	at com.carrotsearch.ant.tasks.junit4.slave.SlaveMain.main(SlaveMain.java:276)
   [junit4]   2> 	at com.carrotsearch.ant.tasks.junit4.slave.SlaveMainSafe.main(SlaveMainSafe.java:12)
   [junit4]   2> 
   [junit4]   2> ^^==============================================
   [junit4]   2> 
   [junit4]   2> NOTE: download the large Jenkins line-docs file by running 'ant get-jenkins-line-docs' in the lucene directory.
   [junit4]   2> NOTE: reproduce with: ant test  -Dtestcase=TestIndexWriterExceptions2 -Dtests.method=testBasics -Dtests.seed=AE6C3EFA0CEB6D9E -Dtests.multiplier=2 -Dtests.nightly=true -Dtests.slow=true -Dtests.linedocsfile=/home/hudson/lucene-data/enwiki.random.lines.txt -Dtests.locale=es_ES -Dtests.timezone=Antarctica/Palmer -Dtests.file.encoding=US-ASCII
   [junit4] ERROR   7200s J1 | TestIndexWriterExceptions2.testBasics <<<
   [junit4]    > Throwable #1: java.lang.Exception: Test abandoned because suite timeout was reached.
   [junit4]    > 	at __randomizedtesting.SeedInfo.seed([AE6C3EFA0CEB6D9E]:0)
   [junit4]   2> may 09, 2014 12:05:19 AM com.carrotsearch.randomizedtesting.ThreadLeakControl checkThreadLeaks
   [junit4]   2> WARNING: Will linger awaiting termination of 1 leaked thread(s).
   [junit4]   2> may 09, 2014 12:05:39 AM com.carrotsearch.randomizedtesting.ThreadLeakControl checkThreadLeaks
   [junit4]   2> SEVERE: 1 thread leaked from SUITE scope at org.apache.lucene.index.TestIndexWriterExceptions2: 
   [junit4]   2>    1) Thread[id=87, name=TEST-TestIndexWriterExceptions2.testBasics-seed#[AE6C3EFA0CEB6D9E], state=TIMED_WAITING, group=TGRP-TestIndexWriterExceptions2]
   [junit4]   2>         at java.lang.Object.wait(Native Method)
   [junit4]   2>         at org.apache.lucene.index.IndexWriter.doWait(IndexWriter.java:4200)
   [junit4]   2>         at org.apache.lucene.index.IndexWriter.waitForMerges(IndexWriter.java:2237)
   [junit4]   2>         at org.apache.lucene.index.IndexWriter.finishMerges(IndexWriter.java:2221)
   [junit4]   2>         at org.apache.lucene.index.IndexWriter.shutdown(IndexWriter.java:885)
   [junit4]   2>         at org.apache.lucene.index.IndexWriter.shutdown(IndexWriter.java:869)
   [junit4]   2>         at org.apache.lucene.index.TestIndexWriterExceptions2.testBasics(TestIndexWriterExceptions2.java:198)
   [junit4]   2>         at sun.reflect.NativeMethodAccessorImpl.invoke0(Native Method)
   [junit4]   2>         at sun.reflect.NativeMethodAccessorImpl.invoke(NativeMethodAccessorImpl.java:57)
   [junit4]   2>         at sun.reflect.DelegatingMethodAccessorImpl.invoke(DelegatingMethodAccessorImpl.java:43)
   [junit4]   2>         at java.lang.reflect.Method.invoke(Method.java:606)
   [junit4]   2>         at com.carrotsearch.randomizedtesting.RandomizedRunner.invoke(RandomizedRunner.java:1618)
   [junit4]   2>         at com.carrotsearch.randomizedtesting.RandomizedRunner$6.evaluate(RandomizedRunner.java:827)
   [junit4]   2>         at com.carrotsearch.randomizedtesting.RandomizedRunner$7.evaluate(RandomizedRunner.java:863)
   [junit4]   2>         at com.carrotsearch.randomizedtesting.RandomizedRunner$8.evaluate(RandomizedRunner.java:877)
   [junit4]   2>         at org.apache.lucene.util.TestRuleSetupTeardownChained$1.evaluate(TestRuleSetupTeardownChained.java:50)
   [junit4]   2>         at org.apache.lucene.util.TestRuleFieldCacheSanity$1.evaluate(TestRuleFieldCacheSanity.java:51)
   [junit4]   2>         at org.apache.lucene.util.AbstractBeforeAfterRule$1.evaluate(AbstractBeforeAfterRule.java:46)
   [junit4]   2>         at com.carrotsearch.randomizedtesting.rules.SystemPropertiesInvariantRule$1.evaluate(SystemPropertiesInvariantRule.java:55)
   [junit4]   2>         at org.apache.lucene.util.TestRuleThreadAndTestName$1.evaluate(TestRuleThreadAndTestName.java:49)
   [junit4]   2>         at org.apache.lucene.util.TestRuleIgnoreAfterMaxFailures$1.evaluate(TestRuleIgnoreAfterMaxFailures.java:65)
   [junit4]   2>         at org.apache.lucene.util.TestRuleMarkFailure$1.evaluate(TestRuleMarkFailure.java:48)
   [junit4]   2>         at com.carrotsearch.randomizedtesting.rules.StatementAdapter.evaluate(StatementAdapter.java:36)
   [junit4]   2>         at com.carrotsearch.randomizedtesting.ThreadLeakControl$StatementRunner.run(ThreadLeakControl.java:360)
   [junit4]   2>         at com.carrotsearch.randomizedtesting.ThreadLeakControl.forkTimeoutingTask(ThreadLeakControl.java:793)
   [junit4]   2>         at com.carrotsearch.randomizedtesting.ThreadLeakControl$3.evaluate(ThreadLeakControl.java:453)
   [junit4]   2>         at com.carrotsearch.randomizedtesting.RandomizedRunner.runSingleTest(RandomizedRunner.java:836)
   [junit4]   2>         at com.carrotsearch.randomizedtesting.RandomizedRunner$3.evaluate(RandomizedRunner.java:738)
   [junit4]   2>         at com.carrotsearch.randomizedtesting.RandomizedRunner$4.evaluate(RandomizedRunner.java:772)
   [junit4]   2>         at com.carrotsearch.randomizedtesting.RandomizedRunner$5.evaluate(RandomizedRunner.java:783)
   [junit4]   2>         at org.apache.lucene.util.AbstractBeforeAfterRule$1.evaluate(AbstractBeforeAfterRule.java:46)
   [junit4]   2>         at org.apache.lucene.util.TestRuleStoreClassName$1.evaluate(TestRuleStoreClassName.java:42)
   [junit4]   2>         at com.carrotsearch.randomizedtesting.rules.SystemPropertiesInvariantRule$1.evaluate(SystemPropertiesInvariantRule.java:55)
   [junit4]   2>         at com.carrotsearch.randomizedtesting.rules.NoShadowingOrOverridesOnMethodsRule$1.evaluate(NoShadowingOrOverridesOnMethodsRule.java:39)
   [junit4]   2>         at com.carrotsearch.randomizedtesting.rules.NoShadowingOrOverridesOnMethodsRule$1.evaluate(NoShadowingOrOverridesOnMethodsRule.java:39)
   [junit4]   2>         at com.carrotsearch.randomizedtesting.rules.StatementAdapter.evaluate(StatementAdapter.java:36)
   [junit4]   2>         at com.carrotsearch.randomizedtesting.rules.StatementAdapter.evaluate(StatementAdapter.java:36)
   [junit4]   2>         at com.carrotsearch.randomizedtesting.rules.StatementAdapter.evaluate(StatementAdapter.java:36)
   [junit4]   2>         at org.apache.lucene.util.TestRuleAssertionsRequired$1.evaluate(TestRuleAssertionsRequired.java:43)
   [junit4]   2>         at org.apache.lucene.util.TestRuleMarkFailure$1.evaluate(TestRuleMarkFailure.java:48)
   [junit4]   2>         at org.apache.lucene.util.TestRuleIgnoreAfterMaxFailures$1.evaluate(TestRuleIgnoreAfterMaxFailures.java:65)
   [junit4]   2>         at org.apache.lucene.util.TestRuleIgnoreTestSuites$1.evaluate(TestRuleIgnoreTestSuites.java:55)
   [junit4]   2>         at com.carrotsearch.randomizedtesting.rules.StatementAdapter.evaluate(StatementAdapter.java:36)
   [junit4]   2>         at com.carrotsearch.randomizedtesting.ThreadLeakControl$StatementRunner.run(ThreadLeakControl.java:360)
   [junit4]   2>         at java.lang.Thread.run(Thread.java:724)
   [junit4]   2> may 09, 2014 12:05:39 AM com.carrotsearch.randomizedtesting.ThreadLeakControl tryToInterruptAll
   [junit4]   2> INFO: Starting to interrupt leaked threads:
   [junit4]   2>    1) Thread[id=87, name=TEST-TestIndexWriterExceptions2.testBasics-seed#[AE6C3EFA0CEB6D9E], state=TIMED_WAITING, group=TGRP-TestIndexWriterExceptions2]
   [junit4]   1> Unexpected exception: dumping fake-exception-log:...
   [junit4]   1> 
   [junit4]   1> TEST: got expected fake exc:Fake IOException from TokenStream.end()
   [junit4]   1> java.io.IOException: Fake IOException from TokenStream.end()
   [junit4]   1> 	at org.apache.lucene.analysis.CrankyTokenFilter.end(CrankyTokenFilter.java:51)
   [junit4]   1> 	at org.apache.lucene.index.DefaultIndexingChain$PerField.invert(DefaultIndexingChain.java:651)
   [junit4]   1> 	at org.apache.lucene.index.DefaultIndexingChain.processDocument(DefaultIndexingChain.java:305)
   [junit4]   1> 	at org.apache.lucene.index.DocumentsWriterPerThread.updateDocument(DocumentsWriterPerThread.java:222)
   [junit4]   1> 	at org.apache.lucene.index.DocumentsWriter.updateDocument(DocumentsWriter.java:462)
   [junit4]   1> 	at org.apache.lucene.index.IndexWriter.updateDocument(IndexWriter.java:1434)
   [junit4]   1> 	at org.apache.lucene.index.IndexWriter.addDocument(IndexWriter.java:1104)
   [junit4]   1> 	at org.apache.lucene.index.IndexWriter.addDocument(IndexWriter.java:1085)
   [junit4]   1> 	at org.apache.lucene.index.TestIndexWriterExceptions2.testBasics(TestIndexWriterExceptions2.java:126)
   [junit4]   1> 	at sun.reflect.NativeMethodAccessorImpl.invoke0(Native Method)
   [junit4]   1> 	at sun.reflect.NativeMethodAccessorImpl.invoke(NativeMethodAccessorImpl.java:57)
   [junit4]   1> 	at sun.reflect.DelegatingMethodAccessorImpl.invoke(DelegatingMethodAccessorImpl.java:43)
   [junit4]   1> 	at java.lang.reflect.Method.invoke(Method.java:606)
   [junit4]   1> 	at com.carrotsearch.randomizedtesting.RandomizedRunner.invoke(RandomizedRunner.java:1618)
   [junit4]   1> 	at com.carrotsearch.randomizedtesting.RandomizedRunner$6.evaluate(RandomizedRunner.java:827)
   [junit4]   1> 	at com.carrotsearch.randomizedtesting.RandomizedRunner$7.evaluate(RandomizedRunner.java:863)
   [junit4]   1> 	at com.carrotsearch.randomizedtesting.RandomizedRunner$8.evaluate(RandomizedRunner.java:877)
   [junit4]   1> 	at org.apache.lucene.util.TestRuleSetupTeardownChained$1.evaluate(TestRuleSetupTeardownChained.java:50)
   [junit4]   1> 	at org.apache.lucene.util.TestRuleFieldCacheSanity$1.evaluate(TestRuleFieldCacheSanity.java:51)
   [junit4]   1> 	at org.apache.lucene.util.AbstractBeforeAfterRule$1.evaluate(AbstractBeforeAfterRule.java:46)
   [junit4]   1> 	at com.carrotsearch.randomizedtesting.rules.SystemPropertiesInvariantRule$1.evaluate(SystemPropertiesInvariantRule.java:55)
   [junit4]   1> 	at org.apache.lucene.util.TestRuleThreadAndTestName$1.evaluate(TestRuleThreadAndTestName.java:49)
   [junit4]   1> 	at org.apache.lucene.util.TestRuleIgnoreAfterMaxFailures$1.evaluate(TestRuleIgnoreAfterMaxFailures.java:65)
   [junit4]   1> 	at org.apache.lucene.util.TestRuleMarkFailure$1.evaluate(TestRuleMarkFailure.java:48)
   [junit4]   1> 	at com.carrotsearch.randomizedtesting.rules.StatementAdapter.evaluate(StatementAdapter.java:36)
   [junit4]   1> 	at com.carrotsearch.randomizedtesting.ThreadLeakControl$StatementRunner.run(ThreadLeakControl.java:360)
   [junit4]   1> 	at com.carrotsearch.randomizedtesting.ThreadLeakControl.forkTimeoutingTask(ThreadLeakControl.java:793)
   [junit4]   1> 	at com.carrotsearch.randomizedtesting.ThreadLeakControl$3.evaluate(ThreadLeakControl.java:453)
   [junit4]   1> 	at com.carrotsearch.randomizedtesting.RandomizedRunner.runSingleTest(RandomizedRunner.java:836)
   [junit4]   1> 	at com.carrotsearch.randomizedtesting.RandomizedRunner$3.evaluate(RandomizedRunner.java:738)
   [junit4]   1> 	at com.carrotsearch.randomizedtesting.RandomizedRunner$4.evaluate(RandomizedRunner.java:772)
   [junit4]   1> 	at com.carrotsearch.randomizedtesting.RandomizedRunner$5.evaluate(RandomizedRunner.java:783)
   [junit4]   1> 	at org.apache.lucene.util.AbstractBeforeAfterRule$1.evaluate(AbstractBeforeAfterRule.java:46)
   [junit4]   1> 	at org.apache.lucene.util.TestRuleStoreClassName$1.evaluate(TestRuleStoreClassName.java:42)
   [junit4]   1> 	at com.carrotsearch.randomizedtesting.rules.SystemPropertiesInvariantRule$1.evaluate(SystemPropertiesInvariantRule.java:55)
   [junit4]   1> 	at com.carrotsearch.randomizedtesting.rules.NoShadowingOrOverridesOnMethodsRule$1.evaluate(NoShadowingOrOverridesOnMethodsRule.java:39)
   [junit4]   1> 	at com.carrotsearch.randomizedtesting.rules.NoShadowingOrOverridesOnMethodsRule$1.evaluate(NoShadowingOrOverridesOnMethodsRule.java:39)
   [junit4]   1> 	at com.carrotsearch.randomizedtesting.rules.StatementAdapter.evaluate(StatementAdapter.java:36)
   [junit4]   1> 	at com.carrotsearch.randomizedtesting.rules.StatementAdapter.evaluate(StatementAdapter.java:36)
   [junit4]   1> 	at com.carrotsearch.randomizedtesting.rules.StatementAdapter.evaluate(StatementAdapter.java:36)
   [junit4]   1> 	at org.apache.lucene.util.TestRuleAssertionsRequired$1.evaluate(TestRuleAssertionsRequired.java:43)
   [junit4]   1> 	at org.apache.lucene.util.TestRuleMarkFailure$1.evaluate(TestRuleMarkFailure.java:48)
   [junit4]   1> 	at org.apache.lucene.util.TestRuleIgnoreAfterMaxFailures$1.evaluate(TestRuleIgnoreAfterMaxFailures.java:65)
   [junit4]   1> 	at org.apache.lucene.util.TestRuleIgnoreTestSuites$1.evaluate(TestRuleIgnoreTestSuites.java:55)
   [junit4]   1> 	at com.carrotsearch.randomizedtesting.rules.StatementAdapter.evaluate(StatementAdapter.java:36)
   [junit4]   1> 	at com.carrotsearch.randomizedtesting.ThreadLeakControl$StatementRunner.run(ThreadLeakControl.java:360)
   [junit4]   1> 	at java.lang.Thread.run(Thread.java:724)
   [junit4]   1> 
   [junit4]   1> TEST: got expected fake exc:Fake IOException from TokenStream.incrementToken()
   [junit4]   1> java.io.IOException: Fake IOException from TokenStream.incrementToken()
   [junit4]   1> 	at org.apache.lucene.analysis.CrankyTokenFilter.incrementToken(CrankyTokenFilter.java:42)
   [junit4]   1> 	at org.apache.lucene.index.DefaultIndexingChain$PerField.invert(DefaultIndexingChain.java:587)
   [junit4]   1> 	at org.apache.lucene.index.DefaultIndexingChain.processDocument(DefaultIndexingChain.java:305)
   [junit4]   1> 	at org.apache.lucene.index.DocumentsWriterPerThread.updateDocument(DocumentsWriterPerThread.java:222)
   [junit4]   1> 	at org.apache.lucene.index.DocumentsWriter.updateDocument(DocumentsWriter.java:462)
   [junit4]   1> 	at org.apache.lucene.index.IndexWriter.updateDocument(IndexWriter.java:1434)
   [junit4]   1> 	at org.apache.lucene.index.IndexWriter.addDocument(IndexWriter.java:1104)
   [junit4]   1> 	at org.apache.lucene.index.IndexWriter.addDocument(IndexWriter.java:1085)
   [junit4]   1> 	at org.apache.lucene.index.TestIndexWriterExceptions2.testBasics(TestIndexWriterExceptions2.java:126)
   [junit4]   1> 	at sun.reflect.NativeMethodAccessorImpl.invoke0(Native Method)
   [junit4]   1> 	at sun.reflect.NativeMethodAccessorImpl.invoke(NativeMethodAccessorImpl.java:57)
   [junit4]   1> 	at sun.reflect.DelegatingMethodAccessorImpl.invoke(DelegatingMethodAccessorImpl.java:43)
   [junit4]   1> 	at java.lang.reflect.Method.invoke(Method.java:606)
   [junit4]   1> 	at com.carrotsearch.randomizedtesting.RandomizedRunner.invoke(RandomizedRunner.java:1618)
   [junit4]   1> 	at com.carrotsearch.randomizedtesting.RandomizedRunner$6.evaluate(RandomizedRunner.java:827)
   [junit4]   1> 	at com.carrotsearch.randomizedtesting.RandomizedRunner$7.evaluate(RandomizedRunner.java:863)
   [junit4]   1> 	at com.carrotsearch.randomizedtesting.RandomizedRunner$8.evaluate(RandomizedRunner.java:877)
   [junit4]   1> 	at org.apache.lucene.util.TestRuleSetupTeardownChained$1.evaluate(TestRuleSetupTeardownChained.java:50)
   [junit4]   1> 	at org.apache.lucene.util.TestRuleFieldCacheSanity$1.evaluate(TestRuleFieldCacheSanity.java:51)
   [junit4]   1> 	at org.apache.lucene.util.AbstractBeforeAfterRule$1.evaluate(AbstractBeforeAfterRule.java:46)
   [junit4]   1> 	at com.carrotsearch.randomizedtesting.rules.SystemPropertiesInvariantRule$1.evaluate(SystemPropertiesInvariantRule.java:55)
   [junit4]   1> 	at org.apache.lucene.util.TestRuleThreadAndTestName$1.evaluate(TestRuleThreadAndTestName.java:49)
   [junit4]   1> 	at org.apache.lucene.util.TestRuleIgnoreAfterMaxFailures$1.evaluate(TestRuleIgnoreAfterMaxFailures.java:65)
   [junit4]   1> 	at org.apache.lucene.util.TestRuleMarkFailure$1.evaluate(TestRuleMarkFailure.java:48)
   [junit4]   1> 	at com.carrotsearch.randomizedtesting.rules.StatementAdapter.evaluate(StatementAdapter.java:36)
   [junit4]   1> 	at com.carrotsearch.randomizedtesting.ThreadLeakControl$StatementRunner.run(ThreadLeakControl.java:360)
   [junit4]   1> 	at com.carrotsearch.randomizedtesting.ThreadLeakControl.forkTimeoutingTask(ThreadLeakControl.java:793)
   [junit4]   1> 	at com.carrotsearch.randomizedtesting.ThreadLeakControl$3.evaluate(ThreadLeakControl.java:453)
   [junit4]   1> 	at com.carrotsearch.randomizedtesting.RandomizedRunner.runSingleTest(RandomizedRunner.java:836)
   [junit4]   1> 	at com.carrotsearch.randomizedtesting.RandomizedRunner$3.evaluate(RandomizedRunner.java:738)
   [junit4]   1> 	at com.carrotsearch.randomizedtesting.RandomizedRunner$4.evaluate(RandomizedRunner.java:772)
   [junit4]   1> 	at com.carrotsearch.randomizedtesting.RandomizedRunner$5.evaluate(RandomizedRunner.java:783)
   [junit4]   1> 	at org.apache.lucene.util.AbstractBeforeAfterRule$1.evaluate(AbstractBeforeAfterRule.java:46)
   [junit4]   1> 	at org.apache.lucene.util.TestRuleStoreClassName$1.evaluate(TestRuleStoreClassName.java:42)
   [junit4]   1> 	at com.carrotsearch.randomizedtesting.rules.SystemPropertiesInvariantRule$1.evaluate(SystemPropertiesInvariantRule.java:55)
   [junit4]   1> 	at com.carrotsearch.randomizedtesting.rules.NoShadowingOrOverridesOnMethodsRule$1.evaluate(NoShadowingOrOverridesOnMethodsRule.java:39)
   [junit4]   1> 	at com.carrotsearch.randomizedtesting.rules.NoShadowingOrOverridesOnMethodsRule$1.evaluate(NoShadowingOrOverridesOnMethodsRule.java:39)
   [junit4]   1> 	at com.carrotsearch.randomizedtesting.rules.StatementAdapter.evaluate(StatementAdapter.java:36)
   [junit4]   1> 	at com.carrotsearch.randomizedtesting.rules.StatementAdapter.evaluate(StatementAdapter.java:36)
   [junit4]   1> 	at com.carrotsearch.randomizedtesting.rules.StatementAdapter.evaluate(StatementAdapter.java:36)
   [junit4]   1> 	at org.apache.lucene.util.TestRuleAssertionsRequired$1.evaluate(TestRuleAssertionsRequired.java:43)
   [junit4]   1> 	at org.apache.lucene.util.TestRuleMarkFailure$1.evaluate(TestRuleMarkFailure.java:48)
   [junit4]   1> 	at org.apache.lucene.util.TestRuleIgnoreAfterMaxFailures$1.evaluate(TestRuleIgnoreAfterMaxFailures.java:65)
   [junit4]   1> 	at org.apache.lucene.util.TestRuleIgnoreTestSuites$1.evaluate(TestRuleIgnoreTestSuites.java:55)
   [junit4]   1> 	at com.carrotsearch.randomizedtesting.rules.StatementAdapter.evaluate(StatementAdapter.java:36)
   [junit4]   1> 	at com.carrotsearch.randomizedtesting.ThreadLeakControl$StatementRunner.run(ThreadLeakControl.java:360)
   [junit4]   1> 	at java.lang.Thread.run(Thread.java:724)
   [junit4]   1> 
   [junit4]   1> TEST: got expected fake exc:Fake IOException from TokenStream.incrementToken()
   [junit4]   1> java.io.IOException: Fake IOException from TokenStream.incrementToken()
   [junit4]   1> 	at org.apache.lucene.analysis.CrankyTokenFilter.incrementToken(CrankyTokenFilter.java:42)
   [junit4]   1> 	at org.apache.lucene.index.DefaultIndexingChain$PerField.invert(DefaultIndexingChain.java:587)
   [junit4]   1> 	at org.apache.lucene.index.DefaultIndexingChain.processDocument(DefaultIndexingChain.java:305)
   [junit4]   1> 	at org.apache.lucene.index.DocumentsWriterPerThread.updateDocument(DocumentsWriterPerThread.java:222)
   [junit4]   1> 	at org.apache.lucene.index.DocumentsWriter.updateDocument(DocumentsWriter.java:462)
   [junit4]   1> 	at org.apache.lucene.index.IndexWriter.updateDocument(IndexWriter.java:1434)
   [junit4]   1> 	at org.apache.lucene.index.IndexWriter.addDocument(IndexWriter.java:1104)
   [junit4]   1> 	at org.apache.lucene.index.IndexWriter.addDocument(IndexWriter.java:1085)
   [junit4]   1> 	at org.apache.lucene.index.TestIndexWriterExceptions2.testBasics(TestIndexWriterExceptions2.java:126)
   [junit4]   1> 	at sun.reflect.NativeMethodAccessorImpl.invoke0(Native Method)
   [junit4]   1> 	at sun.reflect.NativeMethodAccessorImpl.invoke(NativeMethodAccessorImpl.java:57)
   [junit4]   1> 	at sun.reflect.DelegatingMethodAccessorImpl.invoke(DelegatingMethodAccessorImpl.java:43)
   [junit4]   1> 	at java.lang.reflect.Method.invoke(Method.java:606)
   [junit4]   1> 	at com.carrotsearch.randomizedtesting.RandomizedRunner.invoke(RandomizedRunner.java:1618)
   [junit4]   1> 	at com.carrotsearch.randomizedtesting.RandomizedRunner$6.evaluate(RandomizedRunner.java:827)
   [junit4]   1> 	at com.carrotsearch.randomizedtesting.RandomizedRunner$7.evaluate(RandomizedRunner.java:863)
   [junit4]   1> 	at com.carrotsearch.randomizedtesting.RandomizedRunner$8.evaluate(RandomizedRunner.java:877)
   [junit4]   1> 	at org.apache.lucene.util.TestRuleSetupTeardownChained$1.evaluate(TestRuleSetupTeardownChained.java:50)
   [junit4]   1> 	at org.apache.lucene.util.TestRuleFieldCacheSanity$1.evaluate(TestRuleFieldCacheSanity.java:51)
   [junit4]   1> 	at org.apache.lucene.util.AbstractBeforeAfterRule$1.evaluate(AbstractBeforeAfterRule.java:46)
   [junit4]   1> 	at com.carrotsearch.randomizedtesting.rules.SystemPropertiesInvariantRule$1.evaluate(SystemPropertiesInvariantRule.java:55)
   [junit4]   1> 	at org.apache.lucene.util.TestRuleThreadAndTestName$1.evaluate(TestRuleThreadAndTestName.java:49)
   [junit4]   1> 	at org.apache.lucene.util.TestRuleIgnoreAfterMaxFailures$1.evaluate(TestRuleIgnoreAfterMaxFailures.java:65)
   [junit4]   1> 	at org.apache.lucene.util.TestRuleMarkFailure$1.evaluate(TestRuleMarkFailure.java:48)
   [junit4]   1> 	at com.carrotsearch.randomizedtesting.rules.StatementAdapter.evaluate(StatementAdapter.java:36)
   [junit4]   1> 	at com.carrotsearch.randomizedtesting.ThreadLeakControl$StatementRunner.run(ThreadLeakControl.java:360)
   [junit4]   1> 	at com.carrotsearch.randomizedtesting.ThreadLeakControl.forkTimeoutingTask(ThreadLeakControl.java:793)
   [junit4]   1> 	at com.carrotsearch.randomizedtesting.ThreadLeakControl$3.evaluate(ThreadLeakControl.java:453)
   [junit4]   1> 	at com.carrotsearch.randomizedtesting.RandomizedRunner.runSingleTest(RandomizedRunner.java:836)
   [junit4]   1> 	at com.carrotsearch.randomizedtesting.RandomizedRunner$3.evaluate(RandomizedRunner.java:738)
   [junit4]   1> 	at com.carrotsearch.randomizedtesting.RandomizedRunner$4.evaluate(RandomizedRunner.java:772)
   [junit4]   1> 	at com.carrotsearch.randomizedtesting.RandomizedRunner$5.evaluate(RandomizedRunner.java:783)
   [junit4]   1> 	at org.apache.lucene.util.AbstractBeforeAfterRule$1.evaluate(AbstractBeforeAfterRule.java:46)
   [junit4]   1> 	at org.apache.lucene.util.TestRuleStoreClassName$1.evaluate(TestRuleStoreClassName.java:42)
   [junit4]   1> 	at com.carrotsearch.randomizedtesting.rules.SystemPropertiesInvariantRule$1.evaluate(SystemPropertiesInvariantRule.java:55)
   [junit4]   1> 	at com.carrotsearch.randomizedtesting.rules.NoShadowingOrOverridesOnMethodsRule$1.evaluate(NoShadowingOrOverridesOnMethodsRule.java:39)
   [junit4]   1> 	at com.carrotsearch.randomizedtesting.rules.NoShadowingOrOverridesOnMethodsRule$1.evaluate(NoShadowingOrOverridesOnMethodsRule.java:39)
   [junit4]   1> 	at com.carrotsearch.randomizedtesting.rules.StatementAdapter.evaluate(StatementAdapter.java:36)
   [junit4]   1> 	at com.carrotsearch.randomizedtesting.rules.StatementAdapter.evaluate(StatementAdapter.java:36)
   [junit4]   1> 	at com.carrotsearch.randomizedtesting.rules.StatementAdapter.evaluate(StatementAdapter.java:36)
   [junit4]   1> 	at org.apache.lucene.util.TestRuleAssertionsRequired$1.evaluate(TestRuleAssertionsRequired.java:43)
   [junit4]   1> 	at org.apache.lucene.util.TestRuleMarkFailure$1.evaluate(TestRuleMarkFailure.java:48)
   [junit4]   1> 	at org.apache.lucene.util.TestRuleIgnoreAfterMaxFailures$1.evaluate(TestRuleIgnoreAfterMaxFailures.java:65)
   [junit4]   1> 	at org.apache.lucene.util.TestRuleIgnoreTestSuites$1.evaluate(TestRuleIgnoreTestSuites.java:55)
   [junit4]   1> 	at com.carrotsearch.randomizedtesting.rules.StatementAdapter.evaluate(StatementAdapter.java:36)
   [junit4]   1> 	at com.carrotsearch.randomizedtesting.ThreadLeakControl$StatementRunner.run(ThreadLeakControl.java:360)
   [junit4]   1> 	at java.lang.Thread.run(Thread.java:724)
   [junit4]   1> 
   [junit4]   1> TEST: got expected fake exc:Fake IOException from TokenStream.incrementToken()
   [junit4]   1> java.io.IOException: Fake IOException from TokenStream.incrementToken()
   [junit4]   1> 	at org.apache.lucene.analysis.CrankyTokenFilter.incrementToken(CrankyTokenFilter.java:42)
   [junit4]   1> 	at org.apache.lucene.index.DefaultIndexingChain$PerField.invert(DefaultIndexingChain.java:587)
   [junit4]   1> 	at org.apache.lucene.index.DefaultIndexingChain.processDocument(DefaultIndexingChain.java:305)
   [junit4]   1> 	at org.apache.lucene.index.DocumentsWriterPerThread.updateDocument(DocumentsWriterPerThread.java:222)
   [junit4]   1> 	at org.apache.lucene.index.DocumentsWriter.updateDocument(DocumentsWriter.java:462)
   [junit4]   1> 	at org.apache.lucene.index.IndexWriter.updateDocument(IndexWriter.java:1434)
   [junit4]   1> 	at org.apache.lucene.index.IndexWriter.addDocument(IndexWriter.java:1104)
   [junit4]   1> 	at org.apache.lucene.index.IndexWriter.addDocument(IndexWriter.java:1085)
   [junit4]   1> 	at org.apache.lucene.index.TestIndexWriterExceptions2.testBasics(TestIndexWriterExceptions2.java:126)
   [junit4]   1> 	at sun.reflect.NativeMethodAccessorImpl.invoke0(Native Method)
   [junit4]   1> 	at sun.reflect.NativeMethodAccessorImpl.invoke(NativeMethodAccessorImpl.java:57)
   [junit4]   1> 	at sun.reflect.DelegatingMethodAccessorImpl.invoke(DelegatingMethodAccessorImpl.java:43)
   [junit4]   1> 	at java.lang.reflect.Method.invoke(Method.java:606)
   [junit4]   1> 	at com.carrotsearch.randomizedtesting.RandomizedRunner.invoke(RandomizedRunner.java:1618)
   [junit4]   1> 	at com.carrotsearch.randomizedtesting.RandomizedRunner$6.evaluate(RandomizedRunner.java:827)
   [junit4]   1> 	at com.carrotsearch.randomizedtesting.RandomizedRunner$7.evaluate(RandomizedRunner.java:863)
   [junit4]   1> 	at com.carrotsearch.randomizedtesting.RandomizedRunner$8.evaluate(RandomizedRunner.java:877)
   [junit4]   1> 	at org.apache.lucene.util.TestRuleSetupTeardownChained$1.evaluate(TestRuleSetupTeardownChained.java:50)
   [junit4]   1> 	at org.apache.lucene.util.TestRuleFieldCacheSanity$1.evaluate(TestRuleFieldCacheSanity.java:51)
   [junit4]   1> 	at org.apache.lucene.util.AbstractBeforeAfterRule$1.evaluate(AbstractBeforeAfterRule.java:46)
   [junit4]   1> 	at com.carrotsearch.randomizedtesting.rules.SystemPropertiesInvariantRule$1.evaluate(SystemPropertiesInvariantRule.java:55)
   [junit4]   1> 	at org.apache.lucene.util.TestRuleThreadAndTestName$1.evaluate(TestRuleThreadAndTestName.java:49)
   [junit4]   1> 	at org.apache.lucene.util.TestRuleIgnoreAfterMaxFailures$1.evaluate(TestRuleIgnoreAfterMaxFailures.java:65)
   [junit4]   1> 	at org.apache.lucene.util.TestRuleMarkFailure$1.evaluate(TestRuleMarkFailure.java:48)
   [junit4]   1> 	at com.carrotsearch.randomizedtesting.rules.StatementAdapter.evaluate(StatementAdapter.java:36)
   [junit4]   1> 	at com.carrotsearch.randomizedtesting.ThreadLeakControl$StatementRunner.run(ThreadLeakControl.java:360)
   [junit4]   1> 	at com.carrotsearch.randomizedtesting.ThreadLeakControl.forkTimeoutingTask(ThreadLeakControl.java:793)
   [junit4]   1> 	at com.carrotsearch.randomizedtesting.ThreadLeakControl$3.evaluate(ThreadLeakControl.java:453)
   [junit4]   1> 	at com.carrotsearch.randomizedtesting.RandomizedRunner.runSingleTest(RandomizedRunner.java:836)
   [junit4]   1> 	at com.carrotsearch.randomizedtesting.RandomizedRunner$3.evaluate(RandomizedRunner.java:738)
   [junit4]   1> 	at com.carrotsearch.randomizedtesting.RandomizedRunner$4.evaluate(RandomizedRunner.java:772)
   [junit4]   1> 	at com.carrotsearch.randomizedtesting.RandomizedRunner$5.evaluate(RandomizedRunner.java:783)
   [junit4]   1> 	at org.apache.lucene.util.AbstractBeforeAfterRule$1.evaluate(AbstractBeforeAfterRule.java:46)
   [junit4]   1> 	at org.apache.lucene.util.TestRuleStoreClassName$1.evaluate(TestRuleStoreClassName.java:42)
   [junit4]   1> 	at com.carrotsearch.randomizedtesting.rules.SystemPropertiesInvariantRule$1.evaluate(SystemPropertiesInvariantRule.java:55)
   [junit4]   1> 	at com.carrotsearch.randomizedtesting.rules.NoShadowingOrOverridesOnMethodsRule$1.evaluate(NoShadowingOrOverridesOnMethodsRule.java:39)
   [junit4]   1> 	at com.carrotsearch.randomizedtesting.rules.NoShadowingOrOverridesOnMethodsRule$1.evaluate(NoShadowingOrOverridesOnMethodsRule.java:39)
   [junit4]   1> 	at com.carrotsearch.randomizedtesting.rules.StatementAdapter.evaluate(StatementAdapter.java:36)
   [junit4]   1> 	at com.carrotsearch.randomizedtesting.rules.StatementAdapter.evaluate(StatementAdapter.java:36)
   [junit4]   1> 	at com.carrotsearch.randomizedtesting.rules.StatementAdapter.evaluate(StatementAdapter.java:36)
   [junit4]   1> 	at org.apache.lucene.util.TestRuleAssertionsRequired$1.evaluate(TestRuleAssertionsRequired.java:43)
   [junit4]   1> 	at org.apache.lucene.util.TestRuleMarkFailure$1.evaluate(TestRuleMarkFailure.java:48)
   [junit4]   1> 	at org.apache.lucene.util.TestRuleIgnoreAfterMaxFailures$1.evaluate(TestRuleIgnoreAfterMaxFailures.java:65)
   [junit4]   1> 	at org.apache.lucene.util.TestRuleIgnoreTestSuites$1.evaluate(TestRuleIgnoreTestSuites.java:55)
   [junit4]   1> 	at com.carrotsearch.randomizedtesting.rules.StatementAdapter.evaluate(StatementAdapter.java:36)
   [junit4]   1> 	at com.carrotsearch.randomizedtesting.ThreadLeakControl$StatementRunner.run(ThreadLeakControl.java:360)
   [junit4]   1> 	at java.lang.Thread.run(Thread.java:724)
   [junit4]   1> 
   [junit4]   1> TEST: got expected fake exc:Fake IOException from TokenStream.reset()
   [junit4]   1> java.io.IOException: Fake IOException from TokenStream.reset()
   [junit4]   1> 	at org.apache.lucene.analysis.CrankyTokenFilter.reset(CrankyTokenFilter.java:60)
   [junit4]   1> 	at org.apache.lucene.index.DefaultIndexingChain$PerField.invert(DefaultIndexingChain.java:582)
   [junit4]   1> 	at org.apache.lucene.index.DefaultIndexingChain.processDocument(DefaultIndexingChain.java:305)
   [junit4]   1> 	at org.apache.lucene.index.DocumentsWriterPerThread.updateDocument(DocumentsWriterPerThread.java:222)
   [junit4]   1> 	at org.apache.lucene.index.DocumentsWriter.updateDocument(DocumentsWriter.java:462)
   [junit4]   1> 	at org.apache.lucene.index.IndexWriter.updateDocument(IndexWriter.java:1434)
   [junit4]   1> 	at org.apache.lucene.index.IndexWriter.addDocument(IndexWriter.java:1104)
   [junit4]   1> 	at org.apache.lucene.index.IndexWriter.addDocument(IndexWriter.java:1085)
   [junit4]   1> 	at org.apache.lucene.index.TestIndexWriterExceptions2.testBasics(TestIndexWriterExceptions2.java:126)
   [junit4]   1> 	at sun.reflect.NativeMethodAccessorImpl.invoke0(Native Method)
   [junit4]   1> 	at sun.reflect.NativeMethodAccessorImpl.invoke(NativeMethodAccessorImpl.java:57)
   [junit4]   1> 	at sun.reflect.DelegatingMethodAccessorImpl.invoke(DelegatingMethodAccessorImpl.java:43)
   [junit4]   1> 	at java.lang.reflect.Method.invoke(Method.java:606)
   [junit4]   1> 	at com.carrotsearch.randomizedtesting.RandomizedRunner.invoke(RandomizedRunner.java:1618)
   [junit4]   1> 	at com.carrotsearch.randomizedtesting.RandomizedRunner$6.evaluate(RandomizedRunner.java:827)
   [junit4]   1> 	at com.carrotsearch.randomizedtesting.RandomizedRunner$7.evaluate(RandomizedRunner.java:863)
   [junit4]   1> 	at com.carrotsearch.randomizedtesting.RandomizedRunner$8.evaluate(RandomizedRunner.java:877)
   [junit4]   1> 	at org.apache.lucene.util.TestRuleSetupTeardownChained$1.evaluate(TestRuleSetupTeardownChained.java:50)
   [junit4]   1> 	at org.apache.lucene.util.TestRuleFieldCacheSanity$1.evaluate(TestRuleFieldCacheSanity.java:51)
   [junit4]   1> 	at org.apache.lucene.util.AbstractBeforeAfterRule$1.evaluate(AbstractBeforeAfterRule.java:46)
   [junit4]   1> 	at com.carrotsearch.randomizedtesting.rules.SystemPropertiesInvariantRule$1.evaluate(SystemPropertiesInvariantRule.java:55)
   [junit4]   1> 	at org.apache.lucene.util.TestRuleThreadAndTestName$1.evaluate(TestRuleThreadAndTestName.java:49)
   [junit4]   1> 	at org.apache.lucene.util.TestRuleIgnoreAfterMaxFailures$1.evaluate(TestRuleIgnoreAfterMaxFailures.java:65)
   [junit4]   1> 	at org.apache.lucene.util.TestRuleMarkFailure$1.evaluate(TestRuleMarkFailure.java:48)
   [junit4]   1> 	at com.carrotsearch.randomizedtesting.rules.StatementAdapter.evaluate(StatementAdapter.java:36)
   [junit4]   1> 	at com.carrotsearch.randomizedtesting.ThreadLeakControl$StatementRunner.run(ThreadLeakControl.java:360)
   [junit4]   1> 	at com.carrotsearch.randomizedtesting.ThreadLeakControl.forkTimeoutingTask(ThreadLeakControl.java:793)
   [junit4]   1> 	at com.carrotsearch.randomizedtesting.ThreadLeakControl$3.evaluate(ThreadLeakControl.java:453)
   [junit4]   1> 	at com.carrotsearch.randomizedtesting.RandomizedRunner.runSingleTest(RandomizedRunner.java:836)
   [junit4]   1> 	at com.carrotsearch.randomizedtesting.RandomizedRunner$3.evaluate(RandomizedRunner.java:738)
   [junit4]   1> 	at com.carrotsearch.randomizedtesting.RandomizedRunner$4.evaluate(RandomizedRunner.java:772)
   [junit4]   1> 	at com.carrotsearch.randomizedtesting.RandomizedRunner$5.evaluate(RandomizedRunner.java:783)
   [junit4]   1> 	at org.apache.lucene.util.AbstractBeforeAfterRule$1.evaluate(AbstractBeforeAfterRule.java:46)
   [junit4]   1> 	at org.apache.lucene.util.TestRuleStoreClassName$1.evaluate(TestRuleStoreClassName.java:42)
   [junit4]   1> 	at com.carrotsearch.randomizedtesting.rules.SystemPropertiesInvariantRule$1.evaluate(SystemPropertiesInvariantRule.java:55)
   [junit4]   1> 	at com.carrotsearch.randomizedtesting.rules.NoShadowingOrOverridesOnMethodsRule$1.evaluate(NoShadowingOrOverridesOnMethodsRule.java:39)
   [junit4]   1> 	at com.carrotsearch.randomizedtesting.rules.NoShadowingOrOverridesOnMethodsRule$1.evaluate(NoShadowingOrOverridesOnMethodsRule.java:39)
   [junit4]   1> 	at com.carrotsearch.randomizedtesting.rules.StatementAdapter.evaluate(StatementAdapter.java:36)
   [junit4]   1> 	at com.carrotsearch.randomizedtesting.rules.StatementAdapter.evaluate(StatementAdapter.java:36)
   [junit4]   1> 	at com.carrotsearch.randomizedtesting.rules.StatementAdapter.evaluate(StatementAdapter.java:36)
   [junit4]   1> 	at org.apache.lucene.util.TestRuleAssertionsRequired$1.evaluate(TestRuleAssertionsRequired.java:43)
   [junit4]   1> 	at org.apache.lucene.util.TestRuleMarkFailure$1.evaluate(TestRuleMarkFailure.java:48)
   [junit4]   1> 	at org.apache.lucene.util.TestRuleIgnoreAfterMaxFailures$1.evaluate(TestRuleIgnoreAfterMaxFailures.java:65)
   [junit4]   1> 	at org.apache.lucene.util.TestRuleIgnoreTestSuites$1.evaluate(TestRuleIgnoreTestSuites.java:55)
   [junit4]   1> 	at com.carrotsearch.randomizedtesting.rules.StatementAdapter.evaluate(StatementAdapter.java:36)
   [junit4]   1> 	at com.carrotsearch.randomizedtesting.ThreadLeakControl$StatementRunner.run(ThreadLeakControl.java:360)
   [junit4]   1> 	at java.lang.Thread.run(Thread.java:724)
   [junit4]   1> 
   [junit4]   1> TEST: got expected fake exc:Fake IOException from FieldInfosFormat.getFieldInfosWriter()
   [junit4]   1> java.io.IOException: Fake IOException from FieldInfosFormat.getFieldInfosWriter()
   [junit4]   1> 	at org.apache.lucene.codecs.cranky.CrankyFieldInfosFormat.getFieldInfosWriter(CrankyFieldInfosFormat.java:47)
   [junit4]   1> 	at org.apache.lucene.index.SegmentMerger.merge(SegmentMerger.java:151)
   [junit4]   1> 	at org.apache.lucene.index.IndexWriter.mergeMiddle(IndexWriter.java:3980)
   [junit4]   1> 	at org.apache.lucene.index.IndexWriter.merge(IndexWriter.java:3576)
   [junit4]   1> 	at org.apache.lucene.index.SerialMergeScheduler.merge(SerialMergeScheduler.java:40)
   [junit4]   1> 	at org.apache.lucene.index.IndexWriter.maybeMerge(IndexWriter.java:1883)
   [junit4]   1> 	at org.apache.lucene.index.IndexWriter.getReader(IndexWriter.java:410)
   [junit4]   1> 	at org.apache.lucene.index.DirectoryReader.open(DirectoryReader.java:87)
   [junit4]   1> 	at org.apache.lucene.index.TestIndexWriterExceptions2.testBasics(TestIndexWriterExceptions2.java:175)
   [junit4]   1> 	at sun.reflect.NativeMethodAccessorImpl.invoke0(Native Method)
   [junit4]   1> 	at sun.reflect.NativeMethodAccessorImpl.invoke(NativeMethodAccessorImpl.java:57)
   [junit4]   1> 	at sun.reflect.DelegatingMethodAccessorImpl.invoke(DelegatingMethodAccessorImpl.java:43)
   [junit4]   1> 	at java.lang.reflect.Method.invoke(Method.java:606)
   [junit4]   1> 	at com.carrotsearch.randomizedtesting.RandomizedRunner.invoke(RandomizedRunner.java:1618)
   [junit4]   1> 	at com.carrotsearch.randomizedtesting.RandomizedRunner$6.evaluate(RandomizedRunner.java:827)
   [junit4]   1> 	at com.carrotsearch.randomizedtesting.RandomizedRunner$7.evaluate(RandomizedRunner.java:863)
   [junit4]   1> 	at com.carrotsearch.randomizedtesting.RandomizedRunner$8.evaluate(RandomizedRunner.java:877)
   [junit4]   1> 	at org.apache.lucene.util.TestRuleSetupTeardownChained$1.evaluate(TestRuleSetupTeardownChained.java:50)
   [junit4]   1> 	at org.apache.lucene.util.TestRuleFieldCacheSanity$1.evaluate(TestRuleFieldCacheSanity.java:51)
   [junit4]   1> 	at org.apache.lucene.util.AbstractBeforeAfterRule$1.evaluate(AbstractBeforeAfterRule.java:46)
   [junit4]   1> 	at com.carrotsearch.randomizedtesting.rules.SystemPropertiesInvariantRule$1.evaluate(SystemPropertiesInvariantRule.java:55)
   [junit4]   1> 	at org.apache.lucene.util.TestRuleThreadAndTestName$1.evaluate(TestRuleThreadAndTestName.java:49)
   [junit4]   1> 	at org.apache.lucene.util.TestRuleIgnoreAfterMaxFailures$1.evaluate(TestRuleIgnoreAfterMaxFailures.java:65)
   [junit4]   1> 	at org.apache.lucene.util.TestRuleMarkFailure$1.evaluate(TestRuleMarkFailure.java:48)
   [junit4]   1> 	at com.carrotsearch.randomizedtesting.rules.StatementAdapter.evaluate(StatementAdapter.java:36)
   [junit4]   1> 	at com.carrotsearch.randomizedtesting.ThreadLeakControl$StatementRunner.run(ThreadLeakControl.java:360)
   [junit4]   1> 	at com.carrotsearch.randomizedtesting.ThreadLeakControl.forkTimeoutingTask(ThreadLeakControl.java:793)
   [junit4]   1> 	at com.carrotsearch.randomizedtesting.ThreadLeakControl$3.evaluate(ThreadLeakControl.java:453)
   [junit4]   1> 	at com.carrotsearch.randomizedtesting.RandomizedRunner.runSingleTest(RandomizedRunner.java:836)
   [junit4]   1> 	at com.carrotsearch.randomizedtesting.RandomizedRunner$3.evaluate(RandomizedRunner.java:738)
   [junit4]   1> 	at com.carrotsearch.randomizedtesting.RandomizedRunner$4.evaluate(RandomizedRunner.java:772)
   [junit4]   1> 	at com.carrotsearch.randomizedtesting.RandomizedRunner$5.evaluate(RandomizedRunner.java:783)
   [junit4]   1> 	at org.apache.lucene.util.AbstractBeforeAfterRule$1.evaluate(AbstractBeforeAfterRule.java:46)
   [junit4]   1> 	at org.apache.lucene.util.TestRuleStoreClassName$1.evaluate(TestRuleStoreClassName.java:42)
   [junit4]   1> 	at com.carrotsearch.randomizedtesting.rules.SystemPropertiesInvariantRule$1.evaluate(SystemPropertiesInvariantRule.java:55)
   [junit4]   1> 	at com.carrotsearch.randomizedtesting.rules.NoShadowingOrOverridesOnMethodsRule$1.evaluate(NoShadowingOrOverridesOnMethodsRule.java:39)
   [junit4]   1> 	at com.carrotsearch.randomizedtesting.rules.NoShadowingOrOverridesOnMethodsRule$1.evaluate(NoShadowingOrOverridesOnMethodsRule.java:39)
   [junit4]   1> 	at com.carrotsearch.randomizedtesting.rules.StatementAdapter.evaluate(StatementAdapter.java:36)
   [junit4]   1> 	at com.carrotsearch.randomizedtesting.rules.StatementAdapter.evaluate(StatementAdapter.java:36)
   [junit4]   1> 	at com.carrotsearch.randomizedtesting.rules.StatementAdapter.evaluate(StatementAdapter.java:36)
   [junit4]   1> 	at org.apache.lucene.util.TestRuleAssertionsRequired$1.evaluate(TestRuleAssertionsRequired.java:43)
   [junit4]   1> 	at org.apache.lucene.util.TestRuleMarkFailure$1.evaluate(TestRuleMarkFailure.java:48)
   [junit4]   1> 	at org.apache.lucene.util.TestRuleIgnoreAfterMaxFailures$1.evaluate(TestRuleIgnoreAfterMaxFailures.java:65)
   [junit4]   1> 	at org.apache.lucene.util.TestRuleIgnoreTestSuites$1.evaluate(TestRuleIgnoreTestSuites.java:55)
   [junit4]   1> 	at com.carrotsearch.randomizedtesting.rules.StatementAdapter.evaluate(StatementAdapter.java:36)
   [junit4]   1> 	at com.carrotsearch.randomizedtesting.ThreadLeakControl$StatementRunner.run(ThreadLeakControl.java:360)
   [junit4]   1> 	at java.lang.Thread.run(Thread.java:724)
   [junit4]   1> 
   [junit4]   1> TEST: got expected fake exc:Fake IOException from StoredFieldsFormat.fieldsWriter()
   [junit4]   1> java.io.IOExceptio

[...truncated too long message...]

e(StatementAdapter.java:36)
   [junit4]   1> 	at com.carrotsearch.randomizedtesting.rules.StatementAdapter.evaluate(StatementAdapter.java:36)
   [junit4]   1> 	at org.apache.lucene.util.TestRuleAssertionsRequired$1.evaluate(TestRuleAssertionsRequired.java:43)
   [junit4]   1> 	at org.apache.lucene.util.TestRuleMarkFailure$1.evaluate(TestRuleMarkFailure.java:48)
   [junit4]   1> 	at org.apache.lucene.util.TestRuleIgnoreAfterMaxFailures$1.evaluate(TestRuleIgnoreAfterMaxFailures.java:65)
   [junit4]   1> 	at org.apache.lucene.util.TestRuleIgnoreTestSuites$1.evaluate(TestRuleIgnoreTestSuites.java:55)
   [junit4]   1> 	at com.carrotsearch.randomizedtesting.rules.StatementAdapter.evaluate(StatementAdapter.java:36)
   [junit4]   1> 	at com.carrotsearch.randomizedtesting.ThreadLeakControl$StatementRunner.run(ThreadLeakControl.java:360)
   [junit4]   1> 	at java.lang.Thread.run(Thread.java:724)
   [junit4]   1> 
   [junit4]   1> TEST: got expected fake exc:Fake IOException from TermVectorsWriter.startField()
   [junit4]   1> java.io.IOException: Fake IOException from TermVectorsWriter.startField()
   [junit4]   1> 	at org.apache.lucene.codecs.cranky.CrankyTermVectorsFormat$CrankyTermVectorsWriter.startField(CrankyTermVectorsFormat.java:119)
   [junit4]   1> 	at org.apache.lucene.codecs.TermVectorsWriter.addAllDocVectors(TermVectorsWriter.java:257)
   [junit4]   1> 	at org.apache.lucene.codecs.TermVectorsWriter.merge(TermVectorsWriter.java:194)
   [junit4]   1> 	at org.apache.lucene.codecs.cranky.CrankyTermVectorsFormat$CrankyTermVectorsWriter.merge(CrankyTermVectorsFormat.java:79)
   [junit4]   1> 	at org.apache.lucene.index.SegmentMerger.mergeVectors(SegmentMerger.java:334)
   [junit4]   1> 	at org.apache.lucene.index.SegmentMerger.merge(SegmentMerger.java:142)
   [junit4]   1> 	at org.apache.lucene.index.IndexWriter.mergeMiddle(IndexWriter.java:3980)
   [junit4]   1> 	at org.apache.lucene.index.IndexWriter.merge(IndexWriter.java:3576)
   [junit4]   1> 	at org.apache.lucene.index.SerialMergeScheduler.merge(SerialMergeScheduler.java:40)
   [junit4]   1> 	at org.apache.lucene.index.IndexWriter.maybeMerge(IndexWriter.java:1883)
   [junit4]   1> 	at org.apache.lucene.index.IndexWriter.prepareCommitInternal(IndexWriter.java:2831)
   [junit4]   1> 	at org.apache.lucene.index.IndexWriter.commitInternal(IndexWriter.java:2940)
   [junit4]   1> 	at org.apache.lucene.index.IndexWriter.commit(IndexWriter.java:2907)
   [junit4]   1> 	at org.apache.lucene.index.TestIndexWriterExceptions2.testBasics(TestIndexWriterExceptions2.java:181)
   [junit4]   1> 	at sun.reflect.NativeMethodAccessorImpl.invoke0(Native Method)
   [junit4]   1> 	at sun.reflect.NativeMethodAccessorImpl.invoke(NativeMethodAccessorImpl.java:57)
   [junit4]   1> 	at sun.reflect.DelegatingMethodAccessorImpl.invoke(DelegatingMethodAccessorImpl.java:43)
   [junit4]   1> 	at java.lang.reflect.Method.invoke(Method.java:606)
   [junit4]   1> 	at com.carrotsearch.randomizedtesting.RandomizedRunner.invoke(RandomizedRunner.java:1618)
   [junit4]   1> 	at com.carrotsearch.randomizedtesting.RandomizedRunner$6.evaluate(RandomizedRunner.java:827)
   [junit4]   1> 	at com.carrotsearch.randomizedtesting.RandomizedRunner$7.evaluate(RandomizedRunner.java:863)
   [junit4]   1> 	at com.carrotsearch.randomizedtesting.RandomizedRunner$8.evaluate(RandomizedRunner.java:877)
   [junit4]   1> 	at org.apache.lucene.util.TestRuleSetupTeardownChained$1.evaluate(TestRuleSetupTeardownChained.java:50)
   [junit4]   1> 	at org.apache.lucene.util.TestRuleFieldCacheSanity$1.evaluate(TestRuleFieldCacheSanity.java:51)
   [junit4]   1> 	at org.apache.lucene.util.AbstractBeforeAfterRule$1.evaluate(AbstractBeforeAfterRule.java:46)
   [junit4]   1> 	at com.carrotsearch.randomizedtesting.rules.SystemPropertiesInvariantRule$1.evaluate(SystemPropertiesInvariantRule.java:55)
   [junit4]   1> 	at org.apache.lucene.util.TestRuleThreadAndTestName$1.evaluate(TestRuleThreadAndTestName.java:49)
   [junit4]   1> 	at org.apache.lucene.util.TestRuleIgnoreAfterMaxFailures$1.evaluate(TestRuleIgnoreAfterMaxFailures.java:65)
   [junit4]   1> 	at org.apache.lucene.util.TestRuleMarkFailure$1.evaluate(TestRuleMarkFailure.java:48)
   [junit4]   1> 	at com.carrotsearch.randomizedtesting.rules.StatementAdapter.evaluate(StatementAdapter.java:36)
   [junit4]   1> 	at com.carrotsearch.randomizedtesting.ThreadLeakControl$StatementRunner.run(ThreadLeakControl.java:360)
   [junit4]   1> 	at com.carrotsearch.randomizedtesting.ThreadLeakControl.forkTimeoutingTask(ThreadLeakControl.java:793)
   [junit4]   1> 	at com.carrotsearch.randomizedtesting.ThreadLeakControl$3.evaluate(ThreadLeakControl.java:453)
   [junit4]   1> 	at com.carrotsearch.randomizedtesting.RandomizedRunner.runSingleTest(RandomizedRunner.java:836)
   [junit4]   1> 	at com.carrotsearch.randomizedtesting.RandomizedRunner$3.evaluate(RandomizedRunner.java:738)
   [junit4]   1> 	at com.carrotsearch.randomizedtesting.RandomizedRunner$4.evaluate(RandomizedRunner.java:772)
   [junit4]   1> 	at com.carrotsearch.randomizedtesting.RandomizedRunner$5.evaluate(RandomizedRunner.java:783)
   [junit4]   1> 	at org.apache.lucene.util.AbstractBeforeAfterRule$1.evaluate(AbstractBeforeAfterRule.java:46)
   [junit4]   1> 	at org.apache.lucene.util.TestRuleStoreClassName$1.evaluate(TestRuleStoreClassName.java:42)
   [junit4]   1> 	at com.carrotsearch.randomizedtesting.rules.SystemPropertiesInvariantRule$1.evaluate(SystemPropertiesInvariantRule.java:55)
   [junit4]   1> 	at com.carrotsearch.randomizedtesting.rules.NoShadowingOrOverridesOnMethodsRule$1.evaluate(NoShadowingOrOverridesOnMethodsRule.java:39)
   [junit4]   1> 	at com.carrotsearch.randomizedtesting.rules.NoShadowingOrOverridesOnMethodsRule$1.evaluate(NoShadowingOrOverridesOnMethodsRule.java:39)
   [junit4]   1> 	at com.carrotsearch.randomizedtesting.rules.StatementAdapter.evaluate(StatementAdapter.java:36)
   [junit4]   1> 	at com.carrotsearch.randomizedtesting.rules.StatementAdapter.evaluate(StatementAdapter.java:36)
   [junit4]   1> 	at com.carrotsearch.randomizedtesting.rules.StatementAdapter.evaluate(StatementAdapter.java:36)
   [junit4]   1> 	at org.apache.lucene.util.TestRuleAssertionsRequired$1.evaluate(TestRuleAssertionsRequired.java:43)
   [junit4]   1> 	at org.apache.lucene.util.TestRuleMarkFailure$1.evaluate(TestRuleMarkFailure.java:48)
   [junit4]   1> 	at org.apache.lucene.util.TestRuleIgnoreAfterMaxFailures$1.evaluate(TestRuleIgnoreAfterMaxFailures.java:65)
   [junit4]   1> 	at org.apache.lucene.util.TestRuleIgnoreTestSuites$1.evaluate(TestRuleIgnoreTestSuites.java:55)
   [junit4]   1> 	at com.carrotsearch.randomizedtesting.rules.StatementAdapter.evaluate(StatementAdapter.java:36)
   [junit4]   1> 	at com.carrotsearch.randomizedtesting.ThreadLeakControl$StatementRunner.run(ThreadLeakControl.java:360)
   [junit4]   1> 	at java.lang.Thread.run(Thread.java:724)
   [junit4]   1> 
   [junit4]   2> May 09, 2014 4:05:40 AM com.carrotsearch.randomizedtesting.ThreadLeakControl tryToInterruptAll
   [junit4]   2> INFO: All leaked threads terminated.
   [junit4]   2> NOTE: test params are: codec=FastCompressingStoredFields(storedFieldsFormat=CompressingStoredFieldsFormat(compressionMode=FAST, chunkSize=497), termVectorsFormat=CompressingTermVectorsFormat(compressionMode=FAST, chunkSize=497)), sim=DefaultSimilarity, locale=es_ES, timezone=Antarctica/Palmer
   [junit4]   2> NOTE: FreeBSD 9.1-RELEASE-p3 amd64/Oracle Corporation 1.7.0_25 (64-bit)/cpus=16,threads=1,free=193933544,total=290390016
   [junit4]   2> NOTE: All tests run in this JVM: [TestBooleanQuery, TestWeakIdentityMap, TestFieldCache, TestOmitPositions, TestLongPostings, TestSimpleAttributeImpl, TestPrefixFilter, TestGroupFiltering, TestStringHelper, TestSpanMultiTermQueryWrapper, Test2BDocs, TestMergedIterator, TestTopDocsCollector, TestTerm, TestFieldMaskingSpanQuery, Nested1, TestIndexWriterExceptions2]
   [junit4]   2> NOTE: download the large Jenkins line-docs file by running 'ant get-jenkins-line-docs' in the lucene directory.
   [junit4]   2> NOTE: reproduce with: ant test  -Dtestcase=TestIndexWriterExceptions2 -Dtests.seed=AE6C3EFA0CEB6D9E -Dtests.multiplier=2 -Dtests.nightly=true -Dtests.slow=true -Dtests.linedocsfile=/home/hudson/lucene-data/enwiki.random.lines.txt -Dtests.locale=es_ES -Dtests.timezone=Antarctica/Palmer -Dtests.file.encoding=US-ASCII
   [junit4] ERROR   0.00s J1 | TestIndexWriterExceptions2 (suite) <<<
   [junit4]    > Throwable #1: java.lang.Exception: Suite timeout exceeded (>= 7200000 msec).
   [junit4]    > 	at __randomizedtesting.SeedInfo.seed([AE6C3EFA0CEB6D9E]:0)
   [junit4] Completed on J1 in 7221.58s, 1 test, 2 errors <<< FAILURES!

[...truncated 264 lines...]
BUILD FAILED
/usr/home/hudson/hudson-slave/workspace/Lucene-Solr-NightlyTests-trunk/build.xml:474: The following error occurred while executing this line:
/usr/home/hudson/hudson-slave/workspace/Lucene-Solr-NightlyTests-trunk/build.xml:447: The following error occurred while executing this line:
/usr/home/hudson/hudson-slave/workspace/Lucene-Solr-NightlyTests-trunk/build.xml:45: The following error occurred while executing this line:
/usr/home/hudson/hudson-slave/workspace/Lucene-Solr-NightlyTests-trunk/extra-targets.xml:37: The following error occurred while executing this line:
/usr/home/hudson/hudson-slave/workspace/Lucene-Solr-NightlyTests-trunk/lucene/build.xml:49: The following error occurred while executing this line:
/usr/home/hudson/hudson-slave/workspace/Lucene-Solr-NightlyTests-trunk/lucene/common-build.xml:1296: The following error occurred while executing this line:
/usr/home/hudson/hudson-slave/workspace/Lucene-Solr-NightlyTests-trunk/lucene/common-build.xml:920: There were test failures: 396 suites, 3061 tests, 2 suite-level errors, 3 errors, 77 ignored (67 assumptions)

Total time: 141 minutes 28 seconds
Build step 'Invoke Ant' marked build as failure
Archiving artifacts
Recording test results
Email was triggered for: Failure
Sending email for trigger: Failure



Mime
View raw message