lucene-dev mailing list archives

Site index · List index
Message view « Date » · « Thread »
Top « Date » · « Thread »
From Policeman Jenkins Server <jenk...@thetaphi.de>
Subject [JENKINS] Lucene-Solr-trunk-Linux (32bit/jdk1.8.0_05) - Build # 10314 - Failure!
Date Fri, 16 May 2014 15:57:51 GMT
Build: http://jenkins.thetaphi.de/job/Lucene-Solr-trunk-Linux/10314/
Java: 32bit/jdk1.8.0_05 -client -XX:+UseParallelGC

5 tests failed.
REGRESSION:  org.apache.lucene.index.TestIndexWriterMerging.testForceMergeDeletes2

Error Message:
background merge hit exception: _0(5.0):C2/1:delGen=1 _1(5.0):C2/1:delGen=1 _2(5.0):C2/1:delGen=1
into _1d

Stack Trace:
java.io.IOException: background merge hit exception: _0(5.0):C2/1:delGen=1 _1(5.0):C2/1:delGen=1
_2(5.0):C2/1:delGen=1 into _1d
	at __randomizedtesting.SeedInfo.seed([7908AE6AA1279581:DF8DC9C64F05A548]:0)
	at org.apache.lucene.index.IndexWriter.forceMergeDeletes(IndexWriter.java:1807)
	at org.apache.lucene.index.IndexWriter.forceMergeDeletes(IndexWriter.java:1847)
	at org.apache.lucene.index.TestIndexWriterMerging.testForceMergeDeletes2(TestIndexWriterMerging.java:238)
	at sun.reflect.NativeMethodAccessorImpl.invoke0(Native Method)
	at sun.reflect.NativeMethodAccessorImpl.invoke(NativeMethodAccessorImpl.java:62)
	at sun.reflect.DelegatingMethodAccessorImpl.invoke(DelegatingMethodAccessorImpl.java:43)
	at java.lang.reflect.Method.invoke(Method.java:483)
	at com.carrotsearch.randomizedtesting.RandomizedRunner.invoke(RandomizedRunner.java:1618)
	at com.carrotsearch.randomizedtesting.RandomizedRunner$6.evaluate(RandomizedRunner.java:827)
	at com.carrotsearch.randomizedtesting.RandomizedRunner$7.evaluate(RandomizedRunner.java:863)
	at com.carrotsearch.randomizedtesting.RandomizedRunner$8.evaluate(RandomizedRunner.java:877)
	at org.apache.lucene.util.TestRuleSetupTeardownChained$1.evaluate(TestRuleSetupTeardownChained.java:50)
	at org.apache.lucene.util.TestRuleFieldCacheSanity$1.evaluate(TestRuleFieldCacheSanity.java:51)
	at org.apache.lucene.util.AbstractBeforeAfterRule$1.evaluate(AbstractBeforeAfterRule.java:46)
	at com.carrotsearch.randomizedtesting.rules.SystemPropertiesInvariantRule$1.evaluate(SystemPropertiesInvariantRule.java:55)
	at org.apache.lucene.util.TestRuleThreadAndTestName$1.evaluate(TestRuleThreadAndTestName.java:49)
	at org.apache.lucene.util.TestRuleIgnoreAfterMaxFailures$1.evaluate(TestRuleIgnoreAfterMaxFailures.java:65)
	at org.apache.lucene.util.TestRuleMarkFailure$1.evaluate(TestRuleMarkFailure.java:48)
	at com.carrotsearch.randomizedtesting.rules.StatementAdapter.evaluate(StatementAdapter.java:36)
	at com.carrotsearch.randomizedtesting.ThreadLeakControl$StatementRunner.run(ThreadLeakControl.java:360)
	at com.carrotsearch.randomizedtesting.ThreadLeakControl.forkTimeoutingTask(ThreadLeakControl.java:793)
	at com.carrotsearch.randomizedtesting.ThreadLeakControl$3.evaluate(ThreadLeakControl.java:453)
	at com.carrotsearch.randomizedtesting.RandomizedRunner.runSingleTest(RandomizedRunner.java:836)
	at com.carrotsearch.randomizedtesting.RandomizedRunner$3.evaluate(RandomizedRunner.java:738)
	at com.carrotsearch.randomizedtesting.RandomizedRunner$4.evaluate(RandomizedRunner.java:772)
	at com.carrotsearch.randomizedtesting.RandomizedRunner$5.evaluate(RandomizedRunner.java:783)
	at org.apache.lucene.util.AbstractBeforeAfterRule$1.evaluate(AbstractBeforeAfterRule.java:46)
	at org.apache.lucene.util.TestRuleStoreClassName$1.evaluate(TestRuleStoreClassName.java:42)
	at com.carrotsearch.randomizedtesting.rules.SystemPropertiesInvariantRule$1.evaluate(SystemPropertiesInvariantRule.java:55)
	at com.carrotsearch.randomizedtesting.rules.NoShadowingOrOverridesOnMethodsRule$1.evaluate(NoShadowingOrOverridesOnMethodsRule.java:39)
	at com.carrotsearch.randomizedtesting.rules.NoShadowingOrOverridesOnMethodsRule$1.evaluate(NoShadowingOrOverridesOnMethodsRule.java:39)
	at com.carrotsearch.randomizedtesting.rules.StatementAdapter.evaluate(StatementAdapter.java:36)
	at com.carrotsearch.randomizedtesting.rules.StatementAdapter.evaluate(StatementAdapter.java:36)
	at com.carrotsearch.randomizedtesting.rules.StatementAdapter.evaluate(StatementAdapter.java:36)
	at org.apache.lucene.util.TestRuleAssertionsRequired$1.evaluate(TestRuleAssertionsRequired.java:43)
	at org.apache.lucene.util.TestRuleMarkFailure$1.evaluate(TestRuleMarkFailure.java:48)
	at org.apache.lucene.util.TestRuleIgnoreAfterMaxFailures$1.evaluate(TestRuleIgnoreAfterMaxFailures.java:65)
	at org.apache.lucene.util.TestRuleIgnoreTestSuites$1.evaluate(TestRuleIgnoreTestSuites.java:55)
	at com.carrotsearch.randomizedtesting.rules.StatementAdapter.evaluate(StatementAdapter.java:36)
	at com.carrotsearch.randomizedtesting.ThreadLeakControl$StatementRunner.run(ThreadLeakControl.java:360)
	at java.lang.Thread.run(Thread.java:745)


REGRESSION:  org.apache.lucene.index.TestIndexWriterMerging.testForceMergeDeletes

Error Message:
background merge hit exception: _0(5.0):c2/1:delGen=1 into _5

Stack Trace:
java.io.IOException: background merge hit exception: _0(5.0):c2/1:delGen=1 into _5
	at __randomizedtesting.SeedInfo.seed([7908AE6AA1279581:4B78FECC9EAD15AE]:0)
	at org.apache.lucene.index.IndexWriter.forceMergeDeletes(IndexWriter.java:1807)
	at org.apache.lucene.index.IndexWriter.forceMergeDeletes(IndexWriter.java:1847)
	at org.apache.lucene.index.TestIndexWriterMerging.testForceMergeDeletes(TestIndexWriterMerging.java:171)
	at sun.reflect.NativeMethodAccessorImpl.invoke0(Native Method)
	at sun.reflect.NativeMethodAccessorImpl.invoke(NativeMethodAccessorImpl.java:62)
	at sun.reflect.DelegatingMethodAccessorImpl.invoke(DelegatingMethodAccessorImpl.java:43)
	at java.lang.reflect.Method.invoke(Method.java:483)
	at com.carrotsearch.randomizedtesting.RandomizedRunner.invoke(RandomizedRunner.java:1618)
	at com.carrotsearch.randomizedtesting.RandomizedRunner$6.evaluate(RandomizedRunner.java:827)
	at com.carrotsearch.randomizedtesting.RandomizedRunner$7.evaluate(RandomizedRunner.java:863)
	at com.carrotsearch.randomizedtesting.RandomizedRunner$8.evaluate(RandomizedRunner.java:877)
	at org.apache.lucene.util.TestRuleSetupTeardownChained$1.evaluate(TestRuleSetupTeardownChained.java:50)
	at org.apache.lucene.util.TestRuleFieldCacheSanity$1.evaluate(TestRuleFieldCacheSanity.java:51)
	at org.apache.lucene.util.AbstractBeforeAfterRule$1.evaluate(AbstractBeforeAfterRule.java:46)
	at com.carrotsearch.randomizedtesting.rules.SystemPropertiesInvariantRule$1.evaluate(SystemPropertiesInvariantRule.java:55)
	at org.apache.lucene.util.TestRuleThreadAndTestName$1.evaluate(TestRuleThreadAndTestName.java:49)
	at org.apache.lucene.util.TestRuleIgnoreAfterMaxFailures$1.evaluate(TestRuleIgnoreAfterMaxFailures.java:65)
	at org.apache.lucene.util.TestRuleMarkFailure$1.evaluate(TestRuleMarkFailure.java:48)
	at com.carrotsearch.randomizedtesting.rules.StatementAdapter.evaluate(StatementAdapter.java:36)
	at com.carrotsearch.randomizedtesting.ThreadLeakControl$StatementRunner.run(ThreadLeakControl.java:360)
	at com.carrotsearch.randomizedtesting.ThreadLeakControl.forkTimeoutingTask(ThreadLeakControl.java:793)
	at com.carrotsearch.randomizedtesting.ThreadLeakControl$3.evaluate(ThreadLeakControl.java:453)
	at com.carrotsearch.randomizedtesting.RandomizedRunner.runSingleTest(RandomizedRunner.java:836)
	at com.carrotsearch.randomizedtesting.RandomizedRunner$3.evaluate(RandomizedRunner.java:738)
	at com.carrotsearch.randomizedtesting.RandomizedRunner$4.evaluate(RandomizedRunner.java:772)
	at com.carrotsearch.randomizedtesting.RandomizedRunner$5.evaluate(RandomizedRunner.java:783)
	at org.apache.lucene.util.AbstractBeforeAfterRule$1.evaluate(AbstractBeforeAfterRule.java:46)
	at org.apache.lucene.util.TestRuleStoreClassName$1.evaluate(TestRuleStoreClassName.java:42)
	at com.carrotsearch.randomizedtesting.rules.SystemPropertiesInvariantRule$1.evaluate(SystemPropertiesInvariantRule.java:55)
	at com.carrotsearch.randomizedtesting.rules.NoShadowingOrOverridesOnMethodsRule$1.evaluate(NoShadowingOrOverridesOnMethodsRule.java:39)
	at com.carrotsearch.randomizedtesting.rules.NoShadowingOrOverridesOnMethodsRule$1.evaluate(NoShadowingOrOverridesOnMethodsRule.java:39)
	at com.carrotsearch.randomizedtesting.rules.StatementAdapter.evaluate(StatementAdapter.java:36)
	at com.carrotsearch.randomizedtesting.rules.StatementAdapter.evaluate(StatementAdapter.java:36)
	at com.carrotsearch.randomizedtesting.rules.StatementAdapter.evaluate(StatementAdapter.java:36)
	at org.apache.lucene.util.TestRuleAssertionsRequired$1.evaluate(TestRuleAssertionsRequired.java:43)
	at org.apache.lucene.util.TestRuleMarkFailure$1.evaluate(TestRuleMarkFailure.java:48)
	at org.apache.lucene.util.TestRuleIgnoreAfterMaxFailures$1.evaluate(TestRuleIgnoreAfterMaxFailures.java:65)
	at org.apache.lucene.util.TestRuleIgnoreTestSuites$1.evaluate(TestRuleIgnoreTestSuites.java:55)
	at com.carrotsearch.randomizedtesting.rules.StatementAdapter.evaluate(StatementAdapter.java:36)
	at com.carrotsearch.randomizedtesting.ThreadLeakControl$StatementRunner.run(ThreadLeakControl.java:360)
	at java.lang.Thread.run(Thread.java:745)


REGRESSION:  org.apache.lucene.index.TestIndexWriterReader.testForceMergeDeletes

Error Message:
background merge hit exception: _0(5.0):c2/1:delGen=1

Stack Trace:
java.io.IOException: background merge hit exception: _0(5.0):c2/1:delGen=1
	at __randomizedtesting.SeedInfo.seed([7908AE6AA1279581:4B78FECC9EAD15AE]:0)
	at org.apache.lucene.index.IndexWriter.forceMergeDeletes(IndexWriter.java:1807)
	at org.apache.lucene.index.IndexWriter.forceMergeDeletes(IndexWriter.java:1847)
	at org.apache.lucene.index.TestIndexWriterReader.testForceMergeDeletes(TestIndexWriterReader.java:896)
	at sun.reflect.NativeMethodAccessorImpl.invoke0(Native Method)
	at sun.reflect.NativeMethodAccessorImpl.invoke(NativeMethodAccessorImpl.java:62)
	at sun.reflect.DelegatingMethodAccessorImpl.invoke(DelegatingMethodAccessorImpl.java:43)
	at java.lang.reflect.Method.invoke(Method.java:483)
	at com.carrotsearch.randomizedtesting.RandomizedRunner.invoke(RandomizedRunner.java:1618)
	at com.carrotsearch.randomizedtesting.RandomizedRunner$6.evaluate(RandomizedRunner.java:827)
	at com.carrotsearch.randomizedtesting.RandomizedRunner$7.evaluate(RandomizedRunner.java:863)
	at com.carrotsearch.randomizedtesting.RandomizedRunner$8.evaluate(RandomizedRunner.java:877)
	at org.apache.lucene.util.TestRuleSetupTeardownChained$1.evaluate(TestRuleSetupTeardownChained.java:50)
	at org.apache.lucene.util.TestRuleFieldCacheSanity$1.evaluate(TestRuleFieldCacheSanity.java:51)
	at org.apache.lucene.util.AbstractBeforeAfterRule$1.evaluate(AbstractBeforeAfterRule.java:46)
	at com.carrotsearch.randomizedtesting.rules.SystemPropertiesInvariantRule$1.evaluate(SystemPropertiesInvariantRule.java:55)
	at org.apache.lucene.util.TestRuleThreadAndTestName$1.evaluate(TestRuleThreadAndTestName.java:49)
	at org.apache.lucene.util.TestRuleIgnoreAfterMaxFailures$1.evaluate(TestRuleIgnoreAfterMaxFailures.java:65)
	at org.apache.lucene.util.TestRuleMarkFailure$1.evaluate(TestRuleMarkFailure.java:48)
	at com.carrotsearch.randomizedtesting.rules.StatementAdapter.evaluate(StatementAdapter.java:36)
	at com.carrotsearch.randomizedtesting.ThreadLeakControl$StatementRunner.run(ThreadLeakControl.java:360)
	at com.carrotsearch.randomizedtesting.ThreadLeakControl.forkTimeoutingTask(ThreadLeakControl.java:793)
	at com.carrotsearch.randomizedtesting.ThreadLeakControl$3.evaluate(ThreadLeakControl.java:453)
	at com.carrotsearch.randomizedtesting.RandomizedRunner.runSingleTest(RandomizedRunner.java:836)
	at com.carrotsearch.randomizedtesting.RandomizedRunner$3.evaluate(RandomizedRunner.java:738)
	at com.carrotsearch.randomizedtesting.RandomizedRunner$4.evaluate(RandomizedRunner.java:772)
	at com.carrotsearch.randomizedtesting.RandomizedRunner$5.evaluate(RandomizedRunner.java:783)
	at org.apache.lucene.util.AbstractBeforeAfterRule$1.evaluate(AbstractBeforeAfterRule.java:46)
	at org.apache.lucene.util.TestRuleStoreClassName$1.evaluate(TestRuleStoreClassName.java:42)
	at com.carrotsearch.randomizedtesting.rules.SystemPropertiesInvariantRule$1.evaluate(SystemPropertiesInvariantRule.java:55)
	at com.carrotsearch.randomizedtesting.rules.NoShadowingOrOverridesOnMethodsRule$1.evaluate(NoShadowingOrOverridesOnMethodsRule.java:39)
	at com.carrotsearch.randomizedtesting.rules.NoShadowingOrOverridesOnMethodsRule$1.evaluate(NoShadowingOrOverridesOnMethodsRule.java:39)
	at com.carrotsearch.randomizedtesting.rules.StatementAdapter.evaluate(StatementAdapter.java:36)
	at com.carrotsearch.randomizedtesting.rules.StatementAdapter.evaluate(StatementAdapter.java:36)
	at com.carrotsearch.randomizedtesting.rules.StatementAdapter.evaluate(StatementAdapter.java:36)
	at org.apache.lucene.util.TestRuleAssertionsRequired$1.evaluate(TestRuleAssertionsRequired.java:43)
	at org.apache.lucene.util.TestRuleMarkFailure$1.evaluate(TestRuleMarkFailure.java:48)
	at org.apache.lucene.util.TestRuleIgnoreAfterMaxFailures$1.evaluate(TestRuleIgnoreAfterMaxFailures.java:65)
	at org.apache.lucene.util.TestRuleIgnoreTestSuites$1.evaluate(TestRuleIgnoreTestSuites.java:55)
	at com.carrotsearch.randomizedtesting.rules.StatementAdapter.evaluate(StatementAdapter.java:36)
	at com.carrotsearch.randomizedtesting.ThreadLeakControl$StatementRunner.run(ThreadLeakControl.java:360)
	at java.lang.Thread.run(Thread.java:745)


REGRESSION:  org.apache.lucene.index.TestTieredMergePolicy.testForceMergeDeletes

Error Message:
background merge hit exception: _0(5.0):c4 _1(5.0):c4 _2(5.0):c4 _3(5.0):c4 _4(5.0):c4 _5(5.0):c4
_6(5.0):c4 _7(5.0):c4 _8(5.0):c4 _9(5.0):c4 _a(5.0):c4 _b(5.0):c4 _c(5.0):c4 _d(5.0):c4 _e(5.0):c4
_f(5.0):c4 _g(5.0):c4 _h(5.0):c4 _i(5.0):c4 _j(5.0):c4

Stack Trace:
java.io.IOException: background merge hit exception: _0(5.0):c4 _1(5.0):c4 _2(5.0):c4 _3(5.0):c4
_4(5.0):c4 _5(5.0):c4 _6(5.0):c4 _7(5.0):c4 _8(5.0):c4 _9(5.0):c4 _a(5.0):c4 _b(5.0):c4 _c(5.0):c4
_d(5.0):c4 _e(5.0):c4 _f(5.0):c4 _g(5.0):c4 _h(5.0):c4 _i(5.0):c4 _j(5.0):c4
	at __randomizedtesting.SeedInfo.seed([7908AE6AA1279581:4B78FECC9EAD15AE]:0)
	at org.apache.lucene.index.IndexWriter.forceMergeDeletes(IndexWriter.java:1807)
	at org.apache.lucene.index.IndexWriter.forceMergeDeletes(IndexWriter.java:1847)
	at org.apache.lucene.index.TestTieredMergePolicy.testForceMergeDeletes(TestTieredMergePolicy.java:64)
	at sun.reflect.NativeMethodAccessorImpl.invoke0(Native Method)
	at sun.reflect.NativeMethodAccessorImpl.invoke(NativeMethodAccessorImpl.java:62)
	at sun.reflect.DelegatingMethodAccessorImpl.invoke(DelegatingMethodAccessorImpl.java:43)
	at java.lang.reflect.Method.invoke(Method.java:483)
	at com.carrotsearch.randomizedtesting.RandomizedRunner.invoke(RandomizedRunner.java:1618)
	at com.carrotsearch.randomizedtesting.RandomizedRunner$6.evaluate(RandomizedRunner.java:827)
	at com.carrotsearch.randomizedtesting.RandomizedRunner$7.evaluate(RandomizedRunner.java:863)
	at com.carrotsearch.randomizedtesting.RandomizedRunner$8.evaluate(RandomizedRunner.java:877)
	at org.apache.lucene.util.TestRuleSetupTeardownChained$1.evaluate(TestRuleSetupTeardownChained.java:50)
	at org.apache.lucene.util.TestRuleFieldCacheSanity$1.evaluate(TestRuleFieldCacheSanity.java:51)
	at org.apache.lucene.util.AbstractBeforeAfterRule$1.evaluate(AbstractBeforeAfterRule.java:46)
	at com.carrotsearch.randomizedtesting.rules.SystemPropertiesInvariantRule$1.evaluate(SystemPropertiesInvariantRule.java:55)
	at org.apache.lucene.util.TestRuleThreadAndTestName$1.evaluate(TestRuleThreadAndTestName.java:49)
	at org.apache.lucene.util.TestRuleIgnoreAfterMaxFailures$1.evaluate(TestRuleIgnoreAfterMaxFailures.java:65)
	at org.apache.lucene.util.TestRuleMarkFailure$1.evaluate(TestRuleMarkFailure.java:48)
	at com.carrotsearch.randomizedtesting.rules.StatementAdapter.evaluate(StatementAdapter.java:36)
	at com.carrotsearch.randomizedtesting.ThreadLeakControl$StatementRunner.run(ThreadLeakControl.java:360)
	at com.carrotsearch.randomizedtesting.ThreadLeakControl.forkTimeoutingTask(ThreadLeakControl.java:793)
	at com.carrotsearch.randomizedtesting.ThreadLeakControl$3.evaluate(ThreadLeakControl.java:453)
	at com.carrotsearch.randomizedtesting.RandomizedRunner.runSingleTest(RandomizedRunner.java:836)
	at com.carrotsearch.randomizedtesting.RandomizedRunner$3.evaluate(RandomizedRunner.java:738)
	at com.carrotsearch.randomizedtesting.RandomizedRunner$4.evaluate(RandomizedRunner.java:772)
	at com.carrotsearch.randomizedtesting.RandomizedRunner$5.evaluate(RandomizedRunner.java:783)
	at org.apache.lucene.util.AbstractBeforeAfterRule$1.evaluate(AbstractBeforeAfterRule.java:46)
	at org.apache.lucene.util.TestRuleStoreClassName$1.evaluate(TestRuleStoreClassName.java:42)
	at com.carrotsearch.randomizedtesting.rules.SystemPropertiesInvariantRule$1.evaluate(SystemPropertiesInvariantRule.java:55)
	at com.carrotsearch.randomizedtesting.rules.NoShadowingOrOverridesOnMethodsRule$1.evaluate(NoShadowingOrOverridesOnMethodsRule.java:39)
	at com.carrotsearch.randomizedtesting.rules.NoShadowingOrOverridesOnMethodsRule$1.evaluate(NoShadowingOrOverridesOnMethodsRule.java:39)
	at com.carrotsearch.randomizedtesting.rules.StatementAdapter.evaluate(StatementAdapter.java:36)
	at com.carrotsearch.randomizedtesting.rules.StatementAdapter.evaluate(StatementAdapter.java:36)
	at com.carrotsearch.randomizedtesting.rules.StatementAdapter.evaluate(StatementAdapter.java:36)
	at org.apache.lucene.util.TestRuleAssertionsRequired$1.evaluate(TestRuleAssertionsRequired.java:43)
	at org.apache.lucene.util.TestRuleMarkFailure$1.evaluate(TestRuleMarkFailure.java:48)
	at org.apache.lucene.util.TestRuleIgnoreAfterMaxFailures$1.evaluate(TestRuleIgnoreAfterMaxFailures.java:65)
	at org.apache.lucene.util.TestRuleIgnoreTestSuites$1.evaluate(TestRuleIgnoreTestSuites.java:55)
	at com.carrotsearch.randomizedtesting.rules.StatementAdapter.evaluate(StatementAdapter.java:36)
	at com.carrotsearch.randomizedtesting.ThreadLeakControl$StatementRunner.run(ThreadLeakControl.java:360)
	at java.lang.Thread.run(Thread.java:745)


REGRESSION:  org.apache.lucene.index.TestTieredMergePolicy.testForceMergeDeletesMaxSegSize

Error Message:
background merge hit exception: _5(5.0):C881 [maxNumSegments=1]

Stack Trace:
java.io.IOException: background merge hit exception: _5(5.0):C881 [maxNumSegments=1]
	at __randomizedtesting.SeedInfo.seed([7908AE6AA1279581:1B0FC19AF82E203F]:0)
	at org.apache.lucene.index.IndexWriter.forceMergeDeletes(IndexWriter.java:1807)
	at org.apache.lucene.index.IndexWriter.forceMergeDeletes(IndexWriter.java:1847)
	at org.apache.lucene.index.TestTieredMergePolicy.testForceMergeDeletesMaxSegSize(TestTieredMergePolicy.java:148)
	at sun.reflect.NativeMethodAccessorImpl.invoke0(Native Method)
	at sun.reflect.NativeMethodAccessorImpl.invoke(NativeMethodAccessorImpl.java:62)
	at sun.reflect.DelegatingMethodAccessorImpl.invoke(DelegatingMethodAccessorImpl.java:43)
	at java.lang.reflect.Method.invoke(Method.java:483)
	at com.carrotsearch.randomizedtesting.RandomizedRunner.invoke(RandomizedRunner.java:1618)
	at com.carrotsearch.randomizedtesting.RandomizedRunner$6.evaluate(RandomizedRunner.java:827)
	at com.carrotsearch.randomizedtesting.RandomizedRunner$7.evaluate(RandomizedRunner.java:863)
	at com.carrotsearch.randomizedtesting.RandomizedRunner$8.evaluate(RandomizedRunner.java:877)
	at org.apache.lucene.util.TestRuleSetupTeardownChained$1.evaluate(TestRuleSetupTeardownChained.java:50)
	at org.apache.lucene.util.TestRuleFieldCacheSanity$1.evaluate(TestRuleFieldCacheSanity.java:51)
	at org.apache.lucene.util.AbstractBeforeAfterRule$1.evaluate(AbstractBeforeAfterRule.java:46)
	at com.carrotsearch.randomizedtesting.rules.SystemPropertiesInvariantRule$1.evaluate(SystemPropertiesInvariantRule.java:55)
	at org.apache.lucene.util.TestRuleThreadAndTestName$1.evaluate(TestRuleThreadAndTestName.java:49)
	at org.apache.lucene.util.TestRuleIgnoreAfterMaxFailures$1.evaluate(TestRuleIgnoreAfterMaxFailures.java:65)
	at org.apache.lucene.util.TestRuleMarkFailure$1.evaluate(TestRuleMarkFailure.java:48)
	at com.carrotsearch.randomizedtesting.rules.StatementAdapter.evaluate(StatementAdapter.java:36)
	at com.carrotsearch.randomizedtesting.ThreadLeakControl$StatementRunner.run(ThreadLeakControl.java:360)
	at com.carrotsearch.randomizedtesting.ThreadLeakControl.forkTimeoutingTask(ThreadLeakControl.java:793)
	at com.carrotsearch.randomizedtesting.ThreadLeakControl$3.evaluate(ThreadLeakControl.java:453)
	at com.carrotsearch.randomizedtesting.RandomizedRunner.runSingleTest(RandomizedRunner.java:836)
	at com.carrotsearch.randomizedtesting.RandomizedRunner$3.evaluate(RandomizedRunner.java:738)
	at com.carrotsearch.randomizedtesting.RandomizedRunner$4.evaluate(RandomizedRunner.java:772)
	at com.carrotsearch.randomizedtesting.RandomizedRunner$5.evaluate(RandomizedRunner.java:783)
	at org.apache.lucene.util.AbstractBeforeAfterRule$1.evaluate(AbstractBeforeAfterRule.java:46)
	at org.apache.lucene.util.TestRuleStoreClassName$1.evaluate(TestRuleStoreClassName.java:42)
	at com.carrotsearch.randomizedtesting.rules.SystemPropertiesInvariantRule$1.evaluate(SystemPropertiesInvariantRule.java:55)
	at com.carrotsearch.randomizedtesting.rules.NoShadowingOrOverridesOnMethodsRule$1.evaluate(NoShadowingOrOverridesOnMethodsRule.java:39)
	at com.carrotsearch.randomizedtesting.rules.NoShadowingOrOverridesOnMethodsRule$1.evaluate(NoShadowingOrOverridesOnMethodsRule.java:39)
	at com.carrotsearch.randomizedtesting.rules.StatementAdapter.evaluate(StatementAdapter.java:36)
	at com.carrotsearch.randomizedtesting.rules.StatementAdapter.evaluate(StatementAdapter.java:36)
	at com.carrotsearch.randomizedtesting.rules.StatementAdapter.evaluate(StatementAdapter.java:36)
	at org.apache.lucene.util.TestRuleAssertionsRequired$1.evaluate(TestRuleAssertionsRequired.java:43)
	at org.apache.lucene.util.TestRuleMarkFailure$1.evaluate(TestRuleMarkFailure.java:48)
	at org.apache.lucene.util.TestRuleIgnoreAfterMaxFailures$1.evaluate(TestRuleIgnoreAfterMaxFailures.java:65)
	at org.apache.lucene.util.TestRuleIgnoreTestSuites$1.evaluate(TestRuleIgnoreTestSuites.java:55)
	at com.carrotsearch.randomizedtesting.rules.StatementAdapter.evaluate(StatementAdapter.java:36)
	at com.carrotsearch.randomizedtesting.ThreadLeakControl$StatementRunner.run(ThreadLeakControl.java:360)
	at java.lang.Thread.run(Thread.java:745)




Build Log:
[...truncated 836 lines...]
   [junit4] Suite: org.apache.lucene.index.TestIndexWriterMerging
   [junit4]   2> NOTE: reproduce with: ant test  -Dtestcase=TestIndexWriterMerging -Dtests.method=testForceMergeDeletes2
-Dtests.seed=7908AE6AA1279581 -Dtests.multiplier=3 -Dtests.slow=true -Dtests.locale=bg -Dtests.timezone=Australia/Tasmania
-Dtests.file.encoding=UTF-8
   [junit4] ERROR   1.12s J0 | TestIndexWriterMerging.testForceMergeDeletes2 <<<
   [junit4]    > Throwable #1: java.io.IOException: background merge hit exception: _0(5.0):C2/1:delGen=1
_1(5.0):C2/1:delGen=1 _2(5.0):C2/1:delGen=1 into _1d
   [junit4]    > 	at __randomizedtesting.SeedInfo.seed([7908AE6AA1279581:DF8DC9C64F05A548]:0)
   [junit4]    > 	at org.apache.lucene.index.IndexWriter.forceMergeDeletes(IndexWriter.java:1807)
   [junit4]    > 	at org.apache.lucene.index.IndexWriter.forceMergeDeletes(IndexWriter.java:1847)
   [junit4]    > 	at org.apache.lucene.index.TestIndexWriterMerging.testForceMergeDeletes2(TestIndexWriterMerging.java:238)
   [junit4]    > 	at java.lang.Thread.run(Thread.java:745)
   [junit4]   2> NOTE: reproduce with: ant test  -Dtestcase=TestIndexWriterMerging -Dtests.method=testForceMergeDeletes
-Dtests.seed=7908AE6AA1279581 -Dtests.multiplier=3 -Dtests.slow=true -Dtests.locale=bg -Dtests.timezone=Australia/Tasmania
-Dtests.file.encoding=UTF-8
   [junit4] ERROR   0.02s J0 | TestIndexWriterMerging.testForceMergeDeletes <<<
   [junit4]    > Throwable #1: java.io.IOException: background merge hit exception: _0(5.0):c2/1:delGen=1
into _5
   [junit4]    > 	at __randomizedtesting.SeedInfo.seed([7908AE6AA1279581:4B78FECC9EAD15AE]:0)
   [junit4]    > 	at org.apache.lucene.index.IndexWriter.forceMergeDeletes(IndexWriter.java:1807)
   [junit4]    > 	at org.apache.lucene.index.IndexWriter.forceMergeDeletes(IndexWriter.java:1847)
   [junit4]    > 	at org.apache.lucene.index.TestIndexWriterMerging.testForceMergeDeletes(TestIndexWriterMerging.java:171)
   [junit4]    > 	at java.lang.Thread.run(Thread.java:745)
   [junit4]   2> NOTE: test params are: codec=Lucene46: {tvtest=PostingsFormat(name=FSTPulsing41),
count=Pulsing41(freqCutoff=13 minBlockSize=74 maxBlockSize=194), id=Pulsing41(freqCutoff=13
minBlockSize=74 maxBlockSize=194), termVector=PostingsFormat(name=Memory doPackFST= false)},
docValues:{}, sim=RandomSimilarityProvider(queryNorm=true,coord=crazy): {tvtest=DFR GL1, id=IB
LL-D2, termVector=IB LL-L3(800.0)}, locale=bg, timezone=Australia/Tasmania
   [junit4]   2> NOTE: Linux 3.8.0-39-generic i386/Oracle Corporation 1.8.0_05 (32-bit)/cpus=8,threads=1,free=61656720,total=219152384
   [junit4]   2> NOTE: All tests run in this JVM: [TestTransactionRollback, TestOmitTf,
TestByteSlices, TestLockFactory, TestFilterDirectory, TestBufferedChecksum, TestNRTReaderWithThreads,
TestCharsRef, TestStringHelper, TestDeletionPolicy, TestGroupFiltering, TestNoMergePolicy,
TestTermRangeFilter, TestSegmentTermDocs, TestBooleanQueryVisitSubscorers, TestCustomSearcherSort,
TestIndexWriterCommit, TestDocTermOrds, TestMockAnalyzer, TestUniqueTermCount, TestPayloads,
TestWAH8DocIdSet, TestIndexReaderClose, TestAutomatonQueryUnicode, TestSegmentReader, TestReusableStringReader,
Test2BPostings, TestComplexExplanations, TestLucene41StoredFieldsFormat, TestCharTermAttributeImpl,
TestIndexWriterOnJRECrash, TestTermVectorsWriter, TestLookaheadTokenFilter, TestStressIndexing2,
TestSpansAdvanced, Nested1, TestFilterIterator, TestPhrasePrefixQuery, TestMatchAllDocsQuery,
TestMultiPhraseQuery, TestIndexWriterForceMerge, TestRecyclingIntBlockAllocator, TestSearchForDuplicates,
Nested, Nested, Nested, Nested, Nested, Nested, Nested, Nested, Nested, Nested, Nested, Nested,
Nested, Nested, Nested, Nested, Nested, Nested, Nested, Nested, Nested, TestLucene40PostingsReader,
TestDocTermOrdsRewriteMethod, TestSpanFirstQuery, TestSloppyMath, TestShardSearching, TestRegexpQuery,
TestPayloadTermQuery, TestDirectory, TestIndexCommit, TestReuseDocsEnum, Test2BTerms, TestControlledRealTimeReopenThread,
TestRollingUpdates, TestIndexWriter, TestSameTokenSamePosition, TestBytesRefArray, Test2BPagedBytes,
TestUTF32ToUTF8, TestPersistentSnapshotDeletionPolicy, TestParallelReaderEmptyIndex, TestFixedBitSet,
TestMergedIterator, TestSearcherManager, TestExceedMaxTermLength, TestBytesStore, TestMultiTermConstantScore,
Test4GBStoredFields, TestIndexWriterMerging]
   [junit4] Completed on J0 in 21.03s, 6 tests, 2 errors <<< FAILURES!

[...truncated 111 lines...]
   [junit4] Suite: org.apache.lucene.index.TestIndexWriterReader
   [junit4]   2> NOTE: reproduce with: ant test  -Dtestcase=TestIndexWriterReader -Dtests.method=testForceMergeDeletes
-Dtests.seed=7908AE6AA1279581 -Dtests.multiplier=3 -Dtests.slow=true -Dtests.locale=ga -Dtests.timezone=Asia/Krasnoyarsk
-Dtests.file.encoding=UTF-8
   [junit4] ERROR   0.01s J0 | TestIndexWriterReader.testForceMergeDeletes <<<
   [junit4]    > Throwable #1: java.io.IOException: background merge hit exception: _0(5.0):c2/1:delGen=1
   [junit4]    > 	at __randomizedtesting.SeedInfo.seed([7908AE6AA1279581:4B78FECC9EAD15AE]:0)
   [junit4]    > 	at org.apache.lucene.index.IndexWriter.forceMergeDeletes(IndexWriter.java:1807)
   [junit4]    > 	at org.apache.lucene.index.IndexWriter.forceMergeDeletes(IndexWriter.java:1847)
   [junit4]    > 	at org.apache.lucene.index.TestIndexWriterReader.testForceMergeDeletes(TestIndexWriterReader.java:896)
   [junit4]    > 	at java.lang.Thread.run(Thread.java:745)
   [junit4]   2> NOTE: leaving temporary files on disk at: /mnt/ssd/jenkins/workspace/Lucene-Solr-trunk-Linux/lucene/build/core/test/J0/./lucene.index.TestIndexWriterReader-7908AE6AA1279581-001
   [junit4]   2> NOTE: test params are: codec=Lucene42, sim=RandomSimilarityProvider(queryNorm=true,coord=no):
{field1=DFR I(n)Z(0.3), indexname=IB LL-L3(800.0), field=DFR I(ne)L1, foo=DFR GL3(800.0),
field3=DFR I(F)1, field2=DFR I(F)LZ(0.3), field5=DFR I(n)BZ(0.3), field4=DFR I(n)L2}, locale=ga,
timezone=Asia/Krasnoyarsk
   [junit4]   2> NOTE: Linux 3.8.0-39-generic i386/Oracle Corporation 1.8.0_05 (32-bit)/cpus=8,threads=1,free=89409736,total=379846656
   [junit4]   2> NOTE: All tests run in this JVM: [TestTransactionRollback, TestOmitTf,
TestByteSlices, TestLockFactory, TestFilterDirectory, TestBufferedChecksum, TestNRTReaderWithThreads,
TestCharsRef, TestStringHelper, TestDeletionPolicy, TestGroupFiltering, TestNoMergePolicy,
TestTermRangeFilter, TestSegmentTermDocs, TestBooleanQueryVisitSubscorers, TestCustomSearcherSort,
TestIndexWriterCommit, TestDocTermOrds, TestMockAnalyzer, TestUniqueTermCount, TestPayloads,
TestWAH8DocIdSet, TestIndexReaderClose, TestAutomatonQueryUnicode, TestSegmentReader, TestReusableStringReader,
Test2BPostings, TestComplexExplanations, TestLucene41StoredFieldsFormat, TestCharTermAttributeImpl,
TestIndexWriterOnJRECrash, TestTermVectorsWriter, TestLookaheadTokenFilter, TestStressIndexing2,
TestSpansAdvanced, Nested1, TestFilterIterator, TestPhrasePrefixQuery, TestMatchAllDocsQuery,
TestMultiPhraseQuery, TestIndexWriterForceMerge, TestRecyclingIntBlockAllocator, TestSearchForDuplicates,
Nested, Nested, Nested, Nested, Nested, Nested, Nested, Nested, Nested, Nested, Nested, Nested,
Nested, Nested, Nested, Nested, Nested, Nested, Nested, Nested, Nested, TestLucene40PostingsReader,
TestDocTermOrdsRewriteMethod, TestSpanFirstQuery, TestSloppyMath, TestShardSearching, TestRegexpQuery,
TestPayloadTermQuery, TestDirectory, TestIndexCommit, TestReuseDocsEnum, Test2BTerms, TestControlledRealTimeReopenThread,
TestRollingUpdates, TestIndexWriter, TestSameTokenSamePosition, TestBytesRefArray, Test2BPagedBytes,
TestUTF32ToUTF8, TestPersistentSnapshotDeletionPolicy, TestParallelReaderEmptyIndex, TestFixedBitSet,
TestMergedIterator, TestSearcherManager, TestExceedMaxTermLength, TestBytesStore, TestMultiTermConstantScore,
Test4GBStoredFields, TestIndexWriterMerging, Test2BPostingsBytes, TestBytesRef, TestVersion,
TestCrash, TestExternalCodecs, TestNRTThreads, TestFileSwitchDirectory, TestReaderClosed,
TestDisjunctionMaxQuery, TestQueryBuilder, TestScorerPerf, TestSimpleExplanationsOfNonMatches,
TestStressAdvance, Test2BBinaryDocValues, TestBooleanMinShouldMatch, TestRollback, TestPositiveScoresOnlyCollector,
TestFlushByRamOrCountsPolicy, TestDeterminism, TestParallelTermEnum, TestFieldsReader, TestDeterminizeLexicon,
TestMergeSchedulerExternal, Test2BNumericDocValues, TestDirectoryReader, TestPostingsFormat,
TestPerFieldDocValuesFormat, TestDocValuesFormat, TestIndexWriterReader]
   [junit4] Completed on J0 in 14.73s, 22 tests, 1 error <<< FAILURES!

[...truncated 306 lines...]
   [junit4] Suite: org.apache.lucene.index.TestTieredMergePolicy
   [junit4]   2> NOTE: reproduce with: ant test  -Dtestcase=TestTieredMergePolicy -Dtests.method=testForceMergeDeletes
-Dtests.seed=7908AE6AA1279581 -Dtests.multiplier=3 -Dtests.slow=true -Dtests.locale=zh_CN
-Dtests.timezone=US/Pacific-New -Dtests.file.encoding=UTF-8
   [junit4] ERROR   0.03s J0 | TestTieredMergePolicy.testForceMergeDeletes <<<
   [junit4]    > Throwable #1: java.io.IOException: background merge hit exception: _0(5.0):c4
_1(5.0):c4 _2(5.0):c4 _3(5.0):c4 _4(5.0):c4 _5(5.0):c4 _6(5.0):c4 _7(5.0):c4 _8(5.0):c4 _9(5.0):c4
_a(5.0):c4 _b(5.0):c4 _c(5.0):c4 _d(5.0):c4 _e(5.0):c4 _f(5.0):c4 _g(5.0):c4 _h(5.0):c4 _i(5.0):c4
_j(5.0):c4
   [junit4]    > 	at __randomizedtesting.SeedInfo.seed([7908AE6AA1279581:4B78FECC9EAD15AE]:0)
   [junit4]    > 	at org.apache.lucene.index.IndexWriter.forceMergeDeletes(IndexWriter.java:1807)
   [junit4]    > 	at org.apache.lucene.index.IndexWriter.forceMergeDeletes(IndexWriter.java:1847)
   [junit4]    > 	at org.apache.lucene.index.TestTieredMergePolicy.testForceMergeDeletes(TestTieredMergePolicy.java:64)
   [junit4]    > 	at java.lang.Thread.run(Thread.java:745)
   [junit4]   2> NOTE: reproduce with: ant test  -Dtestcase=TestTieredMergePolicy -Dtests.method=testForceMergeDeletesMaxSegSize
-Dtests.seed=7908AE6AA1279581 -Dtests.multiplier=3 -Dtests.slow=true -Dtests.locale=zh_CN
-Dtests.timezone=US/Pacific-New -Dtests.file.encoding=UTF-8
   [junit4] ERROR   0.03s J0 | TestTieredMergePolicy.testForceMergeDeletesMaxSegSize <<<
   [junit4]    > Throwable #1: java.io.IOException: background merge hit exception: _5(5.0):C881
[maxNumSegments=1]
   [junit4]    > 	at __randomizedtesting.SeedInfo.seed([7908AE6AA1279581:1B0FC19AF82E203F]:0)
   [junit4]    > 	at org.apache.lucene.index.IndexWriter.forceMergeDeletes(IndexWriter.java:1807)
   [junit4]    > 	at org.apache.lucene.index.IndexWriter.forceMergeDeletes(IndexWriter.java:1847)
   [junit4]    > 	at org.apache.lucene.index.TestTieredMergePolicy.testForceMergeDeletesMaxSegSize(TestTieredMergePolicy.java:148)
   [junit4]    > 	at java.lang.Thread.run(Thread.java:745)
   [junit4]   2> NOTE: test params are: codec=HighCompressionCompressingStoredFields(storedFieldsFormat=CompressingStoredFieldsFormat(compressionMode=HIGH_COMPRESSION,
chunkSize=178), termVectorsFormat=CompressingTermVectorsFormat(compressionMode=HIGH_COMPRESSION,
chunkSize=178)), sim=RandomSimilarityProvider(queryNorm=false,coord=crazy): {content=DFR I(n)L2},
locale=zh_CN, timezone=US/Pacific-New
   [junit4]   2> NOTE: Linux 3.8.0-39-generic i386/Oracle Corporation 1.8.0_05 (32-bit)/cpus=8,threads=1,free=154933184,total=304873472
   [junit4]   2> NOTE: All tests run in this JVM: [TestTransactionRollback, TestOmitTf,
TestByteSlices, TestLockFactory, TestFilterDirectory, TestBufferedChecksum, TestNRTReaderWithThreads,
TestCharsRef, TestStringHelper, TestDeletionPolicy, TestGroupFiltering, TestNoMergePolicy,
TestTermRangeFilter, TestSegmentTermDocs, TestBooleanQueryVisitSubscorers, TestCustomSearcherSort,
TestIndexWriterCommit, TestDocTermOrds, TestMockAnalyzer, TestUniqueTermCount, TestPayloads,
TestWAH8DocIdSet, TestIndexReaderClose, TestAutomatonQueryUnicode, TestSegmentReader, TestReusableStringReader,
Test2BPostings, TestComplexExplanations, TestLucene41StoredFieldsFormat, TestCharTermAttributeImpl,
TestIndexWriterOnJRECrash, TestTermVectorsWriter, TestLookaheadTokenFilter, TestStressIndexing2,
TestSpansAdvanced, Nested1, TestFilterIterator, TestPhrasePrefixQuery, TestMatchAllDocsQuery,
TestMultiPhraseQuery, TestIndexWriterForceMerge, TestRecyclingIntBlockAllocator, TestSearchForDuplicates,
Nested, Nested, Nested, Nested, Nested, Nested, Nested, Nested, Nested, Nested, Nested, Nested,
Nested, Nested, Nested, Nested, Nested, Nested, Nested, Nested, Nested, TestLucene40PostingsReader,
TestDocTermOrdsRewriteMethod, TestSpanFirstQuery, TestSloppyMath, TestShardSearching, TestRegexpQuery,
TestPayloadTermQuery, TestDirectory, TestIndexCommit, TestReuseDocsEnum, Test2BTerms, TestControlledRealTimeReopenThread,
TestRollingUpdates, TestIndexWriter, TestSameTokenSamePosition, TestBytesRefArray, Test2BPagedBytes,
TestUTF32ToUTF8, TestPersistentSnapshotDeletionPolicy, TestParallelReaderEmptyIndex, TestFixedBitSet,
TestMergedIterator, TestSearcherManager, TestExceedMaxTermLength, TestBytesStore, TestMultiTermConstantScore,
Test4GBStoredFields, TestIndexWriterMerging, Test2BPostingsBytes, TestBytesRef, TestVersion,
TestCrash, TestExternalCodecs, TestNRTThreads, TestFileSwitchDirectory, TestReaderClosed,
TestDisjunctionMaxQuery, TestQueryBuilder, TestScorerPerf, TestSimpleExplanationsOfNonMatches,
TestStressAdvance, Test2BBinaryDocValues, TestBooleanMinShouldMatch, TestRollback, TestPositiveScoresOnlyCollector,
TestFlushByRamOrCountsPolicy, TestDeterminism, TestParallelTermEnum, TestFieldsReader, TestDeterminizeLexicon,
TestMergeSchedulerExternal, Test2BNumericDocValues, TestDirectoryReader, TestPostingsFormat,
TestPerFieldDocValuesFormat, TestDocValuesFormat, TestIndexWriterReader, TestTermVectorsFormat,
TestCompressingTermVectorsFormat, TestLucene40TermVectorsFormat, TestNumericRangeQuery64,
TestLucene42DocValuesFormat, TestAddIndexes, TestIndexWriterExceptions, TestSearchAfter, TestNeverDelete,
TestCompoundFile, TestLongPostings, TestStressIndexing, TestMinimize, TestBlockPostingsFormat2,
TestTieredMergePolicy]
   [junit4] Completed on J0 in 5.69s, 6 tests, 2 errors <<< FAILURES!

[...truncated 542 lines...]
BUILD FAILED
/mnt/ssd/jenkins/workspace/Lucene-Solr-trunk-Linux/build.xml:467: The following error occurred
while executing this line:
/mnt/ssd/jenkins/workspace/Lucene-Solr-trunk-Linux/build.xml:447: The following error occurred
while executing this line:
/mnt/ssd/jenkins/workspace/Lucene-Solr-trunk-Linux/build.xml:45: The following error occurred
while executing this line:
/mnt/ssd/jenkins/workspace/Lucene-Solr-trunk-Linux/extra-targets.xml:37: The following error
occurred while executing this line:
/mnt/ssd/jenkins/workspace/Lucene-Solr-trunk-Linux/lucene/build.xml:49: The following error
occurred while executing this line:
/mnt/ssd/jenkins/workspace/Lucene-Solr-trunk-Linux/lucene/common-build.xml:1296: The following
error occurred while executing this line:
/mnt/ssd/jenkins/workspace/Lucene-Solr-trunk-Linux/lucene/common-build.xml:920: There were
test failures: 396 suites, 3092 tests, 5 errors, 95 ignored (85 assumptions)

Total time: 21 minutes 4 seconds
Build step 'Invoke Ant' marked build as failure
Description set: Java: 32bit/jdk1.8.0_05 -client -XX:+UseParallelGC
Archiving artifacts
Recording test results
Email was triggered for: Failure
Sending email for trigger: Failure



Mime
View raw message