lucene-dev mailing list archives

Site index · List index
Message view « Date » · « Thread »
Top « Date » · « Thread »
From Policeman Jenkins Server <jenk...@thetaphi.de>
Subject [JENKINS] Lucene-Solr-4.x-Windows (32bit/jdk1.7.0_60-ea-b15) - Build # 3956 - Still Failing!
Date Fri, 16 May 2014 14:03:38 GMT
Build: http://jenkins.thetaphi.de/job/Lucene-Solr-4.x-Windows/3956/
Java: 32bit/jdk1.7.0_60-ea-b15 -server -XX:+UseConcMarkSweepGC

4 tests failed.
REGRESSION:  org.apache.lucene.analysis.core.TestBugInSomething.testUnicodeShinglesAndNgrams

Error Message:
Test abandoned because suite timeout was reached.

Stack Trace:
java.lang.Exception: Test abandoned because suite timeout was reached.
	at __randomizedtesting.SeedInfo.seed([910A4664FDCA418A]:0)


FAILED:  junit.framework.TestSuite.org.apache.lucene.analysis.core.TestBugInSomething

Error Message:
Suite timeout exceeded (>= 7200000 msec).

Stack Trace:
java.lang.Exception: Suite timeout exceeded (>= 7200000 msec).
	at __randomizedtesting.SeedInfo.seed([910A4664FDCA418A]:0)


FAILED:  junit.framework.TestSuite.org.apache.lucene.analysis.core.TestBugInSomething

Error Message:
Captured an uncaught exception in thread: Thread[id=1003, name=Thread-759, state=RUNNABLE,
group=TGRP-TestBugInSomething]

Stack Trace:
com.carrotsearch.randomizedtesting.UncaughtExceptionError: Captured an uncaught exception
in thread: Thread[id=1003, name=Thread-759, state=RUNNABLE, group=TGRP-TestBugInSomething]
Caused by: java.lang.AssertionError: actual mem: 36606768 byte, expected mem: 35383744 byte,
flush mem: 16053992, active mem: 20552776, pending DWPT: 1, flushing DWPT: 0, blocked DWPT:
0, peakDelta mem: 1829312 byte
	at __randomizedtesting.SeedInfo.seed([910A4664FDCA418A]:0)
	at org.apache.lucene.index.DocumentsWriterFlushControl.assertMemory(DocumentsWriterFlushControl.java:127)
	at org.apache.lucene.index.DocumentsWriterFlushControl.doAfterDocument(DocumentsWriterFlushControl.java:194)
	at org.apache.lucene.index.DocumentsWriter.updateDocument(DocumentsWriter.java:471)
	at org.apache.lucene.index.IndexWriter.updateDocument(IndexWriter.java:1541)
	at org.apache.lucene.index.IndexWriter.addDocument(IndexWriter.java:1211)
	at org.apache.lucene.index.RandomIndexWriter.addDocument(RandomIndexWriter.java:148)
	at org.apache.lucene.index.RandomIndexWriter.addDocument(RandomIndexWriter.java:109)
	at org.apache.lucene.analysis.BaseTokenStreamTestCase.checkRandomData(BaseTokenStreamTestCase.java:622)
	at org.apache.lucene.analysis.BaseTokenStreamTestCase.access$000(BaseTokenStreamTestCase.java:61)
	at org.apache.lucene.analysis.BaseTokenStreamTestCase$AnalysisThread.run(BaseTokenStreamTestCase.java:483)


FAILED:  junit.framework.TestSuite.org.apache.lucene.analysis.core.TestBugInSomething

Error Message:
Captured an uncaught exception in thread: Thread[id=1004, name=Thread-760, state=RUNNABLE,
group=TGRP-TestBugInSomething]

Stack Trace:
com.carrotsearch.randomizedtesting.UncaughtExceptionError: Captured an uncaught exception
in thread: Thread[id=1004, name=Thread-760, state=RUNNABLE, group=TGRP-TestBugInSomething]
Caused by: java.lang.AssertionError: actual mem: 38149188 byte, expected mem: 37213056 byte,
flush mem: 25479100, active mem: 12670088, pending DWPT: 0, flushing DWPT: 2, blocked DWPT:
0, peakDelta mem: 1829312 byte
	at __randomizedtesting.SeedInfo.seed([910A4664FDCA418A]:0)
	at org.apache.lucene.index.DocumentsWriterFlushControl.assertMemory(DocumentsWriterFlushControl.java:127)
	at org.apache.lucene.index.DocumentsWriterFlushControl.doAfterDocument(DocumentsWriterFlushControl.java:194)
	at org.apache.lucene.index.DocumentsWriter.updateDocuments(DocumentsWriter.java:433)
	at org.apache.lucene.index.IndexWriter.updateDocuments(IndexWriter.java:1310)
	at org.apache.lucene.index.IndexWriter.addDocuments(IndexWriter.java:1271)
	at org.apache.lucene.index.RandomIndexWriter.addDocument(RandomIndexWriter.java:119)
	at org.apache.lucene.index.RandomIndexWriter.addDocument(RandomIndexWriter.java:109)
	at org.apache.lucene.analysis.BaseTokenStreamTestCase.checkRandomData(BaseTokenStreamTestCase.java:622)
	at org.apache.lucene.analysis.BaseTokenStreamTestCase.access$000(BaseTokenStreamTestCase.java:61)
	at org.apache.lucene.analysis.BaseTokenStreamTestCase$AnalysisThread.run(BaseTokenStreamTestCase.java:483)




Build Log:
[...truncated 5629 lines...]
   [junit4] Suite: org.apache.lucene.analysis.core.TestBugInSomething
   [junit4]   2> TEST FAIL: useCharFilter=true text='\u4e5e  pqyxwp i. '
   [junit4]   2> Mai 16, 2014 5:08:10 AM com.carrotsearch.randomizedtesting.RandomizedRunner$QueueUncaughtExceptionsHandler
uncaughtException
   [junit4]   2> ADVERTÊNCIA: Uncaught exception in thread: Thread[Thread-759,5,TGRP-TestBugInSomething]
   [junit4]   2> java.lang.AssertionError: actual mem: 36606768 byte, expected mem: 35383744
byte, flush mem: 16053992, active mem: 20552776, pending DWPT: 1, flushing DWPT: 0, blocked
DWPT: 0, peakDelta mem: 1829312 byte
   [junit4]   2> 	at __randomizedtesting.SeedInfo.seed([910A4664FDCA418A]:0)
   [junit4]   2> 	at org.apache.lucene.index.DocumentsWriterFlushControl.assertMemory(DocumentsWriterFlushControl.java:127)
   [junit4]   2> 	at org.apache.lucene.index.DocumentsWriterFlushControl.doAfterDocument(DocumentsWriterFlushControl.java:194)
   [junit4]   2> 	at org.apache.lucene.index.DocumentsWriter.updateDocument(DocumentsWriter.java:471)
   [junit4]   2> 	at org.apache.lucene.index.IndexWriter.updateDocument(IndexWriter.java:1541)
   [junit4]   2> 	at org.apache.lucene.index.IndexWriter.addDocument(IndexWriter.java:1211)
   [junit4]   2> 	at org.apache.lucene.index.RandomIndexWriter.addDocument(RandomIndexWriter.java:148)
   [junit4]   2> 	at org.apache.lucene.index.RandomIndexWriter.addDocument(RandomIndexWriter.java:109)
   [junit4]   2> 	at org.apache.lucene.analysis.BaseTokenStreamTestCase.checkRandomData(BaseTokenStreamTestCase.java:622)
   [junit4]   2> 	at org.apache.lucene.analysis.BaseTokenStreamTestCase.access$000(BaseTokenStreamTestCase.java:61)
   [junit4]   2> 	at org.apache.lucene.analysis.BaseTokenStreamTestCase$AnalysisThread.run(BaseTokenStreamTestCase.java:483)
   [junit4]   2> 
   [junit4]   2> TEST FAIL: useCharFilter=true text='lisi oltava saatavil'
   [junit4]   2> Mai 16, 2014 5:08:10 AM com.carrotsearch.randomizedtesting.RandomizedRunner$QueueUncaughtExceptionsHandler
uncaughtException
   [junit4]   2> ADVERTÊNCIA: Uncaught exception in thread: Thread[Thread-760,5,TGRP-TestBugInSomething]
   [junit4]   2> java.lang.AssertionError: actual mem: 38149188 byte, expected mem: 37213056
byte, flush mem: 25479100, active mem: 12670088, pending DWPT: 0, flushing DWPT: 2, blocked
DWPT: 0, peakDelta mem: 1829312 byte
   [junit4]   2> 	at __randomizedtesting.SeedInfo.seed([910A4664FDCA418A]:0)
   [junit4]   2> 	at org.apache.lucene.index.DocumentsWriterFlushControl.assertMemory(DocumentsWriterFlushControl.java:127)
   [junit4]   2> 	at org.apache.lucene.index.DocumentsWriterFlushControl.doAfterDocument(DocumentsWriterFlushControl.java:194)
   [junit4]   2> 	at org.apache.lucene.index.DocumentsWriter.updateDocuments(DocumentsWriter.java:433)
   [junit4]   2> 	at org.apache.lucene.index.IndexWriter.updateDocuments(IndexWriter.java:1310)
   [junit4]   2> 	at org.apache.lucene.index.IndexWriter.addDocuments(IndexWriter.java:1271)
   [junit4]   2> 	at org.apache.lucene.index.RandomIndexWriter.addDocument(RandomIndexWriter.java:119)
   [junit4]   2> 	at org.apache.lucene.index.RandomIndexWriter.addDocument(RandomIndexWriter.java:109)
   [junit4]   2> 	at org.apache.lucene.analysis.BaseTokenStreamTestCase.checkRandomData(BaseTokenStreamTestCase.java:622)
   [junit4]   2> 	at org.apache.lucene.analysis.BaseTokenStreamTestCase.access$000(BaseTokenStreamTestCase.java:61)
   [junit4]   2> 	at org.apache.lucene.analysis.BaseTokenStreamTestCase$AnalysisThread.run(BaseTokenStreamTestCase.java:483)
   [junit4]   2> 
   [junit4]   2> Mai 16, 2014 7:01:09 AM com.carrotsearch.randomizedtesting.ThreadLeakControl$2
evaluate
   [junit4]   2> ADVERTÊNCIA: Suite execution timed out: org.apache.lucene.analysis.core.TestBugInSomething
   [junit4]   2> ==== jstack at approximately timeout time ====
   [junit4]   2> "Thread-758" ID=1002 WAITING on org.apache.lucene.index.DocumentsWriterStallControl@66f969
   [junit4]   2> 	at java.lang.Object.wait(Native Method)
   [junit4]   2> 	- waiting on org.apache.lucene.index.DocumentsWriterStallControl@66f969
   [junit4]   2> 	at java.lang.Object.wait(Object.java:503)
   [junit4]   2> 	at org.apache.lucene.index.DocumentsWriterStallControl.waitIfStalled(DocumentsWriterStallControl.java:74)
   [junit4]   2> 	at org.apache.lucene.index.DocumentsWriterFlushControl.waitIfStalled(DocumentsWriterFlushControl.java:685)
   [junit4]   2> 	at org.apache.lucene.index.DocumentsWriter.preUpdate(DocumentsWriter.java:371)
   [junit4]   2> 	at org.apache.lucene.index.DocumentsWriter.updateDocument(DocumentsWriter.java:444)
   [junit4]   2> 	at org.apache.lucene.index.IndexWriter.updateDocument(IndexWriter.java:1541)
   [junit4]   2> 	at org.apache.lucene.index.IndexWriter.addDocument(IndexWriter.java:1211)
   [junit4]   2> 	at org.apache.lucene.index.RandomIndexWriter.addDocument(RandomIndexWriter.java:148)
   [junit4]   2> 	at org.apache.lucene.index.RandomIndexWriter.addDocument(RandomIndexWriter.java:109)
   [junit4]   2> 	at org.apache.lucene.analysis.BaseTokenStreamTestCase.checkRandomData(BaseTokenStreamTestCase.java:622)
   [junit4]   2> 	at org.apache.lucene.analysis.BaseTokenStreamTestCase.access$000(BaseTokenStreamTestCase.java:61)
   [junit4]   2> 	at org.apache.lucene.analysis.BaseTokenStreamTestCase$AnalysisThread.run(BaseTokenStreamTestCase.java:483)
   [junit4]   2> 
   [junit4]   2> "Thread-757" ID=1001 WAITING on org.apache.lucene.index.DocumentsWriterStallControl@66f969
   [junit4]   2> 	at java.lang.Object.wait(Native Method)
   [junit4]   2> 	- waiting on org.apache.lucene.index.DocumentsWriterStallControl@66f969
   [junit4]   2> 	at java.lang.Object.wait(Object.java:503)
   [junit4]   2> 	at org.apache.lucene.index.DocumentsWriterStallControl.waitIfStalled(DocumentsWriterStallControl.java:74)
   [junit4]   2> 	at org.apache.lucene.index.DocumentsWriterFlushControl.waitIfStalled(DocumentsWriterFlushControl.java:685)
   [junit4]   2> 	at org.apache.lucene.index.DocumentsWriter.preUpdate(DocumentsWriter.java:371)
   [junit4]   2> 	at org.apache.lucene.index.DocumentsWriter.updateDocument(DocumentsWriter.java:444)
   [junit4]   2> 	at org.apache.lucene.index.IndexWriter.updateDocument(IndexWriter.java:1541)
   [junit4]   2> 	at org.apache.lucene.index.IndexWriter.addDocument(IndexWriter.java:1211)
   [junit4]   2> 	at org.apache.lucene.index.RandomIndexWriter.addDocument(RandomIndexWriter.java:148)
   [junit4]   2> 	at org.apache.lucene.index.RandomIndexWriter.addDocument(RandomIndexWriter.java:109)
   [junit4]   2> 	at org.apache.lucene.analysis.BaseTokenStreamTestCase.checkRandomData(BaseTokenStreamTestCase.java:622)
   [junit4]   2> 	at org.apache.lucene.analysis.BaseTokenStreamTestCase.access$000(BaseTokenStreamTestCase.java:61)
   [junit4]   2> 	at org.apache.lucene.analysis.BaseTokenStreamTestCase$AnalysisThread.run(BaseTokenStreamTestCase.java:483)
   [junit4]   2> 
   [junit4]   2> "TEST-TestBugInSomething.testUnicodeShinglesAndNgrams-seed#[910A4664FDCA418A]"
ID=998 WAITING on org.apache.lucene.analysis.BaseTokenStreamTestCase$AnalysisThread@440fd3
   [junit4]   2> 	at java.lang.Object.wait(Native Method)
   [junit4]   2> 	- waiting on org.apache.lucene.analysis.BaseTokenStreamTestCase$AnalysisThread@440fd3
   [junit4]   2> 	at java.lang.Thread.join(Thread.java:1281)
   [junit4]   2> 	at java.lang.Thread.join(Thread.java:1355)
   [junit4]   2> 	at org.apache.lucene.analysis.BaseTokenStreamTestCase.checkRandomData(BaseTokenStreamTestCase.java:528)
   [junit4]   2> 	at org.apache.lucene.analysis.BaseTokenStreamTestCase.checkRandomData(BaseTokenStreamTestCase.java:432)
   [junit4]   2> 	at org.apache.lucene.analysis.core.TestBugInSomething.testUnicodeShinglesAndNgrams(TestBugInSomething.java:261)
   [junit4]   2> 	at sun.reflect.NativeMethodAccessorImpl.invoke0(Native Method)
   [junit4]   2> 	at sun.reflect.NativeMethodAccessorImpl.invoke(NativeMethodAccessorImpl.java:57)
   [junit4]   2> 	at sun.reflect.DelegatingMethodAccessorImpl.invoke(DelegatingMethodAccessorImpl.java:43)
   [junit4]   2> 	at java.lang.reflect.Method.invoke(Method.java:606)
   [junit4]   2> 	at com.carrotsearch.randomizedtesting.RandomizedRunner.invoke(RandomizedRunner.java:1618)
   [junit4]   2> 	at com.carrotsearch.randomizedtesting.RandomizedRunner$6.evaluate(RandomizedRunner.java:827)
   [junit4]   2> 	at com.carrotsearch.randomizedtesting.RandomizedRunner$7.evaluate(RandomizedRunner.java:863)
   [junit4]   2> 	at com.carrotsearch.randomizedtesting.RandomizedRunner$8.evaluate(RandomizedRunner.java:877)
   [junit4]   2> 	at org.apache.lucene.util.TestRuleSetupTeardownChained$1.evaluate(TestRuleSetupTeardownChained.java:50)
   [junit4]   2> 	at org.apache.lucene.util.TestRuleFieldCacheSanity$1.evaluate(TestRuleFieldCacheSanity.java:51)
   [junit4]   2> 	at org.apache.lucene.util.AbstractBeforeAfterRule$1.evaluate(AbstractBeforeAfterRule.java:46)
   [junit4]   2> 	at com.carrotsearch.randomizedtesting.rules.SystemPropertiesInvariantRule$1.evaluate(SystemPropertiesInvariantRule.java:55)
   [junit4]   2> 	at org.apache.lucene.util.TestRuleThreadAndTestName$1.evaluate(TestRuleThreadAndTestName.java:49)
   [junit4]   2> 	at org.apache.lucene.util.TestRuleIgnoreAfterMaxFailures$1.evaluate(TestRuleIgnoreAfterMaxFailures.java:65)
   [junit4]   2> 	at org.apache.lucene.util.TestRuleMarkFailure$1.evaluate(TestRuleMarkFailure.java:48)
   [junit4]   2> 	at com.carrotsearch.randomizedtesting.rules.StatementAdapter.evaluate(StatementAdapter.java:36)
   [junit4]   2> 	at com.carrotsearch.randomizedtesting.ThreadLeakControl$StatementRunner.run(ThreadLeakControl.java:360)
   [junit4]   2> 	at com.carrotsearch.randomizedtesting.ThreadLeakControl.forkTimeoutingTask(ThreadLeakControl.java:793)
   [junit4]   2> 	at com.carrotsearch.randomizedtesting.ThreadLeakControl$3.evaluate(ThreadLeakControl.java:453)
   [junit4]   2> 	at com.carrotsearch.randomizedtesting.RandomizedRunner.runSingleTest(RandomizedRunner.java:836)
   [junit4]   2> 	at com.carrotsearch.randomizedtesting.RandomizedRunner$3.evaluate(RandomizedRunner.java:738)
   [junit4]   2> 	at com.carrotsearch.randomizedtesting.RandomizedRunner$4.evaluate(RandomizedRunner.java:772)
   [junit4]   2> 	at com.carrotsearch.randomizedtesting.RandomizedRunner$5.evaluate(RandomizedRunner.java:783)
   [junit4]   2> 	at org.apache.lucene.util.AbstractBeforeAfterRule$1.evaluate(AbstractBeforeAfterRule.java:46)
   [junit4]   2> 	at org.apache.lucene.util.TestRuleStoreClassName$1.evaluate(TestRuleStoreClassName.java:42)
   [junit4]   2> 	at com.carrotsearch.randomizedtesting.rules.SystemPropertiesInvariantRule$1.evaluate(SystemPropertiesInvariantRule.java:55)
   [junit4]   2> 	at com.carrotsearch.randomizedtesting.rules.NoShadowingOrOverridesOnMethodsRule$1.evaluate(NoShadowingOrOverridesOnMethodsRule.java:39)
   [junit4]   2> 	at com.carrotsearch.randomizedtesting.rules.NoShadowingOrOverridesOnMethodsRule$1.evaluate(NoShadowingOrOverridesOnMethodsRule.java:39)
   [junit4]   2> 	at com.carrotsearch.randomizedtesting.rules.StatementAdapter.evaluate(StatementAdapter.java:36)
   [junit4]   2> 	at com.carrotsearch.randomizedtesting.rules.StatementAdapter.evaluate(StatementAdapter.java:36)
   [junit4]   2> 	at com.carrotsearch.randomizedtesting.rules.StatementAdapter.evaluate(StatementAdapter.java:36)
   [junit4]   2> 	at org.apache.lucene.util.TestRuleAssertionsRequired$1.evaluate(TestRuleAssertionsRequired.java:43)
   [junit4]   2> 	at org.apache.lucene.util.TestRuleMarkFailure$1.evaluate(TestRuleMarkFailure.java:48)
   [junit4]   2> 	at org.apache.lucene.util.TestRuleIgnoreAfterMaxFailures$1.evaluate(TestRuleIgnoreAfterMaxFailures.java:65)
   [junit4]   2> 	at org.apache.lucene.util.TestRuleIgnoreTestSuites$1.evaluate(TestRuleIgnoreTestSuites.java:55)
   [junit4]   2> 	at com.carrotsearch.randomizedtesting.rules.StatementAdapter.evaluate(StatementAdapter.java:36)
   [junit4]   2> 	at com.carrotsearch.randomizedtesting.ThreadLeakControl$StatementRunner.run(ThreadLeakControl.java:360)
   [junit4]   2> 	at java.lang.Thread.run(Thread.java:745)
   [junit4]   2> 
   [junit4]   2> "SUITE-TestBugInSomething-seed#[910A4664FDCA418A]" ID=997 RUNNABLE
   [junit4]   2> 	at sun.management.ThreadImpl.dumpThreads0(Native Method)
   [junit4]   2> 	at sun.management.ThreadImpl.dumpAllThreads(ThreadImpl.java:446)
   [junit4]   2> 	at com.carrotsearch.randomizedtesting.ThreadLeakControl.formatThreadStacksFull(ThreadLeakControl.java:666)
   [junit4]   2> 	at com.carrotsearch.randomizedtesting.ThreadLeakControl.access$900(ThreadLeakControl.java:62)
   [junit4]   2> 	at com.carrotsearch.randomizedtesting.ThreadLeakControl$2.evaluate(ThreadLeakControl.java:407)
   [junit4]   2> 	- locked java.lang.Object@80723e
   [junit4]   2> 	at com.carrotsearch.randomizedtesting.RandomizedRunner.runSuite(RandomizedRunner.java:642)
   [junit4]   2> 	at com.carrotsearch.randomizedtesting.RandomizedRunner.access$200(RandomizedRunner.java:129)
   [junit4]   2> 	at com.carrotsearch.randomizedtesting.RandomizedRunner$1.run(RandomizedRunner.java:559)
   [junit4]   2> 
   [junit4]   2> "Attach Listener" ID=6 RUNNABLE
   [junit4]   2> 
   [junit4]   2> "Signal Dispatcher" ID=5 RUNNABLE
   [junit4]   2> 
   [junit4]   2> "Finalizer" ID=3 WAITING on java.lang.ref.ReferenceQueue$Lock@cc6cb5
   [junit4]   2> 	at java.lang.Object.wait(Native Method)
   [junit4]   2> 	- waiting on java.lang.ref.ReferenceQueue$Lock@cc6cb5
   [junit4]   2> 	at java.lang.ref.ReferenceQueue.remove(ReferenceQueue.java:135)
   [junit4]   2> 	at java.lang.ref.ReferenceQueue.remove(ReferenceQueue.java:151)
   [junit4]   2> 	at java.lang.ref.Finalizer$FinalizerThread.run(Finalizer.java:209)
   [junit4]   2> 
   [junit4]   2> "Reference Handler" ID=2 WAITING on java.lang.ref.Reference$Lock@f5098a
   [junit4]   2> 	at java.lang.Object.wait(Native Method)
   [junit4]   2> 	- waiting on java.lang.ref.Reference$Lock@f5098a
   [junit4]   2> 	at java.lang.Object.wait(Object.java:503)
   [junit4]   2> 	at java.lang.ref.Reference$ReferenceHandler.run(Reference.java:133)
   [junit4]   2> 
   [junit4]   2> "main" ID=1 WAITING on com.carrotsearch.randomizedtesting.RandomizedRunner$1@1e668ab
   [junit4]   2> 	at java.lang.Object.wait(Native Method)
   [junit4]   2> 	- waiting on com.carrotsearch.randomizedtesting.RandomizedRunner$1@1e668ab
   [junit4]   2> 	at java.lang.Thread.join(Thread.java:1281)
   [junit4]   2> 	at java.lang.Thread.join(Thread.java:1355)
   [junit4]   2> 	at com.carrotsearch.randomizedtesting.RandomizedRunner.runSuite(RandomizedRunner.java:569)
   [junit4]   2> 	at com.carrotsearch.randomizedtesting.RandomizedRunner.run(RandomizedRunner.java:435)
   [junit4]   2> 	at com.carrotsearch.ant.tasks.junit4.slave.SlaveMain.execute(SlaveMain.java:180)
   [junit4]   2> 	at com.carrotsearch.ant.tasks.junit4.slave.SlaveMain.main(SlaveMain.java:276)
   [junit4]   2> 	at com.carrotsearch.ant.tasks.junit4.slave.SlaveMainSafe.main(SlaveMainSafe.java:12)
   [junit4]   2> 
   [junit4]   2> ^^==============================================
   [junit4]   2> 
   [junit4]   2> NOTE: reproduce with: ant test  -Dtestcase=TestBugInSomething -Dtests.method=testUnicodeShinglesAndNgrams
-Dtests.seed=910A4664FDCA418A -Dtests.slow=true -Dtests.locale=pt_BR -Dtests.timezone=America/Dawson
-Dtests.file.encoding=ISO-8859-1
   [junit4] ERROR   7248s | TestBugInSomething.testUnicodeShinglesAndNgrams <<<
   [junit4]    > Throwable #1: java.lang.Exception: Test abandoned because suite timeout
was reached.
   [junit4]    > 	at __randomizedtesting.SeedInfo.seed([910A4664FDCA418A]:0)
   [junit4]   2> Mai 16, 2014 7:01:09 AM com.carrotsearch.randomizedtesting.ThreadLeakControl
checkThreadLeaks
   [junit4]   2> ADVERTÊNCIA: Will linger awaiting termination of 3 leaked thread(s).
   [junit4]   2> Mai 16, 2014 7:01:30 AM com.carrotsearch.randomizedtesting.ThreadLeakControl
checkThreadLeaks
   [junit4]   2> GRAVE: 3 threads leaked from SUITE scope at org.apache.lucene.analysis.core.TestBugInSomething:

   [junit4]   2>    1) Thread[id=998, name=TEST-TestBugInSomething.testUnicodeShinglesAndNgrams-seed#[910A4664FDCA418A],
state=WAITING, group=TGRP-TestBugInSomething]
   [junit4]   2>         at java.lang.Object.wait(Native Method)
   [junit4]   2>         at java.lang.Thread.join(Thread.java:1281)
   [junit4]   2>         at java.lang.Thread.join(Thread.java:1355)
   [junit4]   2>         at org.apache.lucene.analysis.BaseTokenStreamTestCase.checkRandomData(BaseTokenStreamTestCase.java:528)
   [junit4]   2>         at org.apache.lucene.analysis.BaseTokenStreamTestCase.checkRandomData(BaseTokenStreamTestCase.java:432)
   [junit4]   2>         at org.apache.lucene.analysis.core.TestBugInSomething.testUnicodeShinglesAndNgrams(TestBugInSomething.java:261)
   [junit4]   2>         at sun.reflect.NativeMethodAccessorImpl.invoke0(Native Method)
   [junit4]   2>         at sun.reflect.NativeMethodAccessorImpl.invoke(NativeMethodAccessorImpl.java:57)
   [junit4]   2>         at sun.reflect.DelegatingMethodAccessorImpl.invoke(DelegatingMethodAccessorImpl.java:43)
   [junit4]   2>         at java.lang.reflect.Method.invoke(Method.java:606)
   [junit4]   2>         at com.carrotsearch.randomizedtesting.RandomizedRunner.invoke(RandomizedRunner.java:1618)
   [junit4]   2>         at com.carrotsearch.randomizedtesting.RandomizedRunner$6.evaluate(RandomizedRunner.java:827)
   [junit4]   2>         at com.carrotsearch.randomizedtesting.RandomizedRunner$7.evaluate(RandomizedRunner.java:863)
   [junit4]   2>         at com.carrotsearch.randomizedtesting.RandomizedRunner$8.evaluate(RandomizedRunner.java:877)
   [junit4]   2>         at org.apache.lucene.util.TestRuleSetupTeardownChained$1.evaluate(TestRuleSetupTeardownChained.java:50)
   [junit4]   2>         at org.apache.lucene.util.TestRuleFieldCacheSanity$1.evaluate(TestRuleFieldCacheSanity.java:51)
   [junit4]   2>         at org.apache.lucene.util.AbstractBeforeAfterRule$1.evaluate(AbstractBeforeAfterRule.java:46)
   [junit4]   2>         at com.carrotsearch.randomizedtesting.rules.SystemPropertiesInvariantRule$1.evaluate(SystemPropertiesInvariantRule.java:55)
   [junit4]   2>         at org.apache.lucene.util.TestRuleThreadAndTestName$1.evaluate(TestRuleThreadAndTestName.java:49)
   [junit4]   2>         at org.apache.lucene.util.TestRuleIgnoreAfterMaxFailures$1.evaluate(TestRuleIgnoreAfterMaxFailures.java:65)
   [junit4]   2>         at org.apache.lucene.util.TestRuleMarkFailure$1.evaluate(TestRuleMarkFailure.java:48)
   [junit4]   2>         at com.carrotsearch.randomizedtesting.rules.StatementAdapter.evaluate(StatementAdapter.java:36)
   [junit4]   2>         at com.carrotsearch.randomizedtesting.ThreadLeakControl$StatementRunner.run(ThreadLeakControl.java:360)
   [junit4]   2>         at com.carrotsearch.randomizedtesting.ThreadLeakControl.forkTimeoutingTask(ThreadLeakControl.java:793)
   [junit4]   2>         at com.carrotsearch.randomizedtesting.ThreadLeakControl$3.evaluate(ThreadLeakControl.java:453)
   [junit4]   2>         at com.carrotsearch.randomizedtesting.RandomizedRunner.runSingleTest(RandomizedRunner.java:836)
   [junit4]   2>         at com.carrotsearch.randomizedtesting.RandomizedRunner$3.evaluate(RandomizedRunner.java:738)
   [junit4]   2>         at com.carrotsearch.randomizedtesting.RandomizedRunner$4.evaluate(RandomizedRunner.java:772)
   [junit4]   2>         at com.carrotsearch.randomizedtesting.RandomizedRunner$5.evaluate(RandomizedRunner.java:783)
   [junit4]   2>         at org.apache.lucene.util.AbstractBeforeAfterRule$1.evaluate(AbstractBeforeAfterRule.java:46)
   [junit4]   2>         at org.apache.lucene.util.TestRuleStoreClassName$1.evaluate(TestRuleStoreClassName.java:42)
   [junit4]   2>         at com.carrotsearch.randomizedtesting.rules.SystemPropertiesInvariantRule$1.evaluate(SystemPropertiesInvariantRule.java:55)
   [junit4]   2>         at com.carrotsearch.randomizedtesting.rules.NoShadowingOrOverridesOnMethodsRule$1.evaluate(NoShadowingOrOverridesOnMethodsRule.java:39)
   [junit4]   2>         at com.carrotsearch.randomizedtesting.rules.NoShadowingOrOverridesOnMethodsRule$1.evaluate(NoShadowingOrOverridesOnMethodsRule.java:39)
   [junit4]   2>         at com.carrotsearch.randomizedtesting.rules.StatementAdapter.evaluate(StatementAdapter.java:36)
   [junit4]   2>         at com.carrotsearch.randomizedtesting.rules.StatementAdapter.evaluate(StatementAdapter.java:36)
   [junit4]   2>         at com.carrotsearch.randomizedtesting.rules.StatementAdapter.evaluate(StatementAdapter.java:36)
   [junit4]   2>         at org.apache.lucene.util.TestRuleAssertionsRequired$1.evaluate(TestRuleAssertionsRequired.java:43)
   [junit4]   2>         at org.apache.lucene.util.TestRuleMarkFailure$1.evaluate(TestRuleMarkFailure.java:48)
   [junit4]   2>         at org.apache.lucene.util.TestRuleIgnoreAfterMaxFailures$1.evaluate(TestRuleIgnoreAfterMaxFailures.java:65)
   [junit4]   2>         at org.apache.lucene.util.TestRuleIgnoreTestSuites$1.evaluate(TestRuleIgnoreTestSuites.java:55)
   [junit4]   2>         at com.carrotsearch.randomizedtesting.rules.StatementAdapter.evaluate(StatementAdapter.java:36)
   [junit4]   2>         at com.carrotsearch.randomizedtesting.ThreadLeakControl$StatementRunner.run(ThreadLeakControl.java:360)
   [junit4]   2>         at java.lang.Thread.run(Thread.java:745)
   [junit4]   2>    2) Thread[id=1001, name=Thread-757, state=WAITING, group=TGRP-TestBugInSomething]
   [junit4]   2>         at java.lang.Object.wait(Native Method)
   [junit4]   2>         at java.lang.Object.wait(Object.java:503)
   [junit4]   2>         at org.apache.lucene.index.DocumentsWriterStallControl.waitIfStalled(DocumentsWriterStallControl.java:74)
   [junit4]   2>         at org.apache.lucene.index.DocumentsWriterFlushControl.waitIfStalled(DocumentsWriterFlushControl.java:685)
   [junit4]   2>         at org.apache.lucene.index.DocumentsWriter.preUpdate(DocumentsWriter.java:371)
   [junit4]   2>         at org.apache.lucene.index.DocumentsWriter.updateDocument(DocumentsWriter.java:444)
   [junit4]   2>         at org.apache.lucene.index.IndexWriter.updateDocument(IndexWriter.java:1541)
   [junit4]   2>         at org.apache.lucene.index.IndexWriter.addDocument(IndexWriter.java:1211)
   [junit4]   2>         at org.apache.lucene.index.RandomIndexWriter.addDocument(RandomIndexWriter.java:148)
   [junit4]   2>         at org.apache.lucene.index.RandomIndexWriter.addDocument(RandomIndexWriter.java:109)
   [junit4]   2>         at org.apache.lucene.analysis.BaseTokenStreamTestCase.checkRandomData(BaseTokenStreamTestCase.java:622)
   [junit4]   2>         at org.apache.lucene.analysis.BaseTokenStreamTestCase.access$000(BaseTokenStreamTestCase.java:61)
   [junit4]   2>         at org.apache.lucene.analysis.BaseTokenStreamTestCase$AnalysisThread.run(BaseTokenStreamTestCase.java:483)
   [junit4]   2>    3) Thread[id=1002, name=Thread-758, state=WAITING, group=TGRP-TestBugInSomething]
   [junit4]   2>         at java.lang.Object.wait(Native Method)
   [junit4]   2>         at java.lang.Object.wait(Object.java:503)
   [junit4]   2>         at org.apache.lucene.index.DocumentsWriterStallControl.waitIfStalled(DocumentsWriterStallControl.java:74)
   [junit4]   2>         at org.apache.lucene.index.DocumentsWriterFlushControl.waitIfStalled(DocumentsWriterFlushControl.java:685)
   [junit4]   2>         at org.apache.lucene.index.DocumentsWriter.preUpdate(DocumentsWriter.java:371)
   [junit4]   2>         at org.apache.lucene.index.DocumentsWriter.updateDocument(DocumentsWriter.java:444)
   [junit4]   2>         at org.apache.lucene.index.IndexWriter.updateDocument(IndexWriter.java:1541)
   [junit4]   2>         at org.apache.lucene.index.IndexWriter.addDocument(IndexWriter.java:1211)
   [junit4]   2>         at org.apache.lucene.index.RandomIndexWriter.addDocument(RandomIndexWriter.java:148)
   [junit4]   2>         at org.apache.lucene.index.RandomIndexWriter.addDocument(RandomIndexWriter.java:109)
   [junit4]   2>         at org.apache.lucene.analysis.BaseTokenStreamTestCase.checkRandomData(BaseTokenStreamTestCase.java:622)
   [junit4]   2>         at org.apache.lucene.analysis.BaseTokenStreamTestCase.access$000(BaseTokenStreamTestCase.java:61)
   [junit4]   2>         at org.apache.lucene.analysis.BaseTokenStreamTestCase$AnalysisThread.run(BaseTokenStreamTestCase.java:483)
   [junit4]   2> Mai 16, 2014 7:01:30 AM com.carrotsearch.randomizedtesting.ThreadLeakControl
tryToInterruptAll
   [junit4]   2> INFORMAÇÕES: Starting to interrupt leaked threads:
   [junit4]   2>    1) Thread[id=998, name=TEST-TestBugInSomething.testUnicodeShinglesAndNgrams-seed#[910A4664FDCA418A],
state=WAITING, group=TGRP-TestBugInSomething]
   [junit4]   2>    2) Thread[id=1001, name=Thread-757, state=WAITING, group=TGRP-TestBugInSomething]
   [junit4]   2>    3) Thread[id=1002, name=Thread-758, state=WAITING, group=TGRP-TestBugInSomething]
   [junit4]   2> TEST FAIL: useCharFilter=true text='fflurkjubt \ufb48\ufb30\ufb18\ufb43\ufb01\ufb0b'
   [junit4]   2> TEST FAIL: useCharFilter=true text='\ua8e3\ua8f1\ua8ec\ua8fb\ua8ef\ua8e7\ua8e0\ua8f1\ua8e7
yyxlr'
   [junit4]   2> NOTE: leaving temporary files on disk at: C:\Users\JenkinsSlave\workspace\Lucene-Solr-4.x-Windows\lucene\build\analysis\common\test\J0\.\lucene.analysis.core.TestBugInSomething-910A4664FDCA418A-001
   [junit4]   2> May 16, 2014 2:01:32 PM com.carrotsearch.randomizedtesting.ThreadLeakControl
tryToInterruptAll
   [junit4]   2> INFO: All leaked threads terminated.
   [junit4]   2> NOTE: test params are: codec=Lucene46: {dummy=Pulsing41(freqCutoff=5 minBlockSize=4
maxBlockSize=66)}, docValues:{}, sim=DefaultSimilarity, locale=pt_BR, timezone=America/Dawson
   [junit4]   2> NOTE: Windows 7 6.1 x86/Oracle Corporation 1.7.0_60-ea (32-bit)/cpus=2,threads=1,free=106465472,total=402558976
   [junit4]   2> NOTE: All tests run in this JVM: [TestNGramFilters, TestPortugueseLightStemFilter,
TestStandardAnalyzer, TestSnowballPorterFilterFactory, TestRussianFilters, TestTwoFold, TestDictionaryCompoundWordTokenFilterFactory,
TestConv, TestThaiAnalyzer, TestHindiStemmer, TestHindiAnalyzer, TestRollingCharBuffer, TestGermanLightStemFilter,
TestUAX29URLEmailTokenizer, TestBrazilianStemmer, TestPorterStemFilterFactory, TestCzechStemmer,
TestRussianLightStemFilterFactory, TestPatternCaptureGroupTokenFilter, TestLimitTokenCountFilter,
TestCollationKeyAnalyzer, TestStemmerOverrideFilter, TestGreekStemmer, TestGermanMinimalStemFilterFactory,
TestSpanishAnalyzer, TestHungarianAnalyzer, TestCapitalizationFilterFactory, TestArmenianAnalyzer,
TestFinnishLightStemFilter, TestPerFieldAnalyzerWrapper, TestBulgarianStemFilterFactory, TestBasqueAnalyzer,
TestPrefixAwareTokenFilter, TestWordDelimiterFilter, TestCharArraySet, TestSoraniStemFilter,
TestScandinavianNormalizationFilter, TestReverseStringFilter, TestSingleTokenTokenFilter,
TestOptionalCondition, TestItalianLightStemFilter, TestPortugueseAnalyzer, TestSpanishLightStemFilterFactory,
TestPortugueseStemFilterFactory, TestDelimitedPayloadTokenFilterFactory, TestShingleFilterFactory,
TestPatternTokenizer, GreekAnalyzerTest, TestGreekLowerCaseFilterFactory, TestElision, TestGermanStemFilter,
TestHyphenationCompoundWordTokenFilterFactory, TestCommonGramsFilterFactory, TestAnalyzers,
TestReverseStringFilterFactory, TestNorwegianAnalyzer, TestCharArrayIterator, TestSynonymMap,
TestNorwegianLightStemFilter, EdgeNGramTokenizerTest, DateRecognizerSinkTokenizerTest, TestChineseTokenizer,
DelimitedPayloadTokenFilterTest, TestFactories, TestPortugueseMinimalStemFilter, TestTruncateTokenFilter,
TestArabicFilters, TestTruncateTokenFilterFactory, TestSynonymMapFilter, TestPortugueseLightStemFilterFactory,
TestSegmentingTokenizerBase, TestCollationKeyFilter, TestGalicianStemFilterFactory, TestPersianNormalizationFilterFactory,
TestSoraniNormalizationFilterFactory, TestGermanMinimalStemFilter, TestKeepFilterFactory,
TestMappingCharFilterFactory, TestAllAnalyzersHaveFactories, TestRomanianAnalyzer, TestFrenchMinimalStemFilter,
TokenTypeSinkTokenizerTest, TestPatternReplaceFilter, TestDutchStemmer, NGramTokenizerTest,
TestMorph, TestCatalanAnalyzer, TestTypeTokenFilter, TestKeepWordFilter, TestIrishAnalyzer,
TestKStemFilterFactory, TestSlowSynonymFilter, CommonGramsFilterTest, TestSnowball, TestEscaped,
TestWordnetSynonymParser, TestHungarianLightStemFilterFactory, TestMappingCharFilter, TestLengthFilterFactory,
TestPatternReplaceCharFilterFactory, TestEnglishAnalyzer, TestClassicAnalyzer, TestFrenchLightStemFilter,
TestCJKBigramFilterFactory, TestCJKTokenizer, TestPersianCharFilter, TestPortugueseMinimalStemFilterFactory,
TestCircumfix, TestSoraniAnalyzer, TestIrishLowerCaseFilter, TestLatvianStemFilterFactory,
TestApostropheFilterFactory, TestEnglishMinimalStemFilter, TestFrenchMinimalStemFilterFactory,
TestElisionFilterFactory, TestPorterStemFilter, TestBugInSomething]
   [junit4]   2> NOTE: reproduce with: ant test  -Dtestcase=TestBugInSomething -Dtests.seed=910A4664FDCA418A
-Dtests.slow=true -Dtests.locale=pt_BR -Dtests.timezone=America/Dawson -Dtests.file.encoding=ISO-8859-1
   [junit4] ERROR   0.00s | TestBugInSomething (suite) <<<
   [junit4]    > Throwable #1: java.lang.Exception: Suite timeout exceeded (>= 7200000
msec).
   [junit4]    > 	at __randomizedtesting.SeedInfo.seed([910A4664FDCA418A]:0)Throwable #2:
com.carrotsearch.randomizedtesting.UncaughtExceptionError: Captured an uncaught exception
in thread: Thread[id=1003, name=Thread-759, state=RUNNABLE, group=TGRP-TestBugInSomething]
   [junit4]    > Caused by: java.lang.AssertionError: actual mem: 36606768 byte, expected
mem: 35383744 byte, flush mem: 16053992, active mem: 20552776, pending DWPT: 1, flushing DWPT:
0, blocked DWPT: 0, peakDelta mem: 1829312 byte
   [junit4]    > 	at __randomizedtesting.SeedInfo.seed([910A4664FDCA418A]:0)
   [junit4]    > 	at org.apache.lucene.index.DocumentsWriterFlushControl.assertMemory(DocumentsWriterFlushControl.java:127)
   [junit4]    > 	at org.apache.lucene.index.DocumentsWriterFlushControl.doAfterDocument(DocumentsWriterFlushControl.java:194)
   [junit4]    > 	at org.apache.lucene.index.DocumentsWriter.updateDocument(DocumentsWriter.java:471)
   [junit4]    > 	at org.apache.lucene.index.IndexWriter.updateDocument(IndexWriter.java:1541)
   [junit4]    > 	at org.apache.lucene.index.IndexWriter.addDocument(IndexWriter.java:1211)
   [junit4]    > 	at org.apache.lucene.index.RandomIndexWriter.addDocument(RandomIndexWriter.java:148)
   [junit4]    > 	at org.apache.lucene.index.RandomIndexWriter.addDocument(RandomIndexWriter.java:109)
   [junit4]    > 	at org.apache.lucene.analysis.BaseTokenStreamTestCase.checkRandomData(BaseTokenStreamTestCase.java:622)
   [junit4]    > 	at org.apache.lucene.analysis.BaseTokenStreamTestCase.access$000(BaseTokenStreamTestCase.java:61)
   [junit4]    > 	at org.apache.lucene.analysis.BaseTokenStreamTestCase$AnalysisThread.run(BaseTokenStreamTestCase.java:483)Throwable
#3: com.carrotsearch.randomizedtesting.UncaughtExceptionError: Captured an uncaught exception
in thread: Thread[id=1004, name=Thread-760, state=RUNNABLE, group=TGRP-TestBugInSomething]
   [junit4]    > Caused by: java.lang.AssertionError: actual mem: 38149188 byte, expected
mem: 37213056 byte, flush mem: 25479100, active mem: 12670088, pending DWPT: 0, flushing DWPT:
2, blocked DWPT: 0, peakDelta mem: 1829312 byte
   [junit4]    > 	at __randomizedtesting.SeedInfo.seed([910A4664FDCA418A]:0)
   [junit4]    > 	at org.apache.lucene.index.DocumentsWriterFlushControl.assertMemory(DocumentsWriterFlushControl.java:127)
   [junit4]    > 	at org.apache.lucene.index.DocumentsWriterFlushControl.doAfterDocument(DocumentsWriterFlushControl.java:194)
   [junit4]    > 	at org.apache.lucene.index.DocumentsWriter.updateDocuments(DocumentsWriter.java:433)
   [junit4]    > 	at org.apache.lucene.index.IndexWriter.updateDocuments(IndexWriter.java:1310)
   [junit4]    > 	at org.apache.lucene.index.IndexWriter.addDocuments(IndexWriter.java:1271)
   [junit4]    > 	at org.apache.lucene.index.RandomIndexWriter.addDocument(RandomIndexWriter.java:119)
   [junit4]    > 	at org.apache.lucene.index.RandomIndexWriter.addDocument(RandomIndexWriter.java:109)
   [junit4]    > 	at org.apache.lucene.analysis.BaseTokenStreamTestCase.checkRandomData(BaseTokenStreamTestCase.java:622)
   [junit4]    > 	at org.apache.lucene.analysis.BaseTokenStreamTestCase.access$000(BaseTokenStreamTestCase.java:61)
   [junit4]    > 	at org.apache.lucene.analysis.BaseTokenStreamTestCase$AnalysisThread.run(BaseTokenStreamTestCase.java:483)
   [junit4] Completed in 7271.29s, 1 test, 4 errors <<< FAILURES!

[...truncated 451 lines...]
BUILD FAILED
C:\Users\JenkinsSlave\workspace\Lucene-Solr-4.x-Windows\build.xml:467: The following error
occurred while executing this line:
C:\Users\JenkinsSlave\workspace\Lucene-Solr-4.x-Windows\build.xml:447: The following error
occurred while executing this line:
C:\Users\JenkinsSlave\workspace\Lucene-Solr-4.x-Windows\build.xml:45: The following error
occurred while executing this line:
C:\Users\JenkinsSlave\workspace\Lucene-Solr-4.x-Windows\extra-targets.xml:37: The following
error occurred while executing this line:
C:\Users\JenkinsSlave\workspace\Lucene-Solr-4.x-Windows\lucene\build.xml:539: The following
error occurred while executing this line:
C:\Users\JenkinsSlave\workspace\Lucene-Solr-4.x-Windows\lucene\common-build.xml:2017: The
following error occurred while executing this line:
C:\Users\JenkinsSlave\workspace\Lucene-Solr-4.x-Windows\lucene\analysis\build.xml:106: The
following error occurred while executing this line:
C:\Users\JenkinsSlave\workspace\Lucene-Solr-4.x-Windows\lucene\analysis\build.xml:38: The
following error occurred while executing this line:
C:\Users\JenkinsSlave\workspace\Lucene-Solr-4.x-Windows\lucene\module-build.xml:60: The following
error occurred while executing this line:
C:\Users\JenkinsSlave\workspace\Lucene-Solr-4.x-Windows\lucene\common-build.xml:1297: The
following error occurred while executing this line:
C:\Users\JenkinsSlave\workspace\Lucene-Solr-4.x-Windows\lucene\common-build.xml:921: There
were test failures: 266 suites, 1447 tests, 3 suite-level errors, 1 error, 1 ignored

Total time: 141 minutes 38 seconds
Build step 'Invoke Ant' marked build as failure
Description set: Java: 32bit/jdk1.7.0_60-ea-b15 -server -XX:+UseConcMarkSweepGC
Archiving artifacts
Recording test results
Email was triggered for: Failure
Sending email for trigger: Failure



Mime
View raw message