lucene-dev mailing list archives

Site index · List index
Message view « Date » · « Thread »
Top « Date » · « Thread »
From Policeman Jenkins Server <jenk...@thetaphi.de>
Subject [JENKINS] Lucene-Solr-4.8-Linux (32bit/ibm-j9-jdk7) - Build # 143 - Still Failing!
Date Sun, 11 May 2014 04:25:39 GMT
Build: http://jenkins.thetaphi.de/job/Lucene-Solr-4.8-Linux/143/
Java: 32bit/ibm-j9-jdk7 -Xjit:exclude={org/apache/lucene/util/fst/FST.pack(IIF)Lorg/apache/lucene/util/fst/FST;}

15 tests failed.
REGRESSION:  org.apache.lucene.codecs.perfield.TestPerFieldDocValuesFormat.testSortedVariableLengthVsFieldCache

Error Message:


Stack Trace:
java.lang.ArrayIndexOutOfBoundsException
	at org.apache.lucene.store.ByteArrayDataInput.readVInt(ByteArrayDataInput.java:105)
	at org.apache.lucene.codecs.pulsing.PulsingPostingsReader$PulsingDocsEnum.nextDoc(PulsingPostingsReader.java:324)
	at org.apache.lucene.search.FieldCacheImpl$SortedDocValuesCache.createValue(FieldCacheImpl.java:1240)
	at org.apache.lucene.search.FieldCacheImpl$Cache.get(FieldCacheImpl.java:211)
	at org.apache.lucene.search.FieldCacheImpl.getTermsIndex(FieldCacheImpl.java:1165)
	at org.apache.lucene.search.FieldCacheImpl.getTermsIndex(FieldCacheImpl.java:1145)
	at org.apache.lucene.index.BaseDocValuesFormatTestCase.doTestSortedVsFieldCache(BaseDocValuesFormatTestCase.java:1581)
	at org.apache.lucene.index.BaseDocValuesFormatTestCase.testSortedVariableLengthVsFieldCache(BaseDocValuesFormatTestCase.java:1608)
	at sun.reflect.NativeMethodAccessorImpl.invoke0(Native Method)
	at sun.reflect.NativeMethodAccessorImpl.invoke(NativeMethodAccessorImpl.java:94)
	at sun.reflect.DelegatingMethodAccessorImpl.invoke(DelegatingMethodAccessorImpl.java:55)
	at java.lang.reflect.Method.invoke(Method.java:619)
	at com.carrotsearch.randomizedtesting.RandomizedRunner.invoke(RandomizedRunner.java:1618)
	at com.carrotsearch.randomizedtesting.RandomizedRunner$6.evaluate(RandomizedRunner.java:827)
	at com.carrotsearch.randomizedtesting.RandomizedRunner$7.evaluate(RandomizedRunner.java:863)
	at com.carrotsearch.randomizedtesting.RandomizedRunner$8.evaluate(RandomizedRunner.java:877)
	at org.apache.lucene.util.TestRuleSetupTeardownChained$1.evaluate(TestRuleSetupTeardownChained.java:50)
	at org.apache.lucene.util.TestRuleFieldCacheSanity$1.evaluate(TestRuleFieldCacheSanity.java:51)
	at org.apache.lucene.util.AbstractBeforeAfterRule$1.evaluate(AbstractBeforeAfterRule.java:46)
	at com.carrotsearch.randomizedtesting.rules.SystemPropertiesInvariantRule$1.evaluate(SystemPropertiesInvariantRule.java:55)
	at org.apache.lucene.util.TestRuleThreadAndTestName$1.evaluate(TestRuleThreadAndTestName.java:49)
	at org.apache.lucene.util.TestRuleIgnoreAfterMaxFailures$1.evaluate(TestRuleIgnoreAfterMaxFailures.java:65)
	at org.apache.lucene.util.TestRuleMarkFailure$1.evaluate(TestRuleMarkFailure.java:48)
	at com.carrotsearch.randomizedtesting.rules.StatementAdapter.evaluate(StatementAdapter.java:36)
	at com.carrotsearch.randomizedtesting.ThreadLeakControl$StatementRunner.run(ThreadLeakControl.java:360)
	at com.carrotsearch.randomizedtesting.ThreadLeakControl.forkTimeoutingTask(ThreadLeakControl.java:793)
	at com.carrotsearch.randomizedtesting.ThreadLeakControl$3.evaluate(ThreadLeakControl.java:453)
	at com.carrotsearch.randomizedtesting.RandomizedRunner.runSingleTest(RandomizedRunner.java:836)
	at com.carrotsearch.randomizedtesting.RandomizedRunner$3.evaluate(RandomizedRunner.java:738)
	at com.carrotsearch.randomizedtesting.RandomizedRunner$4.evaluate(RandomizedRunner.java:772)
	at com.carrotsearch.randomizedtesting.RandomizedRunner$5.evaluate(RandomizedRunner.java:783)
	at org.apache.lucene.util.AbstractBeforeAfterRule$1.evaluate(AbstractBeforeAfterRule.java:46)
	at org.apache.lucene.util.TestRuleStoreClassName$1.evaluate(TestRuleStoreClassName.java:42)
	at com.carrotsearch.randomizedtesting.rules.SystemPropertiesInvariantRule$1.evaluate(SystemPropertiesInvariantRule.java:55)
	at com.carrotsearch.randomizedtesting.rules.NoShadowingOrOverridesOnMethodsRule$1.evaluate(NoShadowingOrOverridesOnMethodsRule.java:39)
	at com.carrotsearch.randomizedtesting.rules.NoShadowingOrOverridesOnMethodsRule$1.evaluate(NoShadowingOrOverridesOnMethodsRule.java:39)
	at com.carrotsearch.randomizedtesting.rules.StatementAdapter.evaluate(StatementAdapter.java:36)
	at com.carrotsearch.randomizedtesting.rules.StatementAdapter.evaluate(StatementAdapter.java:36)
	at org.apache.lucene.util.TestRuleAssertionsRequired$1.evaluate(TestRuleAssertionsRequired.java:43)
	at org.apache.lucene.util.TestRuleMarkFailure$1.evaluate(TestRuleMarkFailure.java:48)
	at org.apache.lucene.util.TestRuleIgnoreAfterMaxFailures$1.evaluate(TestRuleIgnoreAfterMaxFailures.java:65)
	at org.apache.lucene.util.TestRuleIgnoreTestSuites$1.evaluate(TestRuleIgnoreTestSuites.java:55)
	at com.carrotsearch.randomizedtesting.rules.StatementAdapter.evaluate(StatementAdapter.java:36)
	at com.carrotsearch.randomizedtesting.ThreadLeakControl$StatementRunner.run(ThreadLeakControl.java:360)
	at java.lang.Thread.run(Thread.java:853)


REGRESSION:  org.apache.lucene.codecs.perfield.TestPerFieldDocValuesFormat.testByteNumericsVsStoredFields

Error Message:
CheckIndex failed

Stack Trace:
java.lang.RuntimeException: CheckIndex failed
	at org.apache.lucene.util.TestUtil.checkIndex(TestUtil.java:203)
	at org.apache.lucene.store.MockDirectoryWrapper.close(MockDirectoryWrapper.java:691)
	at org.apache.lucene.index.BaseDocValuesFormatTestCase.doTestNumericsVsStoredFields(BaseDocValuesFormatTestCase.java:1278)
	at org.apache.lucene.index.BaseDocValuesFormatTestCase.doTestNumericsVsStoredFields(BaseDocValuesFormatTestCase.java:1218)
	at org.apache.lucene.index.BaseDocValuesFormatTestCase.testByteNumericsVsStoredFields(BaseDocValuesFormatTestCase.java:1358)
	at sun.reflect.NativeMethodAccessorImpl.invoke0(Native Method)
	at sun.reflect.NativeMethodAccessorImpl.invoke(NativeMethodAccessorImpl.java:94)
	at sun.reflect.DelegatingMethodAccessorImpl.invoke(DelegatingMethodAccessorImpl.java:55)
	at java.lang.reflect.Method.invoke(Method.java:619)
	at com.carrotsearch.randomizedtesting.RandomizedRunner.invoke(RandomizedRunner.java:1618)
	at com.carrotsearch.randomizedtesting.RandomizedRunner$6.evaluate(RandomizedRunner.java:827)
	at com.carrotsearch.randomizedtesting.RandomizedRunner$7.evaluate(RandomizedRunner.java:863)
	at com.carrotsearch.randomizedtesting.RandomizedRunner$8.evaluate(RandomizedRunner.java:877)
	at org.apache.lucene.util.TestRuleSetupTeardownChained$1.evaluate(TestRuleSetupTeardownChained.java:50)
	at org.apache.lucene.util.TestRuleFieldCacheSanity$1.evaluate(TestRuleFieldCacheSanity.java:51)
	at org.apache.lucene.util.AbstractBeforeAfterRule$1.evaluate(AbstractBeforeAfterRule.java:46)
	at com.carrotsearch.randomizedtesting.rules.SystemPropertiesInvariantRule$1.evaluate(SystemPropertiesInvariantRule.java:55)
	at org.apache.lucene.util.TestRuleThreadAndTestName$1.evaluate(TestRuleThreadAndTestName.java:49)
	at org.apache.lucene.util.TestRuleIgnoreAfterMaxFailures$1.evaluate(TestRuleIgnoreAfterMaxFailures.java:65)
	at org.apache.lucene.util.TestRuleMarkFailure$1.evaluate(TestRuleMarkFailure.java:48)
	at com.carrotsearch.randomizedtesting.rules.StatementAdapter.evaluate(StatementAdapter.java:36)
	at com.carrotsearch.randomizedtesting.ThreadLeakControl$StatementRunner.run(ThreadLeakControl.java:360)
	at com.carrotsearch.randomizedtesting.ThreadLeakControl.forkTimeoutingTask(ThreadLeakControl.java:793)
	at com.carrotsearch.randomizedtesting.ThreadLeakControl$3.evaluate(ThreadLeakControl.java:453)
	at com.carrotsearch.randomizedtesting.RandomizedRunner.runSingleTest(RandomizedRunner.java:836)
	at com.carrotsearch.randomizedtesting.RandomizedRunner$3.evaluate(RandomizedRunner.java:738)
	at com.carrotsearch.randomizedtesting.RandomizedRunner$4.evaluate(RandomizedRunner.java:772)
	at com.carrotsearch.randomizedtesting.RandomizedRunner$5.evaluate(RandomizedRunner.java:783)
	at org.apache.lucene.util.AbstractBeforeAfterRule$1.evaluate(AbstractBeforeAfterRule.java:46)
	at org.apache.lucene.util.TestRuleStoreClassName$1.evaluate(TestRuleStoreClassName.java:42)
	at com.carrotsearch.randomizedtesting.rules.SystemPropertiesInvariantRule$1.evaluate(SystemPropertiesInvariantRule.java:55)
	at com.carrotsearch.randomizedtesting.rules.NoShadowingOrOverridesOnMethodsRule$1.evaluate(NoShadowingOrOverridesOnMethodsRule.java:39)
	at com.carrotsearch.randomizedtesting.rules.NoShadowingOrOverridesOnMethodsRule$1.evaluate(NoShadowingOrOverridesOnMethodsRule.java:39)
	at com.carrotsearch.randomizedtesting.rules.StatementAdapter.evaluate(StatementAdapter.java:36)
	at com.carrotsearch.randomizedtesting.rules.StatementAdapter.evaluate(StatementAdapter.java:36)
	at org.apache.lucene.util.TestRuleAssertionsRequired$1.evaluate(TestRuleAssertionsRequired.java:43)
	at org.apache.lucene.util.TestRuleMarkFailure$1.evaluate(TestRuleMarkFailure.java:48)
	at org.apache.lucene.util.TestRuleIgnoreAfterMaxFailures$1.evaluate(TestRuleIgnoreAfterMaxFailures.java:65)
	at org.apache.lucene.util.TestRuleIgnoreTestSuites$1.evaluate(TestRuleIgnoreTestSuites.java:55)
	at com.carrotsearch.randomizedtesting.rules.StatementAdapter.evaluate(StatementAdapter.java:36)
	at com.carrotsearch.randomizedtesting.ThreadLeakControl$StatementRunner.run(ThreadLeakControl.java:360)
	at java.lang.Thread.run(Thread.java:853)


REGRESSION:  org.apache.lucene.index.TestDocCount.testSimple

Error Message:


Stack Trace:
java.lang.ArrayIndexOutOfBoundsException
	at __randomizedtesting.SeedInfo.seed([980F06D8400C8C98:A0BC222667FF5849]:0)
	at org.apache.lucene.store.ByteArrayDataInput.readVLong(ByteArrayDataInput.java:126)
	at org.apache.lucene.codecs.memory.FSTOrdTermsReader$TermsReader$BaseTermsEnum.refillMetadata(FSTOrdTermsReader.java:390)
	at org.apache.lucene.codecs.memory.FSTOrdTermsReader$TermsReader$BaseTermsEnum.decodeMetaData(FSTOrdTermsReader.java:357)
	at org.apache.lucene.codecs.memory.FSTOrdTermsReader$TermsReader$SegmentTermsEnum.decodeMetaData(FSTOrdTermsReader.java:471)
	at org.apache.lucene.codecs.memory.FSTOrdTermsReader$TermsReader$BaseTermsEnum.docs(FSTOrdTermsReader.java:426)
	at org.apache.lucene.index.MultiTermsEnum.docs(MultiTermsEnum.java:403)
	at org.apache.lucene.util.TestUtil.docs(TestUtil.java:897)
	at org.apache.lucene.index.TestDocCount.verifyCount(TestDocCount.java:75)
	at org.apache.lucene.index.TestDocCount.testSimple(TestDocCount.java:42)
	at sun.reflect.NativeMethodAccessorImpl.invoke0(Native Method)
	at sun.reflect.NativeMethodAccessorImpl.invoke(NativeMethodAccessorImpl.java:94)
	at sun.reflect.DelegatingMethodAccessorImpl.invoke(DelegatingMethodAccessorImpl.java:55)
	at java.lang.reflect.Method.invoke(Method.java:619)
	at com.carrotsearch.randomizedtesting.RandomizedRunner.invoke(RandomizedRunner.java:1618)
	at com.carrotsearch.randomizedtesting.RandomizedRunner$6.evaluate(RandomizedRunner.java:827)
	at com.carrotsearch.randomizedtesting.RandomizedRunner$7.evaluate(RandomizedRunner.java:863)
	at com.carrotsearch.randomizedtesting.RandomizedRunner$8.evaluate(RandomizedRunner.java:877)
	at org.apache.lucene.util.TestRuleSetupTeardownChained$1.evaluate(TestRuleSetupTeardownChained.java:50)
	at org.apache.lucene.util.TestRuleFieldCacheSanity$1.evaluate(TestRuleFieldCacheSanity.java:51)
	at org.apache.lucene.util.AbstractBeforeAfterRule$1.evaluate(AbstractBeforeAfterRule.java:46)
	at com.carrotsearch.randomizedtesting.rules.SystemPropertiesInvariantRule$1.evaluate(SystemPropertiesInvariantRule.java:55)
	at org.apache.lucene.util.TestRuleThreadAndTestName$1.evaluate(TestRuleThreadAndTestName.java:49)
	at org.apache.lucene.util.TestRuleIgnoreAfterMaxFailures$1.evaluate(TestRuleIgnoreAfterMaxFailures.java:65)
	at org.apache.lucene.util.TestRuleMarkFailure$1.evaluate(TestRuleMarkFailure.java:48)
	at com.carrotsearch.randomizedtesting.rules.StatementAdapter.evaluate(StatementAdapter.java:36)
	at com.carrotsearch.randomizedtesting.ThreadLeakControl$StatementRunner.run(ThreadLeakControl.java:360)
	at com.carrotsearch.randomizedtesting.ThreadLeakControl.forkTimeoutingTask(ThreadLeakControl.java:793)
	at com.carrotsearch.randomizedtesting.ThreadLeakControl$3.evaluate(ThreadLeakControl.java:453)
	at com.carrotsearch.randomizedtesting.RandomizedRunner.runSingleTest(RandomizedRunner.java:836)
	at com.carrotsearch.randomizedtesting.RandomizedRunner$3.evaluate(RandomizedRunner.java:738)
	at com.carrotsearch.randomizedtesting.RandomizedRunner$4.evaluate(RandomizedRunner.java:772)
	at com.carrotsearch.randomizedtesting.RandomizedRunner$5.evaluate(RandomizedRunner.java:783)
	at org.apache.lucene.util.AbstractBeforeAfterRule$1.evaluate(AbstractBeforeAfterRule.java:46)
	at org.apache.lucene.util.TestRuleStoreClassName$1.evaluate(TestRuleStoreClassName.java:42)
	at com.carrotsearch.randomizedtesting.rules.SystemPropertiesInvariantRule$1.evaluate(SystemPropertiesInvariantRule.java:55)
	at com.carrotsearch.randomizedtesting.rules.NoShadowingOrOverridesOnMethodsRule$1.evaluate(NoShadowingOrOverridesOnMethodsRule.java:39)
	at com.carrotsearch.randomizedtesting.rules.NoShadowingOrOverridesOnMethodsRule$1.evaluate(NoShadowingOrOverridesOnMethodsRule.java:39)
	at com.carrotsearch.randomizedtesting.rules.StatementAdapter.evaluate(StatementAdapter.java:36)
	at com.carrotsearch.randomizedtesting.rules.StatementAdapter.evaluate(StatementAdapter.java:36)
	at org.apache.lucene.util.TestRuleAssertionsRequired$1.evaluate(TestRuleAssertionsRequired.java:43)
	at org.apache.lucene.util.TestRuleMarkFailure$1.evaluate(TestRuleMarkFailure.java:48)
	at org.apache.lucene.util.TestRuleIgnoreAfterMaxFailures$1.evaluate(TestRuleIgnoreAfterMaxFailures.java:65)
	at org.apache.lucene.util.TestRuleIgnoreTestSuites$1.evaluate(TestRuleIgnoreTestSuites.java:55)
	at com.carrotsearch.randomizedtesting.rules.StatementAdapter.evaluate(StatementAdapter.java:36)
	at com.carrotsearch.randomizedtesting.ThreadLeakControl$StatementRunner.run(ThreadLeakControl.java:360)
	at java.lang.Thread.run(Thread.java:853)


REGRESSION:  org.apache.lucene.search.TestBooleanQueryVisitSubscorers.testNestedDisjunctions

Error Message:
CheckIndex failed

Stack Trace:
java.lang.RuntimeException: CheckIndex failed
	at __randomizedtesting.SeedInfo.seed([980F06D8400C8C98:5472E30F19CD3777]:0)
	at org.apache.lucene.util.TestUtil.checkIndex(TestUtil.java:203)
	at org.apache.lucene.store.MockDirectoryWrapper.close(MockDirectoryWrapper.java:691)
	at org.apache.lucene.search.TestBooleanQueryVisitSubscorers.tearDown(TestBooleanQueryVisitSubscorers.java:70)
	at sun.reflect.GeneratedMethodAccessor8.invoke(Unknown Source)
	at sun.reflect.DelegatingMethodAccessorImpl.invoke(DelegatingMethodAccessorImpl.java:55)
	at java.lang.reflect.Method.invoke(Method.java:619)
	at com.carrotsearch.randomizedtesting.RandomizedRunner.invoke(RandomizedRunner.java:1618)
	at com.carrotsearch.randomizedtesting.RandomizedRunner$8.evaluate(RandomizedRunner.java:885)
	at org.apache.lucene.util.TestRuleSetupTeardownChained$1.evaluate(TestRuleSetupTeardownChained.java:50)
	at org.apache.lucene.util.TestRuleFieldCacheSanity$1.evaluate(TestRuleFieldCacheSanity.java:51)
	at org.apache.lucene.util.AbstractBeforeAfterRule$1.evaluate(AbstractBeforeAfterRule.java:46)
	at com.carrotsearch.randomizedtesting.rules.SystemPropertiesInvariantRule$1.evaluate(SystemPropertiesInvariantRule.java:55)
	at org.apache.lucene.util.TestRuleThreadAndTestName$1.evaluate(TestRuleThreadAndTestName.java:49)
	at org.apache.lucene.util.TestRuleIgnoreAfterMaxFailures$1.evaluate(TestRuleIgnoreAfterMaxFailures.java:65)
	at org.apache.lucene.util.TestRuleMarkFailure$1.evaluate(TestRuleMarkFailure.java:48)
	at com.carrotsearch.randomizedtesting.rules.StatementAdapter.evaluate(StatementAdapter.java:36)
	at com.carrotsearch.randomizedtesting.ThreadLeakControl$StatementRunner.run(ThreadLeakControl.java:360)
	at com.carrotsearch.randomizedtesting.ThreadLeakControl.forkTimeoutingTask(ThreadLeakControl.java:793)
	at com.carrotsearch.randomizedtesting.ThreadLeakControl$3.evaluate(ThreadLeakControl.java:453)
	at com.carrotsearch.randomizedtesting.RandomizedRunner.runSingleTest(RandomizedRunner.java:836)
	at com.carrotsearch.randomizedtesting.RandomizedRunner$3.evaluate(RandomizedRunner.java:738)
	at com.carrotsearch.randomizedtesting.RandomizedRunner$4.evaluate(RandomizedRunner.java:772)
	at com.carrotsearch.randomizedtesting.RandomizedRunner$5.evaluate(RandomizedRunner.java:783)
	at org.apache.lucene.util.AbstractBeforeAfterRule$1.evaluate(AbstractBeforeAfterRule.java:46)
	at org.apache.lucene.util.TestRuleStoreClassName$1.evaluate(TestRuleStoreClassName.java:42)
	at com.carrotsearch.randomizedtesting.rules.SystemPropertiesInvariantRule$1.evaluate(SystemPropertiesInvariantRule.java:55)
	at com.carrotsearch.randomizedtesting.rules.NoShadowingOrOverridesOnMethodsRule$1.evaluate(NoShadowingOrOverridesOnMethodsRule.java:39)
	at com.carrotsearch.randomizedtesting.rules.NoShadowingOrOverridesOnMethodsRule$1.evaluate(NoShadowingOrOverridesOnMethodsRule.java:39)
	at com.carrotsearch.randomizedtesting.rules.StatementAdapter.evaluate(StatementAdapter.java:36)
	at com.carrotsearch.randomizedtesting.rules.StatementAdapter.evaluate(StatementAdapter.java:36)
	at org.apache.lucene.util.TestRuleAssertionsRequired$1.evaluate(TestRuleAssertionsRequired.java:43)
	at org.apache.lucene.util.TestRuleMarkFailure$1.evaluate(TestRuleMarkFailure.java:48)
	at org.apache.lucene.util.TestRuleIgnoreAfterMaxFailures$1.evaluate(TestRuleIgnoreAfterMaxFailures.java:65)
	at org.apache.lucene.util.TestRuleIgnoreTestSuites$1.evaluate(TestRuleIgnoreTestSuites.java:55)
	at com.carrotsearch.randomizedtesting.rules.StatementAdapter.evaluate(StatementAdapter.java:36)
	at com.carrotsearch.randomizedtesting.ThreadLeakControl$StatementRunner.run(ThreadLeakControl.java:360)
	at java.lang.Thread.run(Thread.java:853)


REGRESSION:  org.apache.lucene.search.TestCachingWrapperFilter.testEmpty

Error Message:
bit 369 is out of bounds 0..331

Stack Trace:
java.lang.AssertionError: bit 369 is out of bounds 0..331
	at org.apache.lucene.codecs.lucene40.BitVector.get(BitVector.java:148)
	at org.apache.lucene.codecs.pulsing.PulsingPostingsReader$PulsingDocsEnum.nextDoc(PulsingPostingsReader.java:365)
	at org.apache.lucene.index.BufferedUpdatesStream.applyTermDeletes(BufferedUpdatesStream.java:423)
	at org.apache.lucene.index.BufferedUpdatesStream.applyDeletesAndUpdates(BufferedUpdatesStream.java:283)
	at org.apache.lucene.index.IndexWriter.applyAllDeletesAndUpdates(IndexWriter.java:3238)
	at org.apache.lucene.index.IndexWriter.maybeApplyDeletes(IndexWriter.java:3229)
	at org.apache.lucene.index.IndexWriter.prepareCommitInternal(IndexWriter.java:2947)
	at org.apache.lucene.index.IndexWriter.commitInternal(IndexWriter.java:3096)
	at org.apache.lucene.index.IndexWriter.commit(IndexWriter.java:3063)
	at org.apache.lucene.index.RandomIndexWriter.getReader(RandomIndexWriter.java:337)
	at org.apache.lucene.index.RandomIndexWriter.getReader(RandomIndexWriter.java:271)
	at org.apache.lucene.search.TestCachingWrapperFilter.setUp(TestCachingWrapperFilter.java:63)
	at sun.reflect.GeneratedMethodAccessor7.invoke(Unknown Source)
	at sun.reflect.DelegatingMethodAccessorImpl.invoke(DelegatingMethodAccessorImpl.java:55)
	at java.lang.reflect.Method.invoke(Method.java:619)
	at com.carrotsearch.randomizedtesting.RandomizedRunner.invoke(RandomizedRunner.java:1618)
	at com.carrotsearch.randomizedtesting.RandomizedRunner$7.evaluate(RandomizedRunner.java:861)
	at com.carrotsearch.randomizedtesting.RandomizedRunner$8.evaluate(RandomizedRunner.java:877)
	at org.apache.lucene.util.TestRuleSetupTeardownChained$1.evaluate(TestRuleSetupTeardownChained.java:50)
	at org.apache.lucene.util.TestRuleFieldCacheSanity$1.evaluate(TestRuleFieldCacheSanity.java:51)
	at org.apache.lucene.util.AbstractBeforeAfterRule$1.evaluate(AbstractBeforeAfterRule.java:46)
	at com.carrotsearch.randomizedtesting.rules.SystemPropertiesInvariantRule$1.evaluate(SystemPropertiesInvariantRule.java:55)
	at org.apache.lucene.util.TestRuleThreadAndTestName$1.evaluate(TestRuleThreadAndTestName.java:49)
	at org.apache.lucene.util.TestRuleIgnoreAfterMaxFailures$1.evaluate(TestRuleIgnoreAfterMaxFailures.java:65)
	at org.apache.lucene.util.TestRuleMarkFailure$1.evaluate(TestRuleMarkFailure.java:48)
	at com.carrotsearch.randomizedtesting.rules.StatementAdapter.evaluate(StatementAdapter.java:36)
	at com.carrotsearch.randomizedtesting.ThreadLeakControl$StatementRunner.run(ThreadLeakControl.java:360)
	at com.carrotsearch.randomizedtesting.ThreadLeakControl.forkTimeoutingTask(ThreadLeakControl.java:793)
	at com.carrotsearch.randomizedtesting.ThreadLeakControl$3.evaluate(ThreadLeakControl.java:453)
	at com.carrotsearch.randomizedtesting.RandomizedRunner.runSingleTest(RandomizedRunner.java:836)
	at com.carrotsearch.randomizedtesting.RandomizedRunner$3.evaluate(RandomizedRunner.java:738)
	at com.carrotsearch.randomizedtesting.RandomizedRunner$4.evaluate(RandomizedRunner.java:772)
	at com.carrotsearch.randomizedtesting.RandomizedRunner$5.evaluate(RandomizedRunner.java:783)
	at org.apache.lucene.util.AbstractBeforeAfterRule$1.evaluate(AbstractBeforeAfterRule.java:46)
	at org.apache.lucene.util.TestRuleStoreClassName$1.evaluate(TestRuleStoreClassName.java:42)
	at com.carrotsearch.randomizedtesting.rules.SystemPropertiesInvariantRule$1.evaluate(SystemPropertiesInvariantRule.java:55)
	at com.carrotsearch.randomizedtesting.rules.NoShadowingOrOverridesOnMethodsRule$1.evaluate(NoShadowingOrOverridesOnMethodsRule.java:39)
	at com.carrotsearch.randomizedtesting.rules.NoShadowingOrOverridesOnMethodsRule$1.evaluate(NoShadowingOrOverridesOnMethodsRule.java:39)
	at com.carrotsearch.randomizedtesting.rules.StatementAdapter.evaluate(StatementAdapter.java:36)
	at com.carrotsearch.randomizedtesting.rules.StatementAdapter.evaluate(StatementAdapter.java:36)
	at org.apache.lucene.util.TestRuleAssertionsRequired$1.evaluate(TestRuleAssertionsRequired.java:43)
	at org.apache.lucene.util.TestRuleMarkFailure$1.evaluate(TestRuleMarkFailure.java:48)
	at org.apache.lucene.util.TestRuleIgnoreAfterMaxFailures$1.evaluate(TestRuleIgnoreAfterMaxFailures.java:65)
	at org.apache.lucene.util.TestRuleIgnoreTestSuites$1.evaluate(TestRuleIgnoreTestSuites.java:55)
	at com.carrotsearch.randomizedtesting.rules.StatementAdapter.evaluate(StatementAdapter.java:36)
	at com.carrotsearch.randomizedtesting.ThreadLeakControl$StatementRunner.run(ThreadLeakControl.java:360)
	at java.lang.Thread.run(Thread.java:853)


REGRESSION:  org.apache.lucene.search.TestCachingWrapperFilter.testEmpty2

Error Message:


Stack Trace:
java.lang.ArrayIndexOutOfBoundsException
	at org.apache.lucene.store.ByteArrayDataInput.readVLong(ByteArrayDataInput.java:126)
	at org.apache.lucene.codecs.memory.FSTOrdTermsReader$TermsReader$BaseTermsEnum.refillMetadata(FSTOrdTermsReader.java:393)
	at org.apache.lucene.codecs.memory.FSTOrdTermsReader$TermsReader$BaseTermsEnum.decodeMetaData(FSTOrdTermsReader.java:357)
	at org.apache.lucene.codecs.memory.FSTOrdTermsReader$TermsReader$SegmentTermsEnum.decodeMetaData(FSTOrdTermsReader.java:471)
	at org.apache.lucene.codecs.memory.FSTOrdTermsReader$TermsReader$BaseTermsEnum.docs(FSTOrdTermsReader.java:426)
	at org.apache.lucene.index.BufferedUpdatesStream.applyTermDeletes(BufferedUpdatesStream.java:418)
	at org.apache.lucene.index.BufferedUpdatesStream.applyDeletesAndUpdates(BufferedUpdatesStream.java:283)
	at org.apache.lucene.index.IndexWriter.applyAllDeletesAndUpdates(IndexWriter.java:3238)
	at org.apache.lucene.index.IndexWriter.maybeApplyDeletes(IndexWriter.java:3229)
	at org.apache.lucene.index.IndexWriter.getReader(IndexWriter.java:384)
	at org.apache.lucene.index.RandomIndexWriter.getReader(RandomIndexWriter.java:332)
	at org.apache.lucene.index.RandomIndexWriter.getReader(RandomIndexWriter.java:271)
	at org.apache.lucene.search.TestCachingWrapperFilter.setUp(TestCachingWrapperFilter.java:63)
	at sun.reflect.GeneratedMethodAccessor7.invoke(Unknown Source)
	at sun.reflect.DelegatingMethodAccessorImpl.invoke(DelegatingMethodAccessorImpl.java:55)
	at java.lang.reflect.Method.invoke(Method.java:619)
	at com.carrotsearch.randomizedtesting.RandomizedRunner.invoke(RandomizedRunner.java:1618)
	at com.carrotsearch.randomizedtesting.RandomizedRunner$7.evaluate(RandomizedRunner.java:861)
	at com.carrotsearch.randomizedtesting.RandomizedRunner$8.evaluate(RandomizedRunner.java:877)
	at org.apache.lucene.util.TestRuleSetupTeardownChained$1.evaluate(TestRuleSetupTeardownChained.java:50)
	at org.apache.lucene.util.TestRuleFieldCacheSanity$1.evaluate(TestRuleFieldCacheSanity.java:51)
	at org.apache.lucene.util.AbstractBeforeAfterRule$1.evaluate(AbstractBeforeAfterRule.java:46)
	at com.carrotsearch.randomizedtesting.rules.SystemPropertiesInvariantRule$1.evaluate(SystemPropertiesInvariantRule.java:55)
	at org.apache.lucene.util.TestRuleThreadAndTestName$1.evaluate(TestRuleThreadAndTestName.java:49)
	at org.apache.lucene.util.TestRuleIgnoreAfterMaxFailures$1.evaluate(TestRuleIgnoreAfterMaxFailures.java:65)
	at org.apache.lucene.util.TestRuleMarkFailure$1.evaluate(TestRuleMarkFailure.java:48)
	at com.carrotsearch.randomizedtesting.rules.StatementAdapter.evaluate(StatementAdapter.java:36)
	at com.carrotsearch.randomizedtesting.ThreadLeakControl$StatementRunner.run(ThreadLeakControl.java:360)
	at com.carrotsearch.randomizedtesting.ThreadLeakControl.forkTimeoutingTask(ThreadLeakControl.java:793)
	at com.carrotsearch.randomizedtesting.ThreadLeakControl$3.evaluate(ThreadLeakControl.java:453)
	at com.carrotsearch.randomizedtesting.RandomizedRunner.runSingleTest(RandomizedRunner.java:836)
	at com.carrotsearch.randomizedtesting.RandomizedRunner$3.evaluate(RandomizedRunner.java:738)
	at com.carrotsearch.randomizedtesting.RandomizedRunner$4.evaluate(RandomizedRunner.java:772)
	at com.carrotsearch.randomizedtesting.RandomizedRunner$5.evaluate(RandomizedRunner.java:783)
	at org.apache.lucene.util.AbstractBeforeAfterRule$1.evaluate(AbstractBeforeAfterRule.java:46)
	at org.apache.lucene.util.TestRuleStoreClassName$1.evaluate(TestRuleStoreClassName.java:42)
	at com.carrotsearch.randomizedtesting.rules.SystemPropertiesInvariantRule$1.evaluate(SystemPropertiesInvariantRule.java:55)
	at com.carrotsearch.randomizedtesting.rules.NoShadowingOrOverridesOnMethodsRule$1.evaluate(NoShadowingOrOverridesOnMethodsRule.java:39)
	at com.carrotsearch.randomizedtesting.rules.NoShadowingOrOverridesOnMethodsRule$1.evaluate(NoShadowingOrOverridesOnMethodsRule.java:39)
	at com.carrotsearch.randomizedtesting.rules.StatementAdapter.evaluate(StatementAdapter.java:36)
	at com.carrotsearch.randomizedtesting.rules.StatementAdapter.evaluate(StatementAdapter.java:36)
	at org.apache.lucene.util.TestRuleAssertionsRequired$1.evaluate(TestRuleAssertionsRequired.java:43)
	at org.apache.lucene.util.TestRuleMarkFailure$1.evaluate(TestRuleMarkFailure.java:48)
	at org.apache.lucene.util.TestRuleIgnoreAfterMaxFailures$1.evaluate(TestRuleIgnoreAfterMaxFailures.java:65)
	at org.apache.lucene.util.TestRuleIgnoreTestSuites$1.evaluate(TestRuleIgnoreTestSuites.java:55)
	at com.carrotsearch.randomizedtesting.rules.StatementAdapter.evaluate(StatementAdapter.java:36)
	at com.carrotsearch.randomizedtesting.ThreadLeakControl$StatementRunner.run(ThreadLeakControl.java:360)
	at java.lang.Thread.run(Thread.java:853)


REGRESSION:  org.apache.lucene.search.TestCachingWrapperFilter.testIsCacheAble

Error Message:


Stack Trace:
java.lang.ArrayIndexOutOfBoundsException
	at org.apache.lucene.store.ByteArrayDataInput.readVLong(ByteArrayDataInput.java:126)
	at org.apache.lucene.codecs.memory.FSTOrdTermsReader$TermsReader$BaseTermsEnum.refillMetadata(FSTOrdTermsReader.java:393)
	at org.apache.lucene.codecs.memory.FSTOrdTermsReader$TermsReader$BaseTermsEnum.decodeMetaData(FSTOrdTermsReader.java:357)
	at org.apache.lucene.codecs.memory.FSTOrdTermsReader$TermsReader$SegmentTermsEnum.decodeMetaData(FSTOrdTermsReader.java:471)
	at org.apache.lucene.codecs.memory.FSTOrdTermsReader$TermsReader$BaseTermsEnum.docs(FSTOrdTermsReader.java:426)
	at org.apache.lucene.index.BufferedUpdatesStream.applyTermDeletes(BufferedUpdatesStream.java:418)
	at org.apache.lucene.index.BufferedUpdatesStream.applyDeletesAndUpdates(BufferedUpdatesStream.java:283)
	at org.apache.lucene.index.IndexWriter.applyAllDeletesAndUpdates(IndexWriter.java:3238)
	at org.apache.lucene.index.IndexWriter.maybeApplyDeletes(IndexWriter.java:3229)
	at org.apache.lucene.index.IndexWriter.prepareCommitInternal(IndexWriter.java:2947)
	at org.apache.lucene.index.IndexWriter.commitInternal(IndexWriter.java:3096)
	at org.apache.lucene.index.IndexWriter.commit(IndexWriter.java:3063)
	at org.apache.lucene.index.RandomIndexWriter.getReader(RandomIndexWriter.java:337)
	at org.apache.lucene.index.RandomIndexWriter.getReader(RandomIndexWriter.java:271)
	at org.apache.lucene.search.TestCachingWrapperFilter.setUp(TestCachingWrapperFilter.java:63)
	at sun.reflect.GeneratedMethodAccessor7.invoke(Unknown Source)
	at sun.reflect.DelegatingMethodAccessorImpl.invoke(DelegatingMethodAccessorImpl.java:55)
	at java.lang.reflect.Method.invoke(Method.java:619)
	at com.carrotsearch.randomizedtesting.RandomizedRunner.invoke(RandomizedRunner.java:1618)
	at com.carrotsearch.randomizedtesting.RandomizedRunner$7.evaluate(RandomizedRunner.java:861)
	at com.carrotsearch.randomizedtesting.RandomizedRunner$8.evaluate(RandomizedRunner.java:877)
	at org.apache.lucene.util.TestRuleSetupTeardownChained$1.evaluate(TestRuleSetupTeardownChained.java:50)
	at org.apache.lucene.util.TestRuleFieldCacheSanity$1.evaluate(TestRuleFieldCacheSanity.java:51)
	at org.apache.lucene.util.AbstractBeforeAfterRule$1.evaluate(AbstractBeforeAfterRule.java:46)
	at com.carrotsearch.randomizedtesting.rules.SystemPropertiesInvariantRule$1.evaluate(SystemPropertiesInvariantRule.java:55)
	at org.apache.lucene.util.TestRuleThreadAndTestName$1.evaluate(TestRuleThreadAndTestName.java:49)
	at org.apache.lucene.util.TestRuleIgnoreAfterMaxFailures$1.evaluate(TestRuleIgnoreAfterMaxFailures.java:65)
	at org.apache.lucene.util.TestRuleMarkFailure$1.evaluate(TestRuleMarkFailure.java:48)
	at com.carrotsearch.randomizedtesting.rules.StatementAdapter.evaluate(StatementAdapter.java:36)
	at com.carrotsearch.randomizedtesting.ThreadLeakControl$StatementRunner.run(ThreadLeakControl.java:360)
	at com.carrotsearch.randomizedtesting.ThreadLeakControl.forkTimeoutingTask(ThreadLeakControl.java:793)
	at com.carrotsearch.randomizedtesting.ThreadLeakControl$3.evaluate(ThreadLeakControl.java:453)
	at com.carrotsearch.randomizedtesting.RandomizedRunner.runSingleTest(RandomizedRunner.java:836)
	at com.carrotsearch.randomizedtesting.RandomizedRunner$3.evaluate(RandomizedRunner.java:738)
	at com.carrotsearch.randomizedtesting.RandomizedRunner$4.evaluate(RandomizedRunner.java:772)
	at com.carrotsearch.randomizedtesting.RandomizedRunner$5.evaluate(RandomizedRunner.java:783)
	at org.apache.lucene.util.AbstractBeforeAfterRule$1.evaluate(AbstractBeforeAfterRule.java:46)
	at org.apache.lucene.util.TestRuleStoreClassName$1.evaluate(TestRuleStoreClassName.java:42)
	at com.carrotsearch.randomizedtesting.rules.SystemPropertiesInvariantRule$1.evaluate(SystemPropertiesInvariantRule.java:55)
	at com.carrotsearch.randomizedtesting.rules.NoShadowingOrOverridesOnMethodsRule$1.evaluate(NoShadowingOrOverridesOnMethodsRule.java:39)
	at com.carrotsearch.randomizedtesting.rules.NoShadowingOrOverridesOnMethodsRule$1.evaluate(NoShadowingOrOverridesOnMethodsRule.java:39)
	at com.carrotsearch.randomizedtesting.rules.StatementAdapter.evaluate(StatementAdapter.java:36)
	at com.carrotsearch.randomizedtesting.rules.StatementAdapter.evaluate(StatementAdapter.java:36)
	at org.apache.lucene.util.TestRuleAssertionsRequired$1.evaluate(TestRuleAssertionsRequired.java:43)
	at org.apache.lucene.util.TestRuleMarkFailure$1.evaluate(TestRuleMarkFailure.java:48)
	at org.apache.lucene.util.TestRuleIgnoreAfterMaxFailures$1.evaluate(TestRuleIgnoreAfterMaxFailures.java:65)
	at org.apache.lucene.util.TestRuleIgnoreTestSuites$1.evaluate(TestRuleIgnoreTestSuites.java:55)
	at com.carrotsearch.randomizedtesting.rules.StatementAdapter.evaluate(StatementAdapter.java:36)
	at com.carrotsearch.randomizedtesting.ThreadLeakControl$StatementRunner.run(ThreadLeakControl.java:360)
	at java.lang.Thread.run(Thread.java:853)


REGRESSION:  org.apache.lucene.search.TestCachingWrapperFilter.testSparse

Error Message:


Stack Trace:
java.lang.ArrayIndexOutOfBoundsException
	at org.apache.lucene.store.ByteArrayDataInput.readVLong(ByteArrayDataInput.java:126)
	at org.apache.lucene.codecs.memory.FSTOrdTermsReader$TermsReader$BaseTermsEnum.refillMetadata(FSTOrdTermsReader.java:393)
	at org.apache.lucene.codecs.memory.FSTOrdTermsReader$TermsReader$BaseTermsEnum.decodeMetaData(FSTOrdTermsReader.java:357)
	at org.apache.lucene.codecs.memory.FSTOrdTermsReader$TermsReader$SegmentTermsEnum.decodeMetaData(FSTOrdTermsReader.java:471)
	at org.apache.lucene.codecs.memory.FSTOrdTermsReader$TermsReader$BaseTermsEnum.docs(FSTOrdTermsReader.java:426)
	at org.apache.lucene.index.BufferedUpdatesStream.applyTermDeletes(BufferedUpdatesStream.java:418)
	at org.apache.lucene.index.BufferedUpdatesStream.applyDeletesAndUpdates(BufferedUpdatesStream.java:283)
	at org.apache.lucene.index.IndexWriter.applyAllDeletesAndUpdates(IndexWriter.java:3238)
	at org.apache.lucene.index.IndexWriter.maybeApplyDeletes(IndexWriter.java:3229)
	at org.apache.lucene.index.IndexWriter.prepareCommitInternal(IndexWriter.java:2947)
	at org.apache.lucene.index.IndexWriter.commitInternal(IndexWriter.java:3096)
	at org.apache.lucene.index.IndexWriter.commit(IndexWriter.java:3063)
	at org.apache.lucene.index.RandomIndexWriter.getReader(RandomIndexWriter.java:330)
	at org.apache.lucene.index.RandomIndexWriter.getReader(RandomIndexWriter.java:271)
	at org.apache.lucene.search.TestCachingWrapperFilter.setUp(TestCachingWrapperFilter.java:63)
	at sun.reflect.GeneratedMethodAccessor7.invoke(Unknown Source)
	at sun.reflect.DelegatingMethodAccessorImpl.invoke(DelegatingMethodAccessorImpl.java:55)
	at java.lang.reflect.Method.invoke(Method.java:619)
	at com.carrotsearch.randomizedtesting.RandomizedRunner.invoke(RandomizedRunner.java:1618)
	at com.carrotsearch.randomizedtesting.RandomizedRunner$7.evaluate(RandomizedRunner.java:861)
	at com.carrotsearch.randomizedtesting.RandomizedRunner$8.evaluate(RandomizedRunner.java:877)
	at org.apache.lucene.util.TestRuleSetupTeardownChained$1.evaluate(TestRuleSetupTeardownChained.java:50)
	at org.apache.lucene.util.TestRuleFieldCacheSanity$1.evaluate(TestRuleFieldCacheSanity.java:51)
	at org.apache.lucene.util.AbstractBeforeAfterRule$1.evaluate(AbstractBeforeAfterRule.java:46)
	at com.carrotsearch.randomizedtesting.rules.SystemPropertiesInvariantRule$1.evaluate(SystemPropertiesInvariantRule.java:55)
	at org.apache.lucene.util.TestRuleThreadAndTestName$1.evaluate(TestRuleThreadAndTestName.java:49)
	at org.apache.lucene.util.TestRuleIgnoreAfterMaxFailures$1.evaluate(TestRuleIgnoreAfterMaxFailures.java:65)
	at org.apache.lucene.util.TestRuleMarkFailure$1.evaluate(TestRuleMarkFailure.java:48)
	at com.carrotsearch.randomizedtesting.rules.StatementAdapter.evaluate(StatementAdapter.java:36)
	at com.carrotsearch.randomizedtesting.ThreadLeakControl$StatementRunner.run(ThreadLeakControl.java:360)
	at com.carrotsearch.randomizedtesting.ThreadLeakControl.forkTimeoutingTask(ThreadLeakControl.java:793)
	at com.carrotsearch.randomizedtesting.ThreadLeakControl$3.evaluate(ThreadLeakControl.java:453)
	at com.carrotsearch.randomizedtesting.RandomizedRunner.runSingleTest(RandomizedRunner.java:836)
	at com.carrotsearch.randomizedtesting.RandomizedRunner$3.evaluate(RandomizedRunner.java:738)
	at com.carrotsearch.randomizedtesting.RandomizedRunner$4.evaluate(RandomizedRunner.java:772)
	at com.carrotsearch.randomizedtesting.RandomizedRunner$5.evaluate(RandomizedRunner.java:783)
	at org.apache.lucene.util.AbstractBeforeAfterRule$1.evaluate(AbstractBeforeAfterRule.java:46)
	at org.apache.lucene.util.TestRuleStoreClassName$1.evaluate(TestRuleStoreClassName.java:42)
	at com.carrotsearch.randomizedtesting.rules.SystemPropertiesInvariantRule$1.evaluate(SystemPropertiesInvariantRule.java:55)
	at com.carrotsearch.randomizedtesting.rules.NoShadowingOrOverridesOnMethodsRule$1.evaluate(NoShadowingOrOverridesOnMethodsRule.java:39)
	at com.carrotsearch.randomizedtesting.rules.NoShadowingOrOverridesOnMethodsRule$1.evaluate(NoShadowingOrOverridesOnMethodsRule.java:39)
	at com.carrotsearch.randomizedtesting.rules.StatementAdapter.evaluate(StatementAdapter.java:36)
	at com.carrotsearch.randomizedtesting.rules.StatementAdapter.evaluate(StatementAdapter.java:36)
	at org.apache.lucene.util.TestRuleAssertionsRequired$1.evaluate(TestRuleAssertionsRequired.java:43)
	at org.apache.lucene.util.TestRuleMarkFailure$1.evaluate(TestRuleMarkFailure.java:48)
	at org.apache.lucene.util.TestRuleIgnoreAfterMaxFailures$1.evaluate(TestRuleIgnoreAfterMaxFailures.java:65)
	at org.apache.lucene.util.TestRuleIgnoreTestSuites$1.evaluate(TestRuleIgnoreTestSuites.java:55)
	at com.carrotsearch.randomizedtesting.rules.StatementAdapter.evaluate(StatementAdapter.java:36)
	at com.carrotsearch.randomizedtesting.ThreadLeakControl$StatementRunner.run(ThreadLeakControl.java:360)
	at java.lang.Thread.run(Thread.java:853)


REGRESSION:  org.apache.lucene.search.TestCachingWrapperFilter.testDense

Error Message:


Stack Trace:
java.lang.ArrayIndexOutOfBoundsException
	at org.apache.lucene.store.ByteArrayDataInput.readVLong(ByteArrayDataInput.java:126)
	at org.apache.lucene.codecs.memory.FSTOrdTermsReader$TermsReader$BaseTermsEnum.refillMetadata(FSTOrdTermsReader.java:393)
	at org.apache.lucene.codecs.memory.FSTOrdTermsReader$TermsReader$BaseTermsEnum.decodeMetaData(FSTOrdTermsReader.java:357)
	at org.apache.lucene.codecs.memory.FSTOrdTermsReader$TermsReader$SegmentTermsEnum.decodeMetaData(FSTOrdTermsReader.java:471)
	at org.apache.lucene.codecs.memory.FSTOrdTermsReader$TermsReader$BaseTermsEnum.docs(FSTOrdTermsReader.java:426)
	at org.apache.lucene.index.BufferedUpdatesStream.applyTermDeletes(BufferedUpdatesStream.java:418)
	at org.apache.lucene.index.BufferedUpdatesStream.applyDeletesAndUpdates(BufferedUpdatesStream.java:283)
	at org.apache.lucene.index.IndexWriter.applyAllDeletesAndUpdates(IndexWriter.java:3238)
	at org.apache.lucene.index.IndexWriter.maybeApplyDeletes(IndexWriter.java:3229)
	at org.apache.lucene.index.IndexWriter.prepareCommitInternal(IndexWriter.java:2947)
	at org.apache.lucene.index.IndexWriter.commitInternal(IndexWriter.java:3096)
	at org.apache.lucene.index.IndexWriter.commit(IndexWriter.java:3063)
	at org.apache.lucene.index.RandomIndexWriter.getReader(RandomIndexWriter.java:330)
	at org.apache.lucene.index.RandomIndexWriter.getReader(RandomIndexWriter.java:271)
	at org.apache.lucene.search.TestCachingWrapperFilter.setUp(TestCachingWrapperFilter.java:63)
	at sun.reflect.GeneratedMethodAccessor7.invoke(Unknown Source)
	at sun.reflect.DelegatingMethodAccessorImpl.invoke(DelegatingMethodAccessorImpl.java:55)
	at java.lang.reflect.Method.invoke(Method.java:619)
	at com.carrotsearch.randomizedtesting.RandomizedRunner.invoke(RandomizedRunner.java:1618)
	at com.carrotsearch.randomizedtesting.RandomizedRunner$7.evaluate(RandomizedRunner.java:861)
	at com.carrotsearch.randomizedtesting.RandomizedRunner$8.evaluate(RandomizedRunner.java:877)
	at org.apache.lucene.util.TestRuleSetupTeardownChained$1.evaluate(TestRuleSetupTeardownChained.java:50)
	at org.apache.lucene.util.TestRuleFieldCacheSanity$1.evaluate(TestRuleFieldCacheSanity.java:51)
	at org.apache.lucene.util.AbstractBeforeAfterRule$1.evaluate(AbstractBeforeAfterRule.java:46)
	at com.carrotsearch.randomizedtesting.rules.SystemPropertiesInvariantRule$1.evaluate(SystemPropertiesInvariantRule.java:55)
	at org.apache.lucene.util.TestRuleThreadAndTestName$1.evaluate(TestRuleThreadAndTestName.java:49)
	at org.apache.lucene.util.TestRuleIgnoreAfterMaxFailures$1.evaluate(TestRuleIgnoreAfterMaxFailures.java:65)
	at org.apache.lucene.util.TestRuleMarkFailure$1.evaluate(TestRuleMarkFailure.java:48)
	at com.carrotsearch.randomizedtesting.rules.StatementAdapter.evaluate(StatementAdapter.java:36)
	at com.carrotsearch.randomizedtesting.ThreadLeakControl$StatementRunner.run(ThreadLeakControl.java:360)
	at com.carrotsearch.randomizedtesting.ThreadLeakControl.forkTimeoutingTask(ThreadLeakControl.java:793)
	at com.carrotsearch.randomizedtesting.ThreadLeakControl$3.evaluate(ThreadLeakControl.java:453)
	at com.carrotsearch.randomizedtesting.RandomizedRunner.runSingleTest(RandomizedRunner.java:836)
	at com.carrotsearch.randomizedtesting.RandomizedRunner$3.evaluate(RandomizedRunner.java:738)
	at com.carrotsearch.randomizedtesting.RandomizedRunner$4.evaluate(RandomizedRunner.java:772)
	at com.carrotsearch.randomizedtesting.RandomizedRunner$5.evaluate(RandomizedRunner.java:783)
	at org.apache.lucene.util.AbstractBeforeAfterRule$1.evaluate(AbstractBeforeAfterRule.java:46)
	at org.apache.lucene.util.TestRuleStoreClassName$1.evaluate(TestRuleStoreClassName.java:42)
	at com.carrotsearch.randomizedtesting.rules.SystemPropertiesInvariantRule$1.evaluate(SystemPropertiesInvariantRule.java:55)
	at com.carrotsearch.randomizedtesting.rules.NoShadowingOrOverridesOnMethodsRule$1.evaluate(NoShadowingOrOverridesOnMethodsRule.java:39)
	at com.carrotsearch.randomizedtesting.rules.NoShadowingOrOverridesOnMethodsRule$1.evaluate(NoShadowingOrOverridesOnMethodsRule.java:39)
	at com.carrotsearch.randomizedtesting.rules.StatementAdapter.evaluate(StatementAdapter.java:36)
	at com.carrotsearch.randomizedtesting.rules.StatementAdapter.evaluate(StatementAdapter.java:36)
	at org.apache.lucene.util.TestRuleAssertionsRequired$1.evaluate(TestRuleAssertionsRequired.java:43)
	at org.apache.lucene.util.TestRuleMarkFailure$1.evaluate(TestRuleMarkFailure.java:48)
	at org.apache.lucene.util.TestRuleIgnoreAfterMaxFailures$1.evaluate(TestRuleIgnoreAfterMaxFailures.java:65)
	at org.apache.lucene.util.TestRuleIgnoreTestSuites$1.evaluate(TestRuleIgnoreTestSuites.java:55)
	at com.carrotsearch.randomizedtesting.rules.StatementAdapter.evaluate(StatementAdapter.java:36)
	at com.carrotsearch.randomizedtesting.ThreadLeakControl$StatementRunner.run(ThreadLeakControl.java:360)
	at java.lang.Thread.run(Thread.java:853)


REGRESSION:  org.apache.lucene.search.TestCachingWrapperFilter.testEnforceDeletions

Error Message:


Stack Trace:
java.lang.ArrayIndexOutOfBoundsException
	at org.apache.lucene.store.ByteArrayDataInput.readVLong(ByteArrayDataInput.java:126)
	at org.apache.lucene.codecs.memory.FSTOrdTermsReader$TermsReader$BaseTermsEnum.refillMetadata(FSTOrdTermsReader.java:393)
	at org.apache.lucene.codecs.memory.FSTOrdTermsReader$TermsReader$BaseTermsEnum.decodeMetaData(FSTOrdTermsReader.java:357)
	at org.apache.lucene.codecs.memory.FSTOrdTermsReader$TermsReader$SegmentTermsEnum.decodeMetaData(FSTOrdTermsReader.java:471)
	at org.apache.lucene.codecs.memory.FSTOrdTermsReader$TermsReader$BaseTermsEnum.docs(FSTOrdTermsReader.java:426)
	at org.apache.lucene.index.BufferedUpdatesStream.applyTermDeletes(BufferedUpdatesStream.java:418)
	at org.apache.lucene.index.BufferedUpdatesStream.applyDeletesAndUpdates(BufferedUpdatesStream.java:283)
	at org.apache.lucene.index.IndexWriter.applyAllDeletesAndUpdates(IndexWriter.java:3238)
	at org.apache.lucene.index.IndexWriter.maybeApplyDeletes(IndexWriter.java:3229)
	at org.apache.lucene.index.IndexWriter.prepareCommitInternal(IndexWriter.java:2947)
	at org.apache.lucene.index.IndexWriter.commitInternal(IndexWriter.java:3096)
	at org.apache.lucene.index.IndexWriter.commit(IndexWriter.java:3063)
	at org.apache.lucene.index.RandomIndexWriter.getReader(RandomIndexWriter.java:330)
	at org.apache.lucene.index.RandomIndexWriter.getReader(RandomIndexWriter.java:271)
	at org.apache.lucene.search.TestCachingWrapperFilter.setUp(TestCachingWrapperFilter.java:63)
	at sun.reflect.GeneratedMethodAccessor7.invoke(Unknown Source)
	at sun.reflect.DelegatingMethodAccessorImpl.invoke(DelegatingMethodAccessorImpl.java:55)
	at java.lang.reflect.Method.invoke(Method.java:619)
	at com.carrotsearch.randomizedtesting.RandomizedRunner.invoke(RandomizedRunner.java:1618)
	at com.carrotsearch.randomizedtesting.RandomizedRunner$7.evaluate(RandomizedRunner.java:861)
	at com.carrotsearch.randomizedtesting.RandomizedRunner$8.evaluate(RandomizedRunner.java:877)
	at org.apache.lucene.util.TestRuleSetupTeardownChained$1.evaluate(TestRuleSetupTeardownChained.java:50)
	at org.apache.lucene.util.TestRuleFieldCacheSanity$1.evaluate(TestRuleFieldCacheSanity.java:51)
	at org.apache.lucene.util.AbstractBeforeAfterRule$1.evaluate(AbstractBeforeAfterRule.java:46)
	at com.carrotsearch.randomizedtesting.rules.SystemPropertiesInvariantRule$1.evaluate(SystemPropertiesInvariantRule.java:55)
	at org.apache.lucene.util.TestRuleThreadAndTestName$1.evaluate(TestRuleThreadAndTestName.java:49)
	at org.apache.lucene.util.TestRuleIgnoreAfterMaxFailures$1.evaluate(TestRuleIgnoreAfterMaxFailures.java:65)
	at org.apache.lucene.util.TestRuleMarkFailure$1.evaluate(TestRuleMarkFailure.java:48)
	at com.carrotsearch.randomizedtesting.rules.StatementAdapter.evaluate(StatementAdapter.java:36)
	at com.carrotsearch.randomizedtesting.ThreadLeakControl$StatementRunner.run(ThreadLeakControl.java:360)
	at com.carrotsearch.randomizedtesting.ThreadLeakControl.forkTimeoutingTask(ThreadLeakControl.java:793)
	at com.carrotsearch.randomizedtesting.ThreadLeakControl$3.evaluate(ThreadLeakControl.java:453)
	at com.carrotsearch.randomizedtesting.RandomizedRunner.runSingleTest(RandomizedRunner.java:836)
	at com.carrotsearch.randomizedtesting.RandomizedRunner$3.evaluate(RandomizedRunner.java:738)
	at com.carrotsearch.randomizedtesting.RandomizedRunner$4.evaluate(RandomizedRunner.java:772)
	at com.carrotsearch.randomizedtesting.RandomizedRunner$5.evaluate(RandomizedRunner.java:783)
	at org.apache.lucene.util.AbstractBeforeAfterRule$1.evaluate(AbstractBeforeAfterRule.java:46)
	at org.apache.lucene.util.TestRuleStoreClassName$1.evaluate(TestRuleStoreClassName.java:42)
	at com.carrotsearch.randomizedtesting.rules.SystemPropertiesInvariantRule$1.evaluate(SystemPropertiesInvariantRule.java:55)
	at com.carrotsearch.randomizedtesting.rules.NoShadowingOrOverridesOnMethodsRule$1.evaluate(NoShadowingOrOverridesOnMethodsRule.java:39)
	at com.carrotsearch.randomizedtesting.rules.NoShadowingOrOverridesOnMethodsRule$1.evaluate(NoShadowingOrOverridesOnMethodsRule.java:39)
	at com.carrotsearch.randomizedtesting.rules.StatementAdapter.evaluate(StatementAdapter.java:36)
	at com.carrotsearch.randomizedtesting.rules.StatementAdapter.evaluate(StatementAdapter.java:36)
	at org.apache.lucene.util.TestRuleAssertionsRequired$1.evaluate(TestRuleAssertionsRequired.java:43)
	at org.apache.lucene.util.TestRuleMarkFailure$1.evaluate(TestRuleMarkFailure.java:48)
	at org.apache.lucene.util.TestRuleIgnoreAfterMaxFailures$1.evaluate(TestRuleIgnoreAfterMaxFailures.java:65)
	at org.apache.lucene.util.TestRuleIgnoreTestSuites$1.evaluate(TestRuleIgnoreTestSuites.java:55)
	at com.carrotsearch.randomizedtesting.rules.StatementAdapter.evaluate(StatementAdapter.java:36)
	at com.carrotsearch.randomizedtesting.ThreadLeakControl$StatementRunner.run(ThreadLeakControl.java:360)
	at java.lang.Thread.run(Thread.java:853)


REGRESSION:  org.apache.lucene.search.TestCachingWrapperFilter.testCachingWorks

Error Message:
bit 420 is out of bounds 0..336

Stack Trace:
java.lang.AssertionError: bit 420 is out of bounds 0..336
	at org.apache.lucene.codecs.lucene40.BitVector.get(BitVector.java:148)
	at org.apache.lucene.codecs.pulsing.PulsingPostingsReader$PulsingDocsEnum.nextDoc(PulsingPostingsReader.java:365)
	at org.apache.lucene.index.BufferedUpdatesStream.applyTermDeletes(BufferedUpdatesStream.java:423)
	at org.apache.lucene.index.BufferedUpdatesStream.applyDeletesAndUpdates(BufferedUpdatesStream.java:283)
	at org.apache.lucene.index.IndexWriter.applyAllDeletesAndUpdates(IndexWriter.java:3238)
	at org.apache.lucene.index.IndexWriter.maybeApplyDeletes(IndexWriter.java:3229)
	at org.apache.lucene.index.IndexWriter.prepareCommitInternal(IndexWriter.java:2947)
	at org.apache.lucene.index.IndexWriter.commitInternal(IndexWriter.java:3096)
	at org.apache.lucene.index.IndexWriter.commit(IndexWriter.java:3063)
	at org.apache.lucene.index.RandomIndexWriter.getReader(RandomIndexWriter.java:337)
	at org.apache.lucene.index.RandomIndexWriter.getReader(RandomIndexWriter.java:271)
	at org.apache.lucene.search.TestCachingWrapperFilter.setUp(TestCachingWrapperFilter.java:63)
	at sun.reflect.GeneratedMethodAccessor7.invoke(Unknown Source)
	at sun.reflect.DelegatingMethodAccessorImpl.invoke(DelegatingMethodAccessorImpl.java:55)
	at java.lang.reflect.Method.invoke(Method.java:619)
	at com.carrotsearch.randomizedtesting.RandomizedRunner.invoke(RandomizedRunner.java:1618)
	at com.carrotsearch.randomizedtesting.RandomizedRunner$7.evaluate(RandomizedRunner.java:861)
	at com.carrotsearch.randomizedtesting.RandomizedRunner$8.evaluate(RandomizedRunner.java:877)
	at org.apache.lucene.util.TestRuleSetupTeardownChained$1.evaluate(TestRuleSetupTeardownChained.java:50)
	at org.apache.lucene.util.TestRuleFieldCacheSanity$1.evaluate(TestRuleFieldCacheSanity.java:51)
	at org.apache.lucene.util.AbstractBeforeAfterRule$1.evaluate(AbstractBeforeAfterRule.java:46)
	at com.carrotsearch.randomizedtesting.rules.SystemPropertiesInvariantRule$1.evaluate(SystemPropertiesInvariantRule.java:55)
	at org.apache.lucene.util.TestRuleThreadAndTestName$1.evaluate(TestRuleThreadAndTestName.java:49)
	at org.apache.lucene.util.TestRuleIgnoreAfterMaxFailures$1.evaluate(TestRuleIgnoreAfterMaxFailures.java:65)
	at org.apache.lucene.util.TestRuleMarkFailure$1.evaluate(TestRuleMarkFailure.java:48)
	at com.carrotsearch.randomizedtesting.rules.StatementAdapter.evaluate(StatementAdapter.java:36)
	at com.carrotsearch.randomizedtesting.ThreadLeakControl$StatementRunner.run(ThreadLeakControl.java:360)
	at com.carrotsearch.randomizedtesting.ThreadLeakControl.forkTimeoutingTask(ThreadLeakControl.java:793)
	at com.carrotsearch.randomizedtesting.ThreadLeakControl$3.evaluate(ThreadLeakControl.java:453)
	at com.carrotsearch.randomizedtesting.RandomizedRunner.runSingleTest(RandomizedRunner.java:836)
	at com.carrotsearch.randomizedtesting.RandomizedRunner$3.evaluate(RandomizedRunner.java:738)
	at com.carrotsearch.randomizedtesting.RandomizedRunner$4.evaluate(RandomizedRunner.java:772)
	at com.carrotsearch.randomizedtesting.RandomizedRunner$5.evaluate(RandomizedRunner.java:783)
	at org.apache.lucene.util.AbstractBeforeAfterRule$1.evaluate(AbstractBeforeAfterRule.java:46)
	at org.apache.lucene.util.TestRuleStoreClassName$1.evaluate(TestRuleStoreClassName.java:42)
	at com.carrotsearch.randomizedtesting.rules.SystemPropertiesInvariantRule$1.evaluate(SystemPropertiesInvariantRule.java:55)
	at com.carrotsearch.randomizedtesting.rules.NoShadowingOrOverridesOnMethodsRule$1.evaluate(NoShadowingOrOverridesOnMethodsRule.java:39)
	at com.carrotsearch.randomizedtesting.rules.NoShadowingOrOverridesOnMethodsRule$1.evaluate(NoShadowingOrOverridesOnMethodsRule.java:39)
	at com.carrotsearch.randomizedtesting.rules.StatementAdapter.evaluate(StatementAdapter.java:36)
	at com.carrotsearch.randomizedtesting.rules.StatementAdapter.evaluate(StatementAdapter.java:36)
	at org.apache.lucene.util.TestRuleAssertionsRequired$1.evaluate(TestRuleAssertionsRequired.java:43)
	at org.apache.lucene.util.TestRuleMarkFailure$1.evaluate(TestRuleMarkFailure.java:48)
	at org.apache.lucene.util.TestRuleIgnoreAfterMaxFailures$1.evaluate(TestRuleIgnoreAfterMaxFailures.java:65)
	at org.apache.lucene.util.TestRuleIgnoreTestSuites$1.evaluate(TestRuleIgnoreTestSuites.java:55)
	at com.carrotsearch.randomizedtesting.rules.StatementAdapter.evaluate(StatementAdapter.java:36)
	at com.carrotsearch.randomizedtesting.ThreadLeakControl$StatementRunner.run(ThreadLeakControl.java:360)
	at java.lang.Thread.run(Thread.java:853)


REGRESSION:  org.apache.lucene.search.TestCachingWrapperFilter.testNullDocIdSetIterator

Error Message:


Stack Trace:
java.lang.ArrayIndexOutOfBoundsException
	at org.apache.lucene.store.ByteArrayDataInput.readVLong(ByteArrayDataInput.java:126)
	at org.apache.lucene.codecs.memory.FSTOrdTermsReader$TermsReader$BaseTermsEnum.refillMetadata(FSTOrdTermsReader.java:393)
	at org.apache.lucene.codecs.memory.FSTOrdTermsReader$TermsReader$BaseTermsEnum.decodeMetaData(FSTOrdTermsReader.java:357)
	at org.apache.lucene.codecs.memory.FSTOrdTermsReader$TermsReader$SegmentTermsEnum.decodeMetaData(FSTOrdTermsReader.java:471)
	at org.apache.lucene.codecs.memory.FSTOrdTermsReader$TermsReader$BaseTermsEnum.docs(FSTOrdTermsReader.java:426)
	at org.apache.lucene.index.BufferedUpdatesStream.applyTermDeletes(BufferedUpdatesStream.java:418)
	at org.apache.lucene.index.BufferedUpdatesStream.applyDeletesAndUpdates(BufferedUpdatesStream.java:283)
	at org.apache.lucene.index.IndexWriter.applyAllDeletesAndUpdates(IndexWriter.java:3238)
	at org.apache.lucene.index.IndexWriter.maybeApplyDeletes(IndexWriter.java:3229)
	at org.apache.lucene.index.IndexWriter.prepareCommitInternal(IndexWriter.java:2947)
	at org.apache.lucene.index.IndexWriter.commitInternal(IndexWriter.java:3096)
	at org.apache.lucene.index.IndexWriter.commit(IndexWriter.java:3063)
	at org.apache.lucene.index.RandomIndexWriter.getReader(RandomIndexWriter.java:337)
	at org.apache.lucene.index.RandomIndexWriter.getReader(RandomIndexWriter.java:271)
	at org.apache.lucene.search.TestCachingWrapperFilter.setUp(TestCachingWrapperFilter.java:63)
	at sun.reflect.GeneratedMethodAccessor7.invoke(Unknown Source)
	at sun.reflect.DelegatingMethodAccessorImpl.invoke(DelegatingMethodAccessorImpl.java:55)
	at java.lang.reflect.Method.invoke(Method.java:619)
	at com.carrotsearch.randomizedtesting.RandomizedRunner.invoke(RandomizedRunner.java:1618)
	at com.carrotsearch.randomizedtesting.RandomizedRunner$7.evaluate(RandomizedRunner.java:861)
	at com.carrotsearch.randomizedtesting.RandomizedRunner$8.evaluate(RandomizedRunner.java:877)
	at org.apache.lucene.util.TestRuleSetupTeardownChained$1.evaluate(TestRuleSetupTeardownChained.java:50)
	at org.apache.lucene.util.TestRuleFieldCacheSanity$1.evaluate(TestRuleFieldCacheSanity.java:51)
	at org.apache.lucene.util.AbstractBeforeAfterRule$1.evaluate(AbstractBeforeAfterRule.java:46)
	at com.carrotsearch.randomizedtesting.rules.SystemPropertiesInvariantRule$1.evaluate(SystemPropertiesInvariantRule.java:55)
	at org.apache.lucene.util.TestRuleThreadAndTestName$1.evaluate(TestRuleThreadAndTestName.java:49)
	at org.apache.lucene.util.TestRuleIgnoreAfterMaxFailures$1.evaluate(TestRuleIgnoreAfterMaxFailures.java:65)
	at org.apache.lucene.util.TestRuleMarkFailure$1.evaluate(TestRuleMarkFailure.java:48)
	at com.carrotsearch.randomizedtesting.rules.StatementAdapter.evaluate(StatementAdapter.java:36)
	at com.carrotsearch.randomizedtesting.ThreadLeakControl$StatementRunner.run(ThreadLeakControl.java:360)
	at com.carrotsearch.randomizedtesting.ThreadLeakControl.forkTimeoutingTask(ThreadLeakControl.java:793)
	at com.carrotsearch.randomizedtesting.ThreadLeakControl$3.evaluate(ThreadLeakControl.java:453)
	at com.carrotsearch.randomizedtesting.RandomizedRunner.runSingleTest(RandomizedRunner.java:836)
	at com.carrotsearch.randomizedtesting.RandomizedRunner$3.evaluate(RandomizedRunner.java:738)
	at com.carrotsearch.randomizedtesting.RandomizedRunner$4.evaluate(RandomizedRunner.java:772)
	at com.carrotsearch.randomizedtesting.RandomizedRunner$5.evaluate(RandomizedRunner.java:783)
	at org.apache.lucene.util.AbstractBeforeAfterRule$1.evaluate(AbstractBeforeAfterRule.java:46)
	at org.apache.lucene.util.TestRuleStoreClassName$1.evaluate(TestRuleStoreClassName.java:42)
	at com.carrotsearch.randomizedtesting.rules.SystemPropertiesInvariantRule$1.evaluate(SystemPropertiesInvariantRule.java:55)
	at com.carrotsearch.randomizedtesting.rules.NoShadowingOrOverridesOnMethodsRule$1.evaluate(NoShadowingOrOverridesOnMethodsRule.java:39)
	at com.carrotsearch.randomizedtesting.rules.NoShadowingOrOverridesOnMethodsRule$1.evaluate(NoShadowingOrOverridesOnMethodsRule.java:39)
	at com.carrotsearch.randomizedtesting.rules.StatementAdapter.evaluate(StatementAdapter.java:36)
	at com.carrotsearch.randomizedtesting.rules.StatementAdapter.evaluate(StatementAdapter.java:36)
	at org.apache.lucene.util.TestRuleAssertionsRequired$1.evaluate(TestRuleAssertionsRequired.java:43)
	at org.apache.lucene.util.TestRuleMarkFailure$1.evaluate(TestRuleMarkFailure.java:48)
	at org.apache.lucene.util.TestRuleIgnoreAfterMaxFailures$1.evaluate(TestRuleIgnoreAfterMaxFailures.java:65)
	at org.apache.lucene.util.TestRuleIgnoreTestSuites$1.evaluate(TestRuleIgnoreTestSuites.java:55)
	at com.carrotsearch.randomizedtesting.rules.StatementAdapter.evaluate(StatementAdapter.java:36)
	at com.carrotsearch.randomizedtesting.ThreadLeakControl$StatementRunner.run(ThreadLeakControl.java:360)
	at java.lang.Thread.run(Thread.java:853)


REGRESSION:  org.apache.lucene.search.TestCachingWrapperFilter.testEmpty3

Error Message:


Stack Trace:
java.lang.ArrayIndexOutOfBoundsException
	at org.apache.lucene.store.ByteArrayDataInput.readVLong(ByteArrayDataInput.java:126)
	at org.apache.lucene.codecs.memory.FSTOrdTermsReader$TermsReader$BaseTermsEnum.refillMetadata(FSTOrdTermsReader.java:393)
	at org.apache.lucene.codecs.memory.FSTOrdTermsReader$TermsReader$BaseTermsEnum.decodeMetaData(FSTOrdTermsReader.java:357)
	at org.apache.lucene.codecs.memory.FSTOrdTermsReader$TermsReader$SegmentTermsEnum.decodeMetaData(FSTOrdTermsReader.java:471)
	at org.apache.lucene.codecs.memory.FSTOrdTermsReader$TermsReader$BaseTermsEnum.docs(FSTOrdTermsReader.java:426)
	at org.apache.lucene.index.BufferedUpdatesStream.applyTermDeletes(BufferedUpdatesStream.java:418)
	at org.apache.lucene.index.BufferedUpdatesStream.applyDeletesAndUpdates(BufferedUpdatesStream.java:283)
	at org.apache.lucene.index.IndexWriter.applyAllDeletesAndUpdates(IndexWriter.java:3238)
	at org.apache.lucene.index.IndexWriter.maybeApplyDeletes(IndexWriter.java:3229)
	at org.apache.lucene.index.IndexWriter.getReader(IndexWriter.java:384)
	at org.apache.lucene.index.RandomIndexWriter.getReader(RandomIndexWriter.java:332)
	at org.apache.lucene.index.RandomIndexWriter.getReader(RandomIndexWriter.java:271)
	at org.apache.lucene.search.TestCachingWrapperFilter.setUp(TestCachingWrapperFilter.java:63)
	at sun.reflect.GeneratedMethodAccessor7.invoke(Unknown Source)
	at sun.reflect.DelegatingMethodAccessorImpl.invoke(DelegatingMethodAccessorImpl.java:55)
	at java.lang.reflect.Method.invoke(Method.java:619)
	at com.carrotsearch.randomizedtesting.RandomizedRunner.invoke(RandomizedRunner.java:1618)
	at com.carrotsearch.randomizedtesting.RandomizedRunner$7.evaluate(RandomizedRunner.java:861)
	at com.carrotsearch.randomizedtesting.RandomizedRunner$8.evaluate(RandomizedRunner.java:877)
	at org.apache.lucene.util.TestRuleSetupTeardownChained$1.evaluate(TestRuleSetupTeardownChained.java:50)
	at org.apache.lucene.util.TestRuleFieldCacheSanity$1.evaluate(TestRuleFieldCacheSanity.java:51)
	at org.apache.lucene.util.AbstractBeforeAfterRule$1.evaluate(AbstractBeforeAfterRule.java:46)
	at com.carrotsearch.randomizedtesting.rules.SystemPropertiesInvariantRule$1.evaluate(SystemPropertiesInvariantRule.java:55)
	at org.apache.lucene.util.TestRuleThreadAndTestName$1.evaluate(TestRuleThreadAndTestName.java:49)
	at org.apache.lucene.util.TestRuleIgnoreAfterMaxFailures$1.evaluate(TestRuleIgnoreAfterMaxFailures.java:65)
	at org.apache.lucene.util.TestRuleMarkFailure$1.evaluate(TestRuleMarkFailure.java:48)
	at com.carrotsearch.randomizedtesting.rules.StatementAdapter.evaluate(StatementAdapter.java:36)
	at com.carrotsearch.randomizedtesting.ThreadLeakControl$StatementRunner.run(ThreadLeakControl.java:360)
	at com.carrotsearch.randomizedtesting.ThreadLeakControl.forkTimeoutingTask(ThreadLeakControl.java:793)
	at com.carrotsearch.randomizedtesting.ThreadLeakControl$3.evaluate(ThreadLeakControl.java:453)
	at com.carrotsearch.randomizedtesting.RandomizedRunner.runSingleTest(RandomizedRunner.java:836)
	at com.carrotsearch.randomizedtesting.RandomizedRunner$3.evaluate(RandomizedRunner.java:738)
	at com.carrotsearch.randomizedtesting.RandomizedRunner$4.evaluate(RandomizedRunner.java:772)
	at com.carrotsearch.randomizedtesting.RandomizedRunner$5.evaluate(RandomizedRunner.java:783)
	at org.apache.lucene.util.AbstractBeforeAfterRule$1.evaluate(AbstractBeforeAfterRule.java:46)
	at org.apache.lucene.util.TestRuleStoreClassName$1.evaluate(TestRuleStoreClassName.java:42)
	at com.carrotsearch.randomizedtesting.rules.SystemPropertiesInvariantRule$1.evaluate(SystemPropertiesInvariantRule.java:55)
	at com.carrotsearch.randomizedtesting.rules.NoShadowingOrOverridesOnMethodsRule$1.evaluate(NoShadowingOrOverridesOnMethodsRule.java:39)
	at com.carrotsearch.randomizedtesting.rules.NoShadowingOrOverridesOnMethodsRule$1.evaluate(NoShadowingOrOverridesOnMethodsRule.java:39)
	at com.carrotsearch.randomizedtesting.rules.StatementAdapter.evaluate(StatementAdapter.java:36)
	at com.carrotsearch.randomizedtesting.rules.StatementAdapter.evaluate(StatementAdapter.java:36)
	at org.apache.lucene.util.TestRuleAssertionsRequired$1.evaluate(TestRuleAssertionsRequired.java:43)
	at org.apache.lucene.util.TestRuleMarkFailure$1.evaluate(TestRuleMarkFailure.java:48)
	at org.apache.lucene.util.TestRuleIgnoreAfterMaxFailures$1.evaluate(TestRuleIgnoreAfterMaxFailures.java:65)
	at org.apache.lucene.util.TestRuleIgnoreTestSuites$1.evaluate(TestRuleIgnoreTestSuites.java:55)
	at com.carrotsearch.randomizedtesting.rules.StatementAdapter.evaluate(StatementAdapter.java:36)
	at com.carrotsearch.randomizedtesting.ThreadLeakControl$StatementRunner.run(ThreadLeakControl.java:360)
	at java.lang.Thread.run(Thread.java:853)


REGRESSION:  org.apache.lucene.search.TestCachingWrapperFilter.testNullDocIdSet

Error Message:
CheckIndex failed

Stack Trace:
java.lang.RuntimeException: CheckIndex failed
	at __randomizedtesting.SeedInfo.seed([980F06D8400C8C98:EE5F53D26386F99A]:0)
	at org.apache.lucene.util.TestUtil.checkIndex(TestUtil.java:203)
	at org.apache.lucene.store.MockDirectoryWrapper.close(MockDirectoryWrapper.java:691)
	at org.apache.lucene.util.IOUtils.close(IOUtils.java:77)
	at org.apache.lucene.search.TestCachingWrapperFilter.tearDown(TestCachingWrapperFilter.java:69)
	at sun.reflect.GeneratedMethodAccessor8.invoke(Unknown Source)
	at sun.reflect.DelegatingMethodAccessorImpl.invoke(DelegatingMethodAccessorImpl.java:55)
	at java.lang.reflect.Method.invoke(Method.java:619)
	at com.carrotsearch.randomizedtesting.RandomizedRunner.invoke(RandomizedRunner.java:1618)
	at com.carrotsearch.randomizedtesting.RandomizedRunner$8.evaluate(RandomizedRunner.java:885)
	at org.apache.lucene.util.TestRuleSetupTeardownChained$1.evaluate(TestRuleSetupTeardownChained.java:50)
	at org.apache.lucene.util.TestRuleFieldCacheSanity$1.evaluate(TestRuleFieldCacheSanity.java:51)
	at org.apache.lucene.util.AbstractBeforeAfterRule$1.evaluate(AbstractBeforeAfterRule.java:46)
	at com.carrotsearch.randomizedtesting.rules.SystemPropertiesInvariantRule$1.evaluate(SystemPropertiesInvariantRule.java:55)
	at org.apache.lucene.util.TestRuleThreadAndTestName$1.evaluate(TestRuleThreadAndTestName.java:49)
	at org.apache.lucene.util.TestRuleIgnoreAfterMaxFailures$1.evaluate(TestRuleIgnoreAfterMaxFailures.java:65)
	at org.apache.lucene.util.TestRuleMarkFailure$1.evaluate(TestRuleMarkFailure.java:48)
	at com.carrotsearch.randomizedtesting.rules.StatementAdapter.evaluate(StatementAdapter.java:36)
	at com.carrotsearch.randomizedtesting.ThreadLeakControl$StatementRunner.run(ThreadLeakControl.java:360)
	at com.carrotsearch.randomizedtesting.ThreadLeakControl.forkTimeoutingTask(ThreadLeakControl.java:793)
	at com.carrotsearch.randomizedtesting.ThreadLeakControl$3.evaluate(ThreadLeakControl.java:453)
	at com.carrotsearch.randomizedtesting.RandomizedRunner.runSingleTest(RandomizedRunner.java:836)
	at com.carrotsearch.randomizedtesting.RandomizedRunner$3.evaluate(RandomizedRunner.java:738)
	at com.carrotsearch.randomizedtesting.RandomizedRunner$4.evaluate(RandomizedRunner.java:772)
	at com.carrotsearch.randomizedtesting.RandomizedRunner$5.evaluate(RandomizedRunner.java:783)
	at org.apache.lucene.util.AbstractBeforeAfterRule$1.evaluate(AbstractBeforeAfterRule.java:46)
	at org.apache.lucene.util.TestRuleStoreClassName$1.evaluate(TestRuleStoreClassName.java:42)
	at com.carrotsearch.randomizedtesting.rules.SystemPropertiesInvariantRule$1.evaluate(SystemPropertiesInvariantRule.java:55)
	at com.carrotsearch.randomizedtesting.rules.NoShadowingOrOverridesOnMethodsRule$1.evaluate(NoShadowingOrOverridesOnMethodsRule.java:39)
	at com.carrotsearch.randomizedtesting.rules.NoShadowingOrOverridesOnMethodsRule$1.evaluate(NoShadowingOrOverridesOnMethodsRule.java:39)
	at com.carrotsearch.randomizedtesting.rules.StatementAdapter.evaluate(StatementAdapter.java:36)
	at com.carrotsearch.randomizedtesting.rules.StatementAdapter.evaluate(StatementAdapter.java:36)
	at org.apache.lucene.util.TestRuleAssertionsRequired$1.evaluate(TestRuleAssertionsRequired.java:43)
	at org.apache.lucene.util.TestRuleMarkFailure$1.evaluate(TestRuleMarkFailure.java:48)
	at org.apache.lucene.util.TestRuleIgnoreAfterMaxFailures$1.evaluate(TestRuleIgnoreAfterMaxFailures.java:65)
	at org.apache.lucene.util.TestRuleIgnoreTestSuites$1.evaluate(TestRuleIgnoreTestSuites.java:55)
	at com.carrotsearch.randomizedtesting.rules.StatementAdapter.evaluate(StatementAdapter.java:36)
	at com.carrotsearch.randomizedtesting.ThreadLeakControl$StatementRunner.run(ThreadLeakControl.java:360)
	at java.lang.Thread.run(Thread.java:853)


REGRESSION:  org.apache.lucene.search.TestCachingWrapperFilter.testSingle

Error Message:


Stack Trace:
java.lang.ArrayIndexOutOfBoundsException
	at org.apache.lucene.store.ByteArrayDataInput.readVLong(ByteArrayDataInput.java:126)
	at org.apache.lucene.codecs.memory.FSTOrdTermsReader$TermsReader$BaseTermsEnum.refillMetadata(FSTOrdTermsReader.java:393)
	at org.apache.lucene.codecs.memory.FSTOrdTermsReader$TermsReader$BaseTermsEnum.decodeMetaData(FSTOrdTermsReader.java:357)
	at org.apache.lucene.codecs.memory.FSTOrdTermsReader$TermsReader$SegmentTermsEnum.decodeMetaData(FSTOrdTermsReader.java:471)
	at org.apache.lucene.codecs.memory.FSTOrdTermsReader$TermsReader$BaseTermsEnum.docs(FSTOrdTermsReader.java:426)
	at org.apache.lucene.index.BufferedUpdatesStream.applyTermDeletes(BufferedUpdatesStream.java:418)
	at org.apache.lucene.index.BufferedUpdatesStream.applyDeletesAndUpdates(BufferedUpdatesStream.java:283)
	at org.apache.lucene.index.IndexWriter.applyAllDeletesAndUpdates(IndexWriter.java:3238)
	at org.apache.lucene.index.IndexWriter.maybeApplyDeletes(IndexWriter.java:3229)
	at org.apache.lucene.index.IndexWriter.prepareCommitInternal(IndexWriter.java:2947)
	at org.apache.lucene.index.IndexWriter.commitInternal(IndexWriter.java:3096)
	at org.apache.lucene.index.IndexWriter.commit(IndexWriter.java:3063)
	at org.apache.lucene.index.RandomIndexWriter.getReader(RandomIndexWriter.java:337)
	at org.apache.lucene.index.RandomIndexWriter.getReader(RandomIndexWriter.java:271)
	at org.apache.lucene.search.TestCachingWrapperFilter.setUp(TestCachingWrapperFilter.java:63)
	at sun.reflect.GeneratedMethodAccessor7.invoke(Unknown Source)
	at sun.reflect.DelegatingMethodAccessorImpl.invoke(DelegatingMethodAccessorImpl.java:55)
	at java.lang.reflect.Method.invoke(Method.java:619)
	at com.carrotsearch.randomizedtesting.RandomizedRunner.invoke(RandomizedRunner.java:1618)
	at com.carrotsearch.randomizedtesting.RandomizedRunner$7.evaluate(RandomizedRunner.java:861)
	at com.carrotsearch.randomizedtesting.RandomizedRunner$8.evaluate(RandomizedRunner.java:877)
	at org.apache.lucene.util.TestRuleSetupTeardownChained$1.evaluate(TestRuleSetupTeardownChained.java:50)
	at org.apache.lucene.util.TestRuleFieldCacheSanity$1.evaluate(TestRuleFieldCacheSanity.java:51)
	at org.apache.lucene.util.AbstractBeforeAfterRule$1.evaluate(AbstractBeforeAfterRule.java:46)
	at com.carrotsearch.randomizedtesting.rules.SystemPropertiesInvariantRule$1.evaluate(SystemPropertiesInvariantRule.java:55)
	at org.apache.lucene.util.TestRuleThreadAndTestName$1.evaluate(TestRuleThreadAndTestName.java:49)
	at org.apache.lucene.util.TestRuleIgnoreAfterMaxFailures$1.evaluate(TestRuleIgnoreAfterMaxFailures.java:65)
	at org.apache.lucene.util.TestRuleMarkFailure$1.evaluate(TestRuleMarkFailure.java:48)
	at com.carrotsearch.randomizedtesting.rules.StatementAdapter.evaluate(StatementAdapter.java:36)
	at com.carrotsearch.randomizedtesting.ThreadLeakControl$StatementRunner.run(ThreadLeakControl.java:360)
	at com.carrotsearch.randomizedtesting.ThreadLeakControl.forkTimeoutingTask(ThreadLeakControl.java:793)
	at com.carrotsearch.randomizedtesting.ThreadLeakControl$3.evaluate(ThreadLeakControl.java:453)
	at com.carrotsearch.randomizedtesting.RandomizedRunner.runSingleTest(RandomizedRunner.java:836)
	at com.carrotsearch.randomizedtesting.RandomizedRunner$3.evaluate(RandomizedRunner.java:738)
	at com.carrotsearch.randomizedtesting.RandomizedRunner$4.evaluate(RandomizedRunner.java:772)
	at com.carrotsearch.randomizedtesting.RandomizedRunner$5.evaluate(RandomizedRunner.java:783)
	at org.apache.lucene.util.AbstractBeforeAfterRule$1.evaluate(AbstractBeforeAfterRule.java:46)
	at org.apache.lucene.util.TestRuleStoreClassName$1.evaluate(TestRuleStoreClassName.java:42)
	at com.carrotsearch.randomizedtesting.rules.SystemPropertiesInvariantRule$1.evaluate(SystemPropertiesInvariantRule.java:55)
	at com.carrotsearch.randomizedtesting.rules.NoShadowingOrOverridesOnMethodsRule$1.evaluate(NoShadowingOrOverridesOnMethodsRule.java:39)
	at com.carrotsearch.randomizedtesting.rules.NoShadowingOrOverridesOnMethodsRule$1.evaluate(NoShadowingOrOverridesOnMethodsRule.java:39)
	at com.carrotsearch.randomizedtesting.rules.StatementAdapter.evaluate(StatementAdapter.java:36)
	at com.carrotsearch.randomizedtesting.rules.StatementAdapter.evaluate(StatementAdapter.java:36)
	at org.apache.lucene.util.TestRuleAssertionsRequired$1.evaluate(TestRuleAssertionsRequired.java:43)
	at org.apache.lucene.util.TestRuleMarkFailure$1.evaluate(TestRuleMarkFailure.java:48)
	at org.apache.lucene.util.TestRuleIgnoreAfterMaxFailures$1.evaluate(TestRuleIgnoreAfterMaxFailures.java:65)
	at org.apache.lucene.util.TestRuleIgnoreTestSuites$1.evaluate(TestRuleIgnoreTestSuites.java:55)
	at com.carrotsearch.randomizedtesting.rules.StatementAdapter.evaluate(StatementAdapter.java:36)
	at com.carrotsearch.randomizedtesting.ThreadLeakControl$StatementRunner.run(ThreadLeakControl.java:360)
	at java.lang.Thread.run(Thread.java:853)




Build Log:
[...truncated 908 lines...]
   [junit4] Suite: org.apache.lucene.codecs.perfield.TestPerFieldDocValuesFormat
   [junit4] IGNOR/A 0.01s J1 | TestPerFieldDocValuesFormat.testHugeBinaryValueLimit
   [junit4]    > Assumption #1: test requires codec with limits on max binary field length
   [junit4]   2> NOTE: reproduce with: ant test  -Dtestcase=TestPerFieldDocValuesFormat -Dtests.method=testSortedVariableLengthVsFieldCache -Dtests.seed=980F06D8400C8C98 -Dtests.multiplier=3 -Dtests.slow=true -Dtests.locale=sk_SK -Dtests.timezone=US/Alaska -Dtests.file.encoding=UTF-8
   [junit4] ERROR   4.42s J1 | TestPerFieldDocValuesFormat.testSortedVariableLengthVsFieldCache <<<
   [junit4]    > Throwable #1: java.lang.ArrayIndexOutOfBoundsException
   [junit4]    > 	at org.apache.lucene.store.ByteArrayDataInput.readVInt(ByteArrayDataInput.java:105)
   [junit4]    > 	at org.apache.lucene.codecs.pulsing.PulsingPostingsReader$PulsingDocsEnum.nextDoc(PulsingPostingsReader.java:324)
   [junit4]    > 	at org.apache.lucene.search.FieldCacheImpl$SortedDocValuesCache.createValue(FieldCacheImpl.java:1240)
   [junit4]    > 	at org.apache.lucene.search.FieldCacheImpl$Cache.get(FieldCacheImpl.java:211)
   [junit4]    > 	at org.apache.lucene.search.FieldCacheImpl.getTermsIndex(FieldCacheImpl.java:1165)
   [junit4]    > 	at org.apache.lucene.search.FieldCacheImpl.getTermsIndex(FieldCacheImpl.java:1145)
   [junit4]    > 	at org.apache.lucene.index.BaseDocValuesFormatTestCase.doTestSortedVsFieldCache(BaseDocValuesFormatTestCase.java:1581)
   [junit4]    > 	at org.apache.lucene.index.BaseDocValuesFormatTestCase.testSortedVariableLengthVsFieldCache(BaseDocValuesFormatTestCase.java:1608)
   [junit4]    > 	at java.lang.Thread.run(Thread.java:853)Throwable #2: com.carrotsearch.randomizedtesting.UncaughtExceptionError: Captured an uncaught exception in thread: Thread[id=1789, name=Lucene Merge Thread #7, state=RUNNABLE, group=TGRP-TestPerFieldDocValuesFormat]
   [junit4]    > Caused by: org.apache.lucene.index.MergePolicy$MergeException: java.lang.AssertionError: bit 92 is out of bounds 0..48
   [junit4]    > 	at __randomizedtesting.SeedInfo.seed([980F06D8400C8C98]:0)
   [junit4]    > 	at org.apache.lucene.index.ConcurrentMergeScheduler.handleMergeException(ConcurrentMergeScheduler.java:545)
   [junit4]    > 	at org.apache.lucene.index.ConcurrentMergeScheduler$MergeThread.run(ConcurrentMergeScheduler.java:518)
   [junit4]    > Caused by: java.lang.AssertionError: bit 92 is out of bounds 0..48
   [junit4]    > 	at org.apache.lucene.codecs.lucene40.BitVector.get(BitVector.java:148)
   [junit4]    > 	at org.apache.lucene.index.MergeState$DocMap$1.get(MergeState.java:87)
   [junit4]    > 	at org.apache.lucene.codecs.MappingMultiDocsEnum.nextDoc(MappingMultiDocsEnum.java:107)
   [junit4]    > 	at org.apache.lucene.codecs.PostingsConsumer.merge(PostingsConsumer.java:83)
   [junit4]    > 	at org.apache.lucene.codecs.TermsConsumer.merge(TermsConsumer.java:110)
   [junit4]    > 	at org.apache.lucene.codecs.FieldsConsumer.merge(FieldsConsumer.java:72)
   [junit4]    > 	at org.apache.lucene.index.SegmentMerger.mergeTerms(SegmentMerger.java:389)
   [junit4]    > 	at org.apache.lucene.index.SegmentMerger.merge(SegmentMerger.java:112)
   [junit4]    > 	at org.apache.lucene.index.IndexWriter.mergeMiddle(IndexWriter.java:4132)
   [junit4]    > 	at org.apache.lucene.index.IndexWriter.merge(IndexWriter.java:3728)
   [junit4]    > 	at org.apache.lucene.index.ConcurrentMergeScheduler.doMerge(ConcurrentMergeScheduler.java:405)
   [junit4]    > 	at org.apache.lucene.index.ConcurrentMergeScheduler$MergeThread.run(ConcurrentMergeScheduler.java:482)
   [junit4]   1> CheckIndex failed
   [junit4]   1> Segments file=segments_15 numSegments=35 version=4.8 format=
   [junit4]   1>   1 of 35: name=_0 docCount=3
   [junit4]   1>     codec=Lucene46
   [junit4]   1>     compound=true
   [junit4]   1>     numFiles=4
   [junit4]   1>     size (MB)=0.002
   [junit4]   1>     diagnostics = {lucene.version=4.8-SNAPSHOT, os=Linux, os.arch=x86, os.version=3.8.0-39-generic, java.vendor=IBM Corporation, source=flush, java.version=1.7.0, timestamp=1399781590374}
   [junit4]   1>     has deletions [delGen=1]
   [junit4]   1>     test: open reader.........OK
   [junit4]   1>     test: check integrity.....OK
   [junit4]   1>     test: check live docs.....OK [1 deleted docs]
   [junit4]   1>     test: fields..............OK [3 fields]
   [junit4]   1>     test: field norms.........OK [0 fields]
   [junit4]   1>     test: terms, freq, prox...OK [4 terms; 4 terms/docs pairs; 0 tokens]
   [junit4]   1>     test (ignoring deletes): terms, freq, prox...OK [6 terms; 6 terms/docs pairs; 0 tokens]
   [junit4]   1>     test: stored fields.......OK [2 total field count; avg 1 fields per doc]
   [junit4]   1>     test: term vectors........OK [0 total vector count; avg 0 term/freq vector fields per doc]
   [junit4]   1>     test: docvalues...........OK [1 docvalues fields; 0 BINARY; 1 NUMERIC; 0 SORTED; 0 SORTED_SET]
   [junit4]   1> 
   [junit4]   1>   2 of 35: name=_1 docCount=77
   [junit4]   1>     codec=Lucene46
   [junit4]   1>     compound=true
   [junit4]   1>     numFiles=4
   [junit4]   1>     size (MB)=0.004
   [junit4]   1>     diagnostics = {lucene.version=4.8-SNAPSHOT, os=Linux, os.arch=x86, os.version=3.8.0-39-generic, java.vendor=IBM Corporation, source=flush, java.version=1.7.0, timestamp=1399781590376}
   [junit4]   1>     has deletions [delGen=1]
   [junit4]   1>     test: open reader.........OK
   [junit4]   1>     test: check integrity.....OK
   [junit4]   1>     test: check live docs.....OK [1 deleted docs]
   [junit4]   1>     test: fields..............OK [3 fields]
   [junit4]   1>     test: field norms.........OK [0 fields]
   [junit4]   1>     test: terms, freq, prox...ERROR: java.lang.ArrayIndexOutOfBoundsException
   [junit4]   1> java.lang.ArrayIndexOutOfBoundsException
   [junit4]   1> 	at org.apache.lucene.store.ByteArrayDataInput.readVLong(ByteArrayDataInput.java:126)
   [junit4]   1> 	at org.apache.lucene.codecs.memory.FSTOrdTermsReader$TermsReader$BaseTermsEnum.refillMetadata(FSTOrdTermsReader.java:390)
   [junit4]   1> 	at org.apache.lucene.codecs.memory.FSTOrdTermsReader$TermsReader$BaseTermsEnum.decodeMetaData(FSTOrdTermsReader.java:357)
   [junit4]   1> 	at org.apache.lucene.codecs.memory.FSTOrdTermsReader$TermsReader$SegmentTermsEnum.decodeMetaData(FSTOrdTermsReader.java:471)
   [junit4]   1> 	at org.apache.lucene.codecs.memory.FSTOrdTermsReader$TermsReader$BaseTermsEnum.docs(FSTOrdTermsReader.java:426)
   [junit4]   1> 	at org.apache.lucene.index.TermsEnum.docs(TermsEnum.java:149)
   [junit4]   1> 	at org.apache.lucene.index.CheckIndex.checkFields(CheckIndex.java:848)
   [junit4]   1> 	at org.apache.lucene.index.CheckIndex.testPostings(CheckIndex.java:1278)
   [junit4]   1> 	at org.apache.lucene.index.CheckIndex.checkIndex(CheckIndex.java:626)
   [junit4]   1> 	at org.apache.lucene.util.TestUtil.checkIndex(TestUtil.java:199)
   [junit4]   1> 	at org.apache.lucene.store.MockDirectoryWrapper.close(MockDirectoryWrapper.java:691)
   [junit4]   1> 	at org.apache.lucene.index.BaseDocValuesFormatTestCase.doTestNumericsVsStoredFields(BaseDocValuesFormatTestCase.java:1278)
   [junit4]   1> 	at org.apache.lucene.index.BaseDocValuesFormatTestCase.doTestNumericsVsStoredFields(BaseDocValuesFormatTestCase.java:1218)
   [junit4]   1> 	at org.apache.lucene.index.BaseDocValuesFormatTestCase.testByteNumericsVsStoredFields(BaseDocValuesFormatTestCase.java:1358)
   [junit4]   1> 	at sun.reflect.NativeMethodAccessorImpl.invoke0(Native Method)
   [junit4]   1> 	at sun.reflect.NativeMethodAccessorImpl.invoke(NativeMethodAccessorImpl.java:94)
   [junit4]   1> 	at sun.reflect.DelegatingMethodAccessorImpl.invoke(DelegatingMethodAccessorImpl.java:55)
   [junit4]   1> 	at java.lang.reflect.Method.invoke(Method.java:619)
   [junit4]   1> 	at com.carrotsearch.randomizedtesting.RandomizedRunner.invoke(RandomizedRunner.java:1618)
   [junit4]   1> 	at com.carrotsearch.randomizedtesting.RandomizedRunner$6.evaluate(RandomizedRunner.java:827)
   [junit4]   1> 	at com.carrotsearch.randomizedtesting.RandomizedRunner$7.evaluate(RandomizedRunner.java:863)
   [junit4]   1> 	at com.carrotsearch.randomizedtesting.RandomizedRunner$8.evaluate(RandomizedRunner.java:877)
   [junit4]   1> 	at org.apache.lucene.util.TestRuleSetupTeardownChained$1.evaluate(TestRuleSetupTeardownChained.java:50)
   [junit4]   1> 	at org.apache.lucene.util.TestRuleFieldCacheSanity$1.evaluate(TestRuleFieldCacheSanity.java:51)
   [junit4]   1> 	at org.apache.lucene.util.AbstractBeforeAfterRule$1.evaluate(AbstractBeforeAfterRule.java:46)
   [junit4]   1> 	at com.carrotsearch.randomizedtesting.rules.SystemPropertiesInvariantRule$1.evaluate(SystemPropertiesInvariantRule.java:55)
   [junit4]   1> 	at org.apache.lucene.util.TestRuleThreadAndTestName$1.evaluate(TestRuleThreadAndTestName.java:49)
   [junit4]   1> 	at org.apache.lucene.util.TestRuleIgnoreAfterMaxFailures$1.evaluate(TestRuleIgnoreAfterMaxFailures.java:65)
   [junit4]   1> 	at org.apache.lucene.util.TestRuleMarkFailure$1.evaluate(TestRuleMarkFailure.java:48)
   [junit4]   1> 	at com.carrotsearch.randomizedtesting.rules.StatementAdapter.evaluate(StatementAdapter.java:36)
   [junit4]   1> 	at com.carrotsearch.randomizedtesting.ThreadLeakControl$StatementRunner.run(ThreadLeakControl.java:360)
   [junit4]   1> 	at com.carrotsearch.randomizedtesting.ThreadLeakControl.forkTimeoutingTask(ThreadLeakControl.java:793)
   [junit4]   1> 	at com.carrotsearch.randomizedtesting.ThreadLeakControl$3.evaluate(ThreadLeakControl.java:453)
   [junit4]   1> 	at com.carrotsearch.randomizedtesting.RandomizedRunner.runSingleTest(RandomizedRunner.java:836)
   [junit4]   1> 	at com.carrotsearch.randomizedtesting.RandomizedRunner$3.evaluate(RandomizedRunner.java:738)
   [junit4]   1> 	at com.carrotsearch.randomizedtesting.RandomizedRunner$4.evaluate(RandomizedRunner.java:772)
   [junit4]   1> 	at com.carrotsearch.randomizedtesting.RandomizedRunner$5.evaluate(RandomizedRunner.java:783)
   [junit4]   1> 	at org.apache.lucene.util.AbstractBeforeAfterRule$1.evaluate(AbstractBeforeAfterRule.java:46)
   [junit4]   1> 	at org.apache.lucene.util.TestRuleStoreClassName$1.evaluate(TestRuleStoreClassName.java:42)
   [junit4]   1> 	at com.carrotsearch.randomizedtesting.rules.SystemPropertiesInvariantRule$1.evaluate(SystemPropertiesInvariantRule.java:55)
   [junit4]   1> 	at com.carrotsearch.randomizedtesting.rules.NoShadowingOrOverridesOnMethodsRule$1.evaluate(NoShadowingOrOverridesOnMethodsRule.java:39)
   [junit4]   1> 	at com.carrotsearch.randomizedtesting.rules.NoShadowingOrOverridesOnMethodsRule$1.evaluate(NoShadowingOrOverridesOnMethodsRule.java:39)
   [junit4]   1> 	at com.carrotsearch.randomizedtesting.rules.StatementAdapter.evaluate(StatementAdapter.java:36)
   [junit4]   1> 	at com.carrotsearch.randomizedtesting.rules.StatementAdapter.evaluate(StatementAdapter.java:36)
   [junit4]   1> 	at org.apache.lucene.util.TestRuleAssertionsRequired$1.evaluate(TestRuleAssertionsRequired.java:43)
   [junit4]   1> 	at org.apache.lucene.util.TestRuleMarkFailure$1.evaluate(TestRuleMarkFailure.java:48)
   [junit4]   1> 	at org.apache.lucene.util.TestRuleIgnoreAfterMaxFailures$1.evaluate(TestRuleIgnoreAfterMaxFailures.java:65)
   [junit4]   1> 	at org.apache.lucene.util.TestRuleIgnoreTestSuites$1.evaluate(TestRuleIgnoreTestSuites.java:55)
   [junit4]   1> 	at com.carrotsearch.randomizedtesting.rules.StatementAdapter.evaluate(StatementAdapter.java:36)
   [junit4]   1> 	at com.carrotsearch.randomizedtesting.ThreadLeakControl$StatementRunner.run(ThreadLeakControl.java:360)
   [junit4]   1> 	at java.lang.Thread.run(Thread.java:853)
   [junit4]   1>     test: stored fields.......OK [76 total field count; avg 1 fields per doc]
   [junit4]   1>     test: term vectors........OK [0 total vector count; avg 0 term/freq vector fields per doc]
   [junit4]   1>     test: docvalues...........OK [1 docvalues fields; 0 BINARY; 1 NUMERIC; 0 SORTED; 0 SORTED_SET]
   [junit4]   1> FAILED
   [junit4]   1>     WARNING: fixIndex() would remove reference to this segment; full exception:
   [junit4]   1> java.lang.RuntimeException: Term Index test failed
   [junit4]   1> 	at org.apache.lucene.index.CheckIndex.checkIndex(CheckIndex.java:641)
   [junit4]   1> 	at org.apache.lucene.util.TestUtil.checkIndex(TestUtil.java:199)
   [junit4]   1> 	at org.apache.lucene.store.MockDirectoryWrapper.close(MockDirectoryWrapper.java:691)
   [junit4]   1> 	at org.apache.lucene.index.BaseDocValuesFormatTestCase.doTestNumericsVsStoredFields(BaseDocValuesFormatTestCase.java:1278)
   [junit4]   1> 	at org.apache.lucene.index.BaseDocValuesFormatTestCase.doTestNumericsVsStoredFields(BaseDocValuesFormatTestCase.java:1218)
   [junit4]   1> 	at org.apache.lucene.index.BaseDocValuesFormatTestCase.testByteNumericsVsStoredFields(BaseDocValuesFormatTestCase.java:1358)
   [junit4]   1> 	at sun.reflect.NativeMethodAccessorImpl.invoke0(Native Method)
   [junit4]   1> 	at sun.reflect.NativeMethodAccessorImpl.invoke(NativeMethodAccessorImpl.java:94)
   [junit4]   1> 	at sun.reflect.DelegatingMethodAccessorImpl.invoke(DelegatingMethodAccessorImpl.java:55)
   [junit4]   1> 	at java.lang.reflect.Method.invoke(Method.java:619)
   [junit4]   1> 	at com.carrotsearch.randomizedtesting.RandomizedRunner.invoke(RandomizedRunner.java:1618)
   [junit4]   1> 	at com.carrotsearch.randomizedtesting.RandomizedRunner$6.evaluate(RandomizedRunner.java:827)
   [junit4]   1> 	at com.carrotsearch.randomizedtesting.RandomizedRunner$7.evaluate(RandomizedRunner.java:863)
   [junit4]   1> 	at com.carrotsearch.randomizedtesting.RandomizedRunner$8.evaluate(RandomizedRunner.java:877)
   [junit4]   1> 	at org.apache.lucene.util.TestRuleSetupTeardownChained$1.evaluate(TestRuleSetupTeardownChained.java:50)
   [junit4]   1> 	at org.apache.lucene.util.TestRuleFieldCacheSanity$1.evaluate(TestRuleFieldCacheSanity.java:51)
   [junit4]   1> 	at org.apache.lucene.util.AbstractBeforeAfterRule$1.evaluate(AbstractBeforeAfterRule.java:46)
   [junit4]   1> 	at com.carrotsearch.randomizedtesting.rules.SystemPropertiesInvariantRule$1.evaluate(SystemPropertiesInvariantRule.java:55)
   [junit4]   1> 	at org.apache.lucene.util.TestRuleThreadAndTestName$1.evaluate(TestRuleThreadAndTestName.java:49)
   [junit4]   1> 	at org.apache.lucene.util.TestRuleIgnoreAfterMaxFailures$1.evaluate(TestRuleIgnoreAfterMaxFailures.java:65)
   [junit4]   1> 	at org.apache.lucene.util.TestRuleMarkFailure$1.evaluate(TestRuleMarkFailure.java:48)
   [junit4]   1> 	at com.carrotsearch.randomizedtesting.rules.StatementAdapter.evaluate(StatementAdapter.java:36)
   [junit4]   1> 	at com.carrotsearch.randomizedtesting.ThreadLeakControl$StatementRunner.run(ThreadLeakControl.java:360)
   [junit4]   1> 	at com.carrotsearch.randomizedtesting.ThreadLeakControl.forkTimeoutingTask(ThreadLeakControl.java:793)
   [junit4]   1> 	at com.carrotsearch.randomizedtesting.ThreadLeakControl$3.evaluate(ThreadLeakControl.java:453)
   [junit4]   1> 	at com.carrotsearch.randomizedtesting.RandomizedRunner.runSingleTest(RandomizedRunner.java:836)
   [junit4]   1> 	at com.carrotsearch.randomizedtesting.RandomizedRunner$3.evaluate(RandomizedRunner.java:738)
   [junit4]   1> 	at com.carrotsearch.randomizedtesting.RandomizedRunner$4.evaluate(RandomizedRunner.java:772)
   [junit4]   1> 	at com.carrotsearch.randomizedtesting.RandomizedRunner$5.evaluate(RandomizedRunner.java:783)
   [junit4]   1> 	at org.apache.lucene.util.AbstractBeforeAfterRule$1.evaluate(AbstractBeforeAfterRule.java:46)
   [junit4]   1> 	at org.apache.lucene.util.TestRuleStoreClassName$1.evaluate(TestRuleStoreClassName.java:42)
   [junit4]   1> 	at com.carrotsearch.randomizedtesting.rules.SystemPropertiesInvariantRule$1.evaluate(SystemPropertiesInvariantRule.java:55)
   [junit4]   1> 	at com.carrotsearch.randomizedtesting.rules.NoShadowingOrOverridesOnMethodsRule$1.evaluate(NoShadowingOrOverridesOnMethodsRule.java:39)
   [junit4]   1> 	at com.carrotsearch.randomizedtesting.rules.NoShadowingOrOverridesOnMethodsRule$1.evaluate(NoShadowingOrOverridesOnMethodsRule.java:39)
   [junit4]   1> 	at com.carrotsearch.randomizedtesting.rules.StatementAdapter.evaluate(StatementAdapter.java:36)
   [junit4]   1> 	at com.carrotsearch.randomizedtesting.rules.StatementAdapter.evaluate(StatementAdapter.java:36)
   [junit4]   1> 	at org.apache.lucene.util.TestRuleAssertionsRequired$1.evaluate(TestRuleAssertionsRequired.java:43)
   [junit4]   1> 	at org.apache.lucene.util.TestRuleMarkFailure$1.evaluate(TestRuleMarkFailure.java:48)
   [junit4]   1> 	at org.apache.lucene.util.TestRuleIgnoreAfterMaxFailures$1.evaluate(TestRuleIgnoreAfterMaxFailures.java:65)
   [junit4]   1> 	at org.apache.lucene.util.TestRuleIgnoreTestSuites$1.evaluate(TestRuleIgnoreTestSuites.java:55)
   [junit4]   1> 	at com.carrotsearch.randomizedtesting.rules.StatementAdapter.evaluate(StatementAdapter.java:36)
   [junit4]   1> 	at com.carrotsearch.randomizedtesting.ThreadLeakControl$StatementRunner.run(ThreadLeakControl.java:360)
   [junit4]   1> 	at java.lang.Thread.run(Thread.java:853)
   [junit4]   1> 
   [junit4]   1>   3 of 35: name=_2 docCount=63
   [junit4]   1>     codec=Lucene46
   [junit4]   1>     compound=false
   [junit4]   1>     numFiles=13
   [junit4]   1>     size (MB)=0.003
   [junit4]   1>     diagnostics = {lucene.version=4.8-SNAPSHOT, os=Linux, os.arch=x86, os.version=3.8.0-39-generic, java.vendor=IBM Corporation, source=flush, java.version=1.7.0, timestamp=1399781590378}
   [junit4]   1>     has deletions [delGen=1]
   [junit4]   1>     test: open reader.........OK
   [junit4]   1>     test: check integrity.....OK
   [junit4]   1>     test: check live docs.....OK [4 deleted docs]
   [junit4]   1>     test: fields..............OK [3 fields]
   [junit4]   1>     test: field norms.........OK [0 fields]
   [junit4]   1>     test: terms, freq, prox...ERROR: java.lang.ArrayIndexOutOfBoundsException
   [junit4]   1> java.lang.ArrayIndexOutOfBoundsException
   [junit4]   1> 	at org.apache.lucene.store.ByteArrayDataInput.readVLong(ByteArrayDataInput.java:126)
   [junit4]   1> 	at org.apache.lucene.codecs.memory.FSTOrdTermsReader$TermsReader$BaseTermsEnum.refillMetadata(FSTOrdTermsReader.java:390)
   [junit4]   1> 	at org.apache.lucene.codecs.memory.FSTOrdTermsReader$TermsReader$BaseTermsEnum.decodeMetaData(FSTOrdTermsReader.java:357)
   [junit4]   1> 	at org.apache.lucene.codecs.memory.FSTOrdTermsReader$TermsReader$SegmentTermsEnum.decodeMetaData(FSTOrdTermsReader.java:471)
   [junit4]   1> 	at org.apache.lucene.codecs.memory.FSTOrdTermsReader$TermsReader$BaseTermsEnum.docs(FSTOrdTermsReader.java:426)
   [junit4]   1> 	at org.apache.lucene.index.TermsEnum.docs(TermsEnum.java:149)
   [junit4]   1> 	at org.apache.lucene.index.CheckIndex.checkFields(CheckIndex.java:848)
   [junit4]   1> 	at org.apache.lucene.index.CheckIndex.testPostings(CheckIndex.java:1278)
   [junit4]   1> 	at org.apache.lucene.index.CheckIndex.checkIndex(CheckIndex.java:626)
   [junit4]   1> 	at org.apache.lucene.util.TestUtil.checkIndex(TestUtil.java:199)
   [junit4]   1> 	at org.apache.lucene.store.MockDirectoryWrapper.close(MockDirectoryWrapper.java:691)
   [junit4]   1> 	at org.apache.lucene.index.BaseDocValuesFormatTestCase.doTestNumericsVsStoredFields(BaseDocValuesFormatTestCase.java:1278)
   [junit4]   1> 	at org.apache.lucene.index.BaseDocValuesFormatTestCase.doTestNumericsVsStoredFields(BaseDocValuesFormatTestCase.java:1218)
   [junit4]   1> 	at org.apache.lucene.index.BaseDocValuesFormatTestCase.testByteNum

[...truncated too long message...]

cValuesFormat, TestPerFieldPostingsFormat2, TestPositionIncrement, TestLucene3xPostingsFormat, TestSpanSearchEquivalence, Nested, Nested2, Nested1, TestGraphTokenizers, TestAddIndexes, TestNumericTokenStream, MultiCollectorTest, TestTermInfosReaderIndex, TestSizeBoundedForceMerge, TestBytesRefArray, TestBlockPostingsFormat, TestTermVectorsFormat, TestWAH8DocIdSet, TestFileSwitchDirectory, TestBasicOperations, TestPerFieldPostingsFormat, TestPrefixCodedTerms, TestDirectoryReaderReopen, TestIndexWriter, TestPerFieldDocValuesFormat, TestPackedInts, TestBlockPostingsFormat3, TestSearcherManager, TestFlushByRamOrCountsPolicy, TestLucene40DocValuesFormat, TestNRTThreads, TestDuelingCodecs, TestBoolean2, TestNorms, TestIndexWriterCommit, TestTimeLimitingCollector, TestSearchAfter, TestHighCompressionMode, TestOpenBitSet, TestDocumentsWriterStallControl, TestNeverDelete, TestStressIndexing, TestMinimize, TestRollingUpdates, TestBlockPostingsFormat2, TestIndexWriterUnicode, TestByteSlices, TestTermsEnum, TestConsistentFieldNumbers, TestWeakIdentityMap, TestSimpleExplanations, TestDocTermOrdsRangeFilter, TestCompressingStoredFieldsFormat, TestSegmentMerger, TestPhraseQuery, TestDoubleBarrelLRUCache, TestComplexExplanations, TestRegexpRandom2, TestSegmentReader, TestParallelCompositeReader, TestIndexWriterNRTIsCurrent, TestPagedBytes, TestSort, TestMultiDocValues, TestSpans, TestCustomNorms, TestPostingsOffsets, TestPayloadSpans, TestTransactionRollback, TestUTF32ToUTF8, TestIndexInput, TestFilteredQuery, TestSloppyPhraseQuery2, TestNearSpansOrdered, TestQueryWrapperFilter, TestTermRangeQuery, TestPayloadNearQuery, TestWildcard, TestFieldMaskingSpanQuery, TestExternalCodecs, TestIntBlockPool, TestBooleanQuery, TestSortRandom, TestAutomatonQuery, TestForUtil, TestTermScorer, TestSumDocFreq, TestCheckIndex, TestPayloadsOnVectors, TestCachingWrapperFilter, TestFieldValueFilter, TestSpanMultiTermQueryWrapper, TestBooleanQueryVisitSubscorers]
   [junit4] Completed on J1 in 0.14s, 3 tests, 1 error <<< FAILURES!

[...truncated 58 lines...]
   [junit4] Suite: org.apache.lucene.index.TestDocCount
   [junit4]   2> NOTE: reproduce with: ant test  -Dtestcase=TestDocCount -Dtests.method=testSimple -Dtests.seed=980F06D8400C8C98 -Dtests.multiplier=3 -Dtests.slow=true -Dtests.locale=fi -Dtests.timezone=Africa/Windhoek -Dtests.file.encoding=UTF-8
   [junit4] ERROR   0.06s J1 | TestDocCount.testSimple <<<
   [junit4]    > Throwable #1: java.lang.ArrayIndexOutOfBoundsException
   [junit4]    > 	at __randomizedtesting.SeedInfo.seed([980F06D8400C8C98:A0BC222667FF5849]:0)
   [junit4]    > 	at org.apache.lucene.store.ByteArrayDataInput.readVLong(ByteArrayDataInput.java:126)
   [junit4]    > 	at org.apache.lucene.codecs.memory.FSTOrdTermsReader$TermsReader$BaseTermsEnum.refillMetadata(FSTOrdTermsReader.java:390)
   [junit4]    > 	at org.apache.lucene.codecs.memory.FSTOrdTermsReader$TermsReader$BaseTermsEnum.decodeMetaData(FSTOrdTermsReader.java:357)
   [junit4]    > 	at org.apache.lucene.codecs.memory.FSTOrdTermsReader$TermsReader$SegmentTermsEnum.decodeMetaData(FSTOrdTermsReader.java:471)
   [junit4]    > 	at org.apache.lucene.codecs.memory.FSTOrdTermsReader$TermsReader$BaseTermsEnum.docs(FSTOrdTermsReader.java:426)
   [junit4]    > 	at org.apache.lucene.index.MultiTermsEnum.docs(MultiTermsEnum.java:403)
   [junit4]    > 	at org.apache.lucene.util.TestUtil.docs(TestUtil.java:897)
   [junit4]    > 	at org.apache.lucene.index.TestDocCount.verifyCount(TestDocCount.java:75)
   [junit4]    > 	at org.apache.lucene.index.TestDocCount.testSimple(TestDocCount.java:42)
   [junit4]    > 	at java.lang.Thread.run(Thread.java:853)
   [junit4]   2> NOTE: test params are: codec=Lucene46: {120=PostingsFormat(name=Memory doPackFST= true), 121=FSTOrd41, 115=PostingsFormat(name=SimpleText), 109=PostingsFormat(name=MockRandom), 99=FSTOrd41, 119=PostingsFormat(name=SimpleText), 107=FSTOrd41, 117=PostingsFormat(name=Memory doPackFST= true), 102=PostingsFormat(name=Memory doPackFST= true), 112=PostingsFormat(name=MockRandom), 116=PostingsFormat(name=MockRandom), 118=FSTOrd41, 114=FSTOrd41, 113=PostingsFormat(name=Memory doPackFST= true), 111=PostingsFormat(name=SimpleText), 110=FSTOrd41, 106=PostingsFormat(name=Memory doPackFST= true), 122=PostingsFormat(name=SimpleText), 101=PostingsFormat(name=MockRandom), 105=PostingsFormat(name=MockRandom), 98=PostingsFormat(name=Memory doPackFST= true), 97=PostingsFormat(name=MockRandom), 104=PostingsFormat(name=SimpleText), 108=PostingsFormat(name=SimpleText), 100=PostingsFormat(name=SimpleText), 103=FSTOrd41}, docValues:{}, sim=RandomSimilarityProvider(queryNorm=false,coord=no): {}, locale=fi, timezone=Africa/Windhoek
   [junit4]   2> NOTE: Linux 3.8.0-39-generic x86/IBM Corporation 1.7.0 (32-bit)/cpus=8,threads=1,free=234461856,total=318308352
   [junit4]   2> NOTE: All tests run in this JVM: [TestIndexWriterWithThreads, NestedSetupChain, NestedTeardownChain, TestMergedIterator, TestSpanExplanations, TestRAMDirectory, Nested1, TestSearchWithThreads, TestBooleanScorer, TestSimpleExplanationsOfNonMatches, TestIndexWriterOnJRECrash, TestAttributeSource, TestBackwardsCompatibility, TestBasics, TestOfflineSorter, TestFlex, TestMixedCodecs, TestDocValuesScoring, TestLucene40StoredFieldsFormat, TestLevenshteinAutomata, Test2BDocs, TestNewestSegment, TestAtomicUpdate, TestPrefixQuery, TestBinaryTerms, TestForceMergeForever, TestEliasFanoDocIdSet, TestSameTokenSamePosition, TestNamedSPILoader, TestFSTs, TestSnapshotDeletionPolicy, TestSortDocValues, TestGroupFiltering, TestBufferedIndexInput, TestDocumentWriter, TestCodecs, TestIntsRef, TestFuzzyQuery, TestConstants, TestDirectory, TestSimilarityBase, TestIndexSearcher, TestIndexFileDeleter, TestDocInverterPerFieldErrorInfo, TestTopDocsCollector, TestDocValuesIndexing, TestLiveFieldValues, TestImpersonation, TestTermVectorsReader, TestPerSegmentDeletes, TestNGramPhraseQuery, TestBooleanOr, TestVersion, TestTotalHitCountCollector, TestDoc, TestAssertions, TestElevationComparator, TestIndexWriterMergePolicy, TestNRTCachingDirectory, TestIndexWriterDelete, TestBinaryDocument, TestMultiMMap, TestMatchAllDocsQuery, TestTieredMergePolicy, TestDocsAndPositions, TestThreadedForceMerge, TestDateFilter, TestLucene40TermVectorsFormat, TestCollectionUtil, TestDateSort, TestLazyProxSkipping, TestLongPostings, TestHugeRamFile, TestRollingBuffer, TestCharsRef, TestMockDirectoryWrapper, TestDocValuesFormat, TestPerFieldPostingsFormat2, TestPositionIncrement, TestLucene3xPostingsFormat, TestSpanSearchEquivalence, Nested, Nested2, Nested1, TestGraphTokenizers, TestAddIndexes, TestNumericTokenStream, MultiCollectorTest, TestTermInfosReaderIndex, TestSizeBoundedForceMerge, TestBytesRefArray, TestBlockPostingsFormat, TestTermVectorsFormat, TestWAH8DocIdSet, TestFileSwitchDirectory, TestBasicOperations, TestPerFieldPostingsFormat, TestPrefixCodedTerms, TestDirectoryReaderReopen, TestIndexWriter, TestPerFieldDocValuesFormat, TestPackedInts, TestBlockPostingsFormat3, TestSearcherManager, TestFlushByRamOrCountsPolicy, TestLucene40DocValuesFormat, TestNRTThreads, TestDuelingCodecs, TestBoolean2, TestNorms, TestIndexWriterCommit, TestTimeLimitingCollector, TestSearchAfter, TestHighCompressionMode, TestOpenBitSet, TestDocumentsWriterStallControl, TestNeverDelete, TestStressIndexing, TestMinimize, TestRollingUpdates, TestBlockPostingsFormat2, TestIndexWriterUnicode, TestByteSlices, TestTermsEnum, TestConsistentFieldNumbers, TestWeakIdentityMap, TestSimpleExplanations, TestDocTermOrdsRangeFilter, TestCompressingStoredFieldsFormat, TestSegmentMerger, TestPhraseQuery, TestDoubleBarrelLRUCache, TestComplexExplanations, TestRegexpRandom2, TestSegmentReader, TestParallelCompositeReader, TestIndexWriterNRTIsCurrent, TestPagedBytes, TestSort, TestMultiDocValues, TestSpans, TestCustomNorms, TestPostingsOffsets, TestPayloadSpans, TestTransactionRollback, TestUTF32ToUTF8, TestIndexInput, TestFilteredQuery, TestSloppyPhraseQuery2, TestNearSpansOrdered, TestQueryWrapperFilter, TestTermRangeQuery, TestPayloadNearQuery, TestWildcard, TestFieldMaskingSpanQuery, TestExternalCodecs, TestIntBlockPool, TestBooleanQuery, TestSortRandom, TestAutomatonQuery, TestForUtil, TestTermScorer, TestSumDocFreq, TestCheckIndex, TestPayloadsOnVectors, TestCachingWrapperFilter, TestFieldValueFilter, TestSpanMultiTermQueryWrapper, TestBooleanQueryVisitSubscorers, TestSearchForDuplicates, TestCompiledAutomaton, TestFilteredSearch, TestConjunctions, Nested, Nested, TestSimilarity, TestSpanExplanationsOfNonMatches, TestVirtualMethod, TestFilterAtomicReader, TestCachingTokenFilter, TestSpansAdvanced, TestDocCount]
   [junit4] Completed on J1 in 0.08s, 1 test, 1 error <<< FAILURES!

[...truncated 205 lines...]
BUILD FAILED
/mnt/ssd/jenkins/workspace/Lucene-Solr-4.8-Linux/build.xml:467: The following error occurred while executing this line:
/mnt/ssd/jenkins/workspace/Lucene-Solr-4.8-Linux/build.xml:460: The following error occurred while executing this line:
/mnt/ssd/jenkins/workspace/Lucene-Solr-4.8-Linux/build.xml:45: The following error occurred while executing this line:
/mnt/ssd/jenkins/workspace/Lucene-Solr-4.8-Linux/extra-targets.xml:37: The following error occurred while executing this line:
/mnt/ssd/jenkins/workspace/Lucene-Solr-4.8-Linux/lucene/build.xml:49: The following error occurred while executing this line:
/mnt/ssd/jenkins/workspace/Lucene-Solr-4.8-Linux/lucene/common-build.xml:1293: The following error occurred while executing this line:
/mnt/ssd/jenkins/workspace/Lucene-Solr-4.8-Linux/lucene/common-build.xml:919: There were test failures: 398 suites, 2905 tests, 13 errors, 2 failures, 114 ignored (101 assumptions)

Total time: 19 minutes 46 seconds
Build step 'Invoke Ant' marked build as failure
Description set: Java: 32bit/ibm-j9-jdk7 -Xjit:exclude={org/apache/lucene/util/fst/FST.pack(IIF)Lorg/apache/lucene/util/fst/FST;}
Archiving artifacts
Recording test results
Email was triggered for: Failure
Sending email for trigger: Failure



Mime
View raw message