lucene-dev mailing list archives

Site index · List index
Message view « Date » · « Thread »
Top « Date » · « Thread »
From Robert Muir <rcm...@gmail.com>
Subject Re: [JENKINS] Lucene-Solr-trunk-Linux (64bit/jdk1.8.0) - Build # 10017 - Failure!
Date Thu, 10 Apr 2014 21:30:48 GMT
I committed a fix.

On Sun, Apr 6, 2014 at 9:32 PM, Policeman Jenkins Server
<jenkins@thetaphi.de> wrote:
> Build: http://jenkins.thetaphi.de/job/Lucene-Solr-trunk-Linux/10017/
> Java: 64bit/jdk1.8.0 -XX:+UseCompressedOops -XX:+UseSerialGC
>
> 1 tests failed.
> REGRESSION:  org.apache.lucene.analysis.icu.TestICUNormalizer2CharFilter.testNFCHuge
>
> Error Message:
> term 0 expected:<...?睶Qܻǹ䃓̇o򊳝ꀪ߿򊳝𽫖̾䄴泴.[͈򊳝𽫖𝉃]殧򊳝𽫖𝉃𾲖؝㣓�ᇝ䤣7�ľD儹�쪑?...>
but was:<...?睶Qܻǹ䃓̇o򊳝𽫖𝉃𾲖򊳝ꀪ߿򊳝𽫖𝉃𾲖򊳝𽫖̾䄴泴.[򊳝𽫖𝉃𾲖򊳝𽫖͈𝉃]殧򊳝𽫖𝉃𾲖򊳝𽫖𝉃𾲖؝㣓�ᇝ䤣7�ľD儹�쪑?...>
>
> Stack Trace:
> org.junit.ComparisonFailure: term 0 expected:<...?睶Qܻǹ䃓̇o򊳝ꀪ߿𽫖̾䄴泴.[͈𝉃]殧𾲖؝㣓�ᇝ䤣7�ľD儹�쪑?...>
but was:<...?睶Qܻǹ䃓̇o򊳝ꀪ߿𽫖̾䄴泴.[͈𝉃]殧𾲖؝㣓�ᇝ䤣7�ľD儹�쪑?...>
>         at __randomizedtesting.SeedInfo.seed([70B714E14A099CA3:7E48F2705D28916E]:0)
>         at org.junit.Assert.assertEquals(Assert.java:125)
>         at org.apache.lucene.analysis.BaseTokenStreamTestCase.assertTokenStreamContents(BaseTokenStreamTestCase.java:179)
>         at org.apache.lucene.analysis.BaseTokenStreamTestCase.assertTokenStreamContents(BaseTokenStreamTestCase.java:294)
>         at org.apache.lucene.analysis.BaseTokenStreamTestCase.assertTokenStreamContents(BaseTokenStreamTestCase.java:298)
>         at org.apache.lucene.analysis.BaseTokenStreamTestCase.assertTokenStreamContents(BaseTokenStreamTestCase.java:302)
>         at org.apache.lucene.analysis.BaseTokenStreamTestCase.assertAnalyzesTo(BaseTokenStreamTestCase.java:352)
>         at org.apache.lucene.analysis.BaseTokenStreamTestCase.assertAnalyzesTo(BaseTokenStreamTestCase.java:361)
>         at org.apache.lucene.analysis.BaseTokenStreamTestCase.checkOneTerm(BaseTokenStreamTestCase.java:425)
>         at org.apache.lucene.analysis.icu.TestICUNormalizer2CharFilter.doTestMode(TestICUNormalizer2CharFilter.java:130)
>         at org.apache.lucene.analysis.icu.TestICUNormalizer2CharFilter.testNFCHuge(TestICUNormalizer2CharFilter.java:139)
>         at sun.reflect.NativeMethodAccessorImpl.invoke0(Native Method)
>         at sun.reflect.NativeMethodAccessorImpl.invoke(NativeMethodAccessorImpl.java:62)
>         at sun.reflect.DelegatingMethodAccessorImpl.invoke(DelegatingMethodAccessorImpl.java:43)
>         at java.lang.reflect.Method.invoke(Method.java:483)
>         at com.carrotsearch.randomizedtesting.RandomizedRunner.invoke(RandomizedRunner.java:1618)
>         at com.carrotsearch.randomizedtesting.RandomizedRunner$6.evaluate(RandomizedRunner.java:827)
>         at com.carrotsearch.randomizedtesting.RandomizedRunner$7.evaluate(RandomizedRunner.java:863)
>         at com.carrotsearch.randomizedtesting.RandomizedRunner$8.evaluate(RandomizedRunner.java:877)
>         at org.apache.lucene.util.TestRuleSetupTeardownChained$1.evaluate(TestRuleSetupTeardownChained.java:50)
>         at org.apache.lucene.util.TestRuleFieldCacheSanity$1.evaluate(TestRuleFieldCacheSanity.java:51)
>         at org.apache.lucene.util.AbstractBeforeAfterRule$1.evaluate(AbstractBeforeAfterRule.java:46)
>         at com.carrotsearch.randomizedtesting.rules.SystemPropertiesInvariantRule$1.evaluate(SystemPropertiesInvariantRule.java:55)
>         at org.apache.lucene.util.TestRuleThreadAndTestName$1.evaluate(TestRuleThreadAndTestName.java:49)
>         at org.apache.lucene.util.TestRuleIgnoreAfterMaxFailures$1.evaluate(TestRuleIgnoreAfterMaxFailures.java:65)
>         at org.apache.lucene.util.TestRuleMarkFailure$1.evaluate(TestRuleMarkFailure.java:48)
>         at com.carrotsearch.randomizedtesting.rules.StatementAdapter.evaluate(StatementAdapter.java:36)
>         at com.carrotsearch.randomizedtesting.ThreadLeakControl$StatementRunner.run(ThreadLeakControl.java:360)
>         at com.carrotsearch.randomizedtesting.ThreadLeakControl.forkTimeoutingTask(ThreadLeakControl.java:793)
>         at com.carrotsearch.randomizedtesting.ThreadLeakControl$3.evaluate(ThreadLeakControl.java:453)
>         at com.carrotsearch.randomizedtesting.RandomizedRunner.runSingleTest(RandomizedRunner.java:836)
>         at com.carrotsearch.randomizedtesting.RandomizedRunner$3.evaluate(RandomizedRunner.java:738)
>         at com.carrotsearch.randomizedtesting.RandomizedRunner$4.evaluate(RandomizedRunner.java:772)
>         at com.carrotsearch.randomizedtesting.RandomizedRunner$5.evaluate(RandomizedRunner.java:783)
>         at org.apache.lucene.util.AbstractBeforeAfterRule$1.evaluate(AbstractBeforeAfterRule.java:46)
>         at org.apache.lucene.util.TestRuleStoreClassName$1.evaluate(TestRuleStoreClassName.java:42)
>         at com.carrotsearch.randomizedtesting.rules.SystemPropertiesInvariantRule$1.evaluate(SystemPropertiesInvariantRule.java:55)
>         at com.carrotsearch.randomizedtesting.rules.NoShadowingOrOverridesOnMethodsRule$1.evaluate(NoShadowingOrOverridesOnMethodsRule.java:39)
>         at com.carrotsearch.randomizedtesting.rules.NoShadowingOrOverridesOnMethodsRule$1.evaluate(NoShadowingOrOverridesOnMethodsRule.java:39)
>         at com.carrotsearch.randomizedtesting.rules.StatementAdapter.evaluate(StatementAdapter.java:36)
>         at com.carrotsearch.randomizedtesting.rules.StatementAdapter.evaluate(StatementAdapter.java:36)
>         at org.apache.lucene.util.TestRuleAssertionsRequired$1.evaluate(TestRuleAssertionsRequired.java:43)
>         at org.apache.lucene.util.TestRuleMarkFailure$1.evaluate(TestRuleMarkFailure.java:48)
>         at org.apache.lucene.util.TestRuleIgnoreAfterMaxFailures$1.evaluate(TestRuleIgnoreAfterMaxFailures.java:65)
>         at org.apache.lucene.util.TestRuleIgnoreTestSuites$1.evaluate(TestRuleIgnoreTestSuites.java:55)
>         at com.carrotsearch.randomizedtesting.rules.StatementAdapter.evaluate(StatementAdapter.java:36)
>         at com.carrotsearch.randomizedtesting.ThreadLeakControl$StatementRunner.run(ThreadLeakControl.java:360)
>         at java.lang.Thread.run(Thread.java:744)
>
>
>
>
> Build Log:
> [...truncated 6043 lines...]
>    [junit4] Suite: org.apache.lucene.analysis.icu.TestICUNormalizer2CharFilter
>    [junit4]   2> NOTE: reproduce with: ant test  -Dtestcase=TestICUNormalizer2CharFilter
-Dtests.method=testNFCHuge -Dtests.seed=70B714E14A099CA3 -Dtests.multiplier=3 -Dtests.slow=true
-Dtests.locale=ar -Dtests.timezone=Indian/Mahe -Dtests.file.encoding=UTF-8
>    [junit4] FAILURE 0.81s J1 | TestICUNormalizer2CharFilter.testNFCHuge <<<
>    [junit4]    > Throwable #1: org.junit.ComparisonFailure: term 0 expected:<...?睶Qܻǹ䃓̇o򊳝ꀪ߿𽫖̾䄴泴.[͈𝉃]殧𾲖؝㣓
ᇝ䤣7 ľD儹 쪑?...> but was:<...?睶Qܻǹ䃓̇o򊳝ꀪ߿𽫖̾䄴泴.[͈𝉃]殧𾲖؝㣓
ᇝ䤣7 ľD儹 쪑?...>
>    [junit4]    >        at __randomizedtesting.SeedInfo.seed([70B714E14A099CA3:7E48F2705D28916E]:0)
>    [junit4]    >        at org.apache.lucene.analysis.BaseTokenStreamTestCase.assertTokenStreamContents(BaseTokenStreamTestCase.java:179)
>    [junit4]    >        at org.apache.lucene.analysis.BaseTokenStreamTestCase.assertTokenStreamContents(BaseTokenStreamTestCase.java:294)
>    [junit4]    >        at org.apache.lucene.analysis.BaseTokenStreamTestCase.assertTokenStreamContents(BaseTokenStreamTestCase.java:298)
>    [junit4]    >        at org.apache.lucene.analysis.BaseTokenStreamTestCase.assertTokenStreamContents(BaseTokenStreamTestCase.java:302)
>    [junit4]    >        at org.apache.lucene.analysis.BaseTokenStreamTestCase.assertAnalyzesTo(BaseTokenStreamTestCase.java:352)
>    [junit4]    >        at org.apache.lucene.analysis.BaseTokenStreamTestCase.assertAnalyzesTo(BaseTokenStreamTestCase.java:361)
>    [junit4]    >        at org.apache.lucene.analysis.BaseTokenStreamTestCase.checkOneTerm(BaseTokenStreamTestCase.java:425)
>    [junit4]    >        at org.apache.lucene.analysis.icu.TestICUNormalizer2CharFilter.doTestMode(TestICUNormalizer2CharFilter.java:130)
>    [junit4]    >        at org.apache.lucene.analysis.icu.TestICUNormalizer2CharFilter.testNFCHuge(TestICUNormalizer2CharFilter.java:139)
>    [junit4]    >        at java.lang.Thread.run(Thread.java:744)
>    [junit4]   2> NOTE: test params are: codec=Lucene42, sim=DefaultSimilarity, locale=ar,
timezone=Indian/Mahe
>    [junit4]   2> NOTE: Linux 3.8.0-38-generic amd64/Oracle Corporation 1.8.0 (64-bit)/cpus=8,threads=1,free=134539200,total=189792256
>    [junit4]   2> NOTE: All tests run in this JVM: [TestICUCollationDocValuesField,
TestICUFoldingFilter, TestICUTransformFilter, TestICUNormalizer2Filter, TestICUTokenizerFactory,
TestICUNormalizer2FilterFactory, TestCharArrayIterator, TestICUFoldingFilterFactory, TestICUNormalizer2CharFilter]
>    [junit4] Completed on J1 in 11.52s, 17 tests, 1 failure <<< FAILURES!
>
> [...truncated 10 lines...]
> BUILD FAILED
> /mnt/ssd/jenkins/workspace/Lucene-Solr-trunk-Linux/build.xml:467: The following error
occurred while executing this line:
> /mnt/ssd/jenkins/workspace/Lucene-Solr-trunk-Linux/build.xml:447: The following error
occurred while executing this line:
> /mnt/ssd/jenkins/workspace/Lucene-Solr-trunk-Linux/build.xml:45: The following error
occurred while executing this line:
> /mnt/ssd/jenkins/workspace/Lucene-Solr-trunk-Linux/extra-targets.xml:37: The following
error occurred while executing this line:
> /mnt/ssd/jenkins/workspace/Lucene-Solr-trunk-Linux/lucene/build.xml:539: The following
error occurred while executing this line:
> /mnt/ssd/jenkins/workspace/Lucene-Solr-trunk-Linux/lucene/common-build.xml:2002: The
following error occurred while executing this line:
> /mnt/ssd/jenkins/workspace/Lucene-Solr-trunk-Linux/lucene/analysis/build.xml:106: The
following error occurred while executing this line:
> /mnt/ssd/jenkins/workspace/Lucene-Solr-trunk-Linux/lucene/analysis/build.xml:38: The
following error occurred while executing this line:
> /mnt/ssd/jenkins/workspace/Lucene-Solr-trunk-Linux/lucene/module-build.xml:60: The following
error occurred while executing this line:
> /mnt/ssd/jenkins/workspace/Lucene-Solr-trunk-Linux/lucene/common-build.xml:1281: The
following error occurred while executing this line:
> /mnt/ssd/jenkins/workspace/Lucene-Solr-trunk-Linux/lucene/common-build.xml:907: There
were test failures: 15 suites, 112 tests, 1 failure
>
> Total time: 25 minutes 48 seconds
> Build step 'Invoke Ant' marked build as failure
> Description set: Java: 64bit/jdk1.8.0 -XX:+UseCompressedOops -XX:+UseSerialGC
> Archiving artifacts
> Recording test results
> Email was triggered for: Failure
> Sending email for trigger: Failure
>
>
>
>
> ---------------------------------------------------------------------
> To unsubscribe, e-mail: dev-unsubscribe@lucene.apache.org
> For additional commands, e-mail: dev-help@lucene.apache.org

---------------------------------------------------------------------
To unsubscribe, e-mail: dev-unsubscribe@lucene.apache.org
For additional commands, e-mail: dev-help@lucene.apache.org


Mime
View raw message