lucene-dev mailing list archives

Site index · List index
Message view « Date » · « Thread »
Top « Date » · « Thread »
From Robert Muir <rcm...@gmail.com>
Subject Re: [JENKINS] Lucene-Solr-4.x-Linux (32bit/ibm-j9-jdk7) - Build # 10057 - Failure!
Date Mon, 28 Apr 2014 15:41:31 GMT
Bug in J9. Doesnt reproduce with any other jvm.

J1 jvm got "corrupted" and miscompiled something (seems to be maybe
readVint), causing 5 unrelated tests to fail, all on J1.

On Sat, Apr 26, 2014 at 4:53 PM, Uwe Schindler <uwe@thetaphi.de> wrote:
> JVM bug in J9? Or is this a real issue?
>
> -----
> Uwe Schindler
> H.-H.-Meier-Allee 63, D-28213 Bremen
> http://www.thetaphi.de
> eMail: uwe@thetaphi.de
>
>
>> -----Original Message-----
>> From: Policeman Jenkins Server [mailto:jenkins@thetaphi.de]
>> Sent: Saturday, April 26, 2014 9:28 PM
>> To: dev@lucene.apache.org
>> Subject: [JENKINS] Lucene-Solr-4.x-Linux (32bit/ibm-j9-jdk7) - Build # 10057 -
>> Failure!
>>
>> Build: http://jenkins.thetaphi.de/job/Lucene-Solr-4.x-Linux/10057/
>> Java: 32bit/ibm-j9-jdk7 -
>> Xjit:exclude={org/apache/lucene/util/fst/FST.pack(IIF)Lorg/apache/lucene/u
>> til/fst/FST;}
>>
>> 5 tests failed.
>> REGRESSION:
>> org.apache.lucene.codecs.perfield.TestPerFieldDocValuesFormat.testShortN
>> umericsVsStoredFields
>>
>> Error Message:
>> read past EOF: RAMInputStream(name=_2e_MockRandom_0.doc)
>>
>> Stack Trace:
>> java.io.EOFException: read past EOF:
>> RAMInputStream(name=_2e_MockRandom_0.doc)
>>       at
>> __randomizedtesting.SeedInfo.seed([448BBB0F2B44D6F3:86FB2E28D75D989
>> C]:0)
>>       at
>> org.apache.lucene.store.RAMInputStream.switchCurrentBuffer(RAMInputSt
>> ream.java:94)
>>       at
>> org.apache.lucene.store.RAMInputStream.readByte(RAMInputStream.java:
>> 67)
>>       at org.apache.lucene.store.DataInput.readVInt(DataInput.java:120)
>>       at
>> org.apache.lucene.codecs.mockintblock.MockFixedIntBlockPostingsFormat$
>> MockIntFactory$1$1.readBlock(MockFixedIntBlockPostingsFormat.java:96)
>>       at
>> org.apache.lucene.codecs.intblock.FixedIntBlockIndexInput$Reader.next(Fix
>> edIntBlockIndexInput.java:111)
>>       at
>> org.apache.lucene.codecs.sep.SepPostingsReader$SepDocsEnum.nextDoc(S
>> epPostingsReader.java:338)
>>       at
>> org.apache.lucene.codecs.MappingMultiDocsEnum.nextDoc(MappingMultiD
>> ocsEnum.java:104)
>>       at
>> org.apache.lucene.codecs.PostingsConsumer.merge(PostingsConsumer.java
>> :83)
>>       at
>> org.apache.lucene.codecs.TermsConsumer.merge(TermsConsumer.java:110
>> )
>>       at
>> org.apache.lucene.codecs.FieldsConsumer.merge(FieldsConsumer.java:72)
>>       at
>> org.apache.lucene.index.SegmentMerger.mergeTerms(SegmentMerger.jav
>> a:389)
>>       at
>> org.apache.lucene.index.SegmentMerger.merge(SegmentMerger.java:112)
>>       at
>> org.apache.lucene.index.IndexWriter.mergeMiddle(IndexWriter.java:4141)
>>       at
>> org.apache.lucene.index.IndexWriter.merge(IndexWriter.java:3737)
>>       at
>> org.apache.lucene.index.SerialMergeScheduler.merge(SerialMergeSchedule
>> r.java:40)
>>       at
>> org.apache.lucene.index.IndexWriter.maybeMerge(IndexWriter.java:1991)
>>       at
>> org.apache.lucene.index.IndexWriter.prepareCommitInternal(IndexWriter.j
>> ava:2992)
>>       at
>> org.apache.lucene.index.IndexWriter.commitInternal(IndexWriter.java:3101
>> )
>>       at
>> org.apache.lucene.index.IndexWriter.commit(IndexWriter.java:3068)
>>       at
>> org.apache.lucene.index.RandomIndexWriter.commit(RandomIndexWriter.j
>> ava:241)
>>       at
>> org.apache.lucene.index.BaseDocValuesFormatTestCase.doTestNumericsVs
>> StoredFields(BaseDocValuesFormatTestCase.java:1250)
>>       at
>> org.apache.lucene.index.BaseDocValuesFormatTestCase.doTestNumericsVs
>> StoredFields(BaseDocValuesFormatTestCase.java:1218)
>>       at
>> org.apache.lucene.index.BaseDocValuesFormatTestCase.testShortNumerics
>> VsStoredFields(BaseDocValuesFormatTestCase.java:1372)
>>       at sun.reflect.NativeMethodAccessorImpl.invoke0(Native Method)
>>       at
>> sun.reflect.NativeMethodAccessorImpl.invoke(NativeMethodAccessorImpl.j
>> ava:94)
>>       at
>> sun.reflect.DelegatingMethodAccessorImpl.invoke(DelegatingMethodAcces
>> sorImpl.java:55)
>>       at java.lang.reflect.Method.invoke(Method.java:619)
>>       at
>> com.carrotsearch.randomizedtesting.RandomizedRunner.invoke(Randomize
>> dRunner.java:1618)
>>       at
>> com.carrotsearch.randomizedtesting.RandomizedRunner$6.evaluate(Rando
>> mizedRunner.java:827)
>>       at
>> com.carrotsearch.randomizedtesting.RandomizedRunner$7.evaluate(Rando
>> mizedRunner.java:863)
>>       at
>> com.carrotsearch.randomizedtesting.RandomizedRunner$8.evaluate(Rando
>> mizedRunner.java:877)
>>       at
>> org.apache.lucene.util.TestRuleSetupTeardownChained$1.evaluate(TestRule
>> SetupTeardownChained.java:50)
>>       at
>> org.apache.lucene.util.TestRuleFieldCacheSanity$1.evaluate(TestRuleFieldCa
>> cheSanity.java:51)
>>       at
>> org.apache.lucene.util.AbstractBeforeAfterRule$1.evaluate(AbstractBeforeA
>> fterRule.java:46)
>>       at
>> com.carrotsearch.randomizedtesting.rules.SystemPropertiesInvariantRule$1
>> .evaluate(SystemPropertiesInvariantRule.java:55)
>>       at
>> org.apache.lucene.util.TestRuleThreadAndTestName$1.evaluate(TestRuleTh
>> readAndTestName.java:49)
>>       at
>> org.apache.lucene.util.TestRuleIgnoreAfterMaxFailures$1.evaluate(TestRule
>> IgnoreAfterMaxFailures.java:65)
>>       at
>> org.apache.lucene.util.TestRuleMarkFailure$1.evaluate(TestRuleMarkFailure
>> .java:48)
>>       at
>> com.carrotsearch.randomizedtesting.rules.StatementAdapter.evaluate(Stat
>> ementAdapter.java:36)
>>       at
>> com.carrotsearch.randomizedtesting.ThreadLeakControl$StatementRunner.
>> run(ThreadLeakControl.java:360)
>>       at
>> com.carrotsearch.randomizedtesting.ThreadLeakControl.forkTimeoutingTask
>> (ThreadLeakControl.java:793)
>>       at
>> com.carrotsearch.randomizedtesting.ThreadLeakControl$3.evaluate(ThreadL
>> eakControl.java:453)
>>       at
>> com.carrotsearch.randomizedtesting.RandomizedRunner.runSingleTest(Ran
>> domizedRunner.java:836)
>>       at
>> com.carrotsearch.randomizedtesting.RandomizedRunner$3.evaluate(Rando
>> mizedRunner.java:738)
>>       at
>> com.carrotsearch.randomizedtesting.RandomizedRunner$4.evaluate(Rando
>> mizedRunner.java:772)
>>       at
>> com.carrotsearch.randomizedtesting.RandomizedRunner$5.evaluate(Rando
>> mizedRunner.java:783)
>>       at
>> org.apache.lucene.util.AbstractBeforeAfterRule$1.evaluate(AbstractBeforeA
>> fterRule.java:46)
>>       at
>> org.apache.lucene.util.TestRuleStoreClassName$1.evaluate(TestRuleStoreCl
>> assName.java:42)
>>       at
>> com.carrotsearch.randomizedtesting.rules.SystemPropertiesInvariantRule$1
>> .evaluate(SystemPropertiesInvariantRule.java:55)
>>       at
>> com.carrotsearch.randomizedtesting.rules.NoShadowingOrOverridesOnMet
>> hodsRule$1.evaluate(NoShadowingOrOverridesOnMethodsRule.java:39)
>>       at
>> com.carrotsearch.randomizedtesting.rules.NoShadowingOrOverridesOnMet
>> hodsRule$1.evaluate(NoShadowingOrOverridesOnMethodsRule.java:39)
>>       at
>> com.carrotsearch.randomizedtesting.rules.StatementAdapter.evaluate(Stat
>> ementAdapter.java:36)
>>       at
>> com.carrotsearch.randomizedtesting.rules.StatementAdapter.evaluate(Stat
>> ementAdapter.java:36)
>>       at
>> org.apache.lucene.util.TestRuleAssertionsRequired$1.evaluate(TestRuleAss
>> ertionsRequired.java:43)
>>       at
>> org.apache.lucene.util.TestRuleMarkFailure$1.evaluate(TestRuleMarkFailure
>> .java:48)
>>       at
>> org.apache.lucene.util.TestRuleIgnoreAfterMaxFailures$1.evaluate(TestRule
>> IgnoreAfterMaxFailures.java:65)
>>       at
>> org.apache.lucene.util.TestRuleIgnoreTestSuites$1.evaluate(TestRuleIgnore
>> TestSuites.java:55)
>>       at
>> com.carrotsearch.randomizedtesting.rules.StatementAdapter.evaluate(Stat
>> ementAdapter.java:36)
>>       at
>> com.carrotsearch.randomizedtesting.ThreadLeakControl$StatementRunner.
>> run(ThreadLeakControl.java:360)
>>       at java.lang.Thread.run(Thread.java:853)
>>
>>
>> REGRESSION:
>> org.apache.lucene.index.TestStressIndexing.testStressIndexAndSearching
>>
>> Error Message:
>> CheckIndex failed
>>
>> Stack Trace:
>> java.lang.RuntimeException: CheckIndex failed
>>       at org.apache.lucene.util.TestUtil.checkIndex(TestUtil.java:203)
>>       at
>> org.apache.lucene.store.MockDirectoryWrapper.close(MockDirectoryWrapp
>> er.java:681)
>>       at
>> org.apache.lucene.index.TestStressIndexing.testStressIndexAndSearching(T
>> estStressIndexing.java:173)
>>       at sun.reflect.NativeMethodAccessorImpl.invoke0(Native Method)
>>       at
>> sun.reflect.NativeMethodAccessorImpl.invoke(NativeMethodAccessorImpl.j
>> ava:94)
>>       at
>> sun.reflect.DelegatingMethodAccessorImpl.invoke(DelegatingMethodAcces
>> sorImpl.java:55)
>>       at java.lang.reflect.Method.invoke(Method.java:619)
>>       at
>> com.carrotsearch.randomizedtesting.RandomizedRunner.invoke(Randomize
>> dRunner.java:1618)
>>       at
>> com.carrotsearch.randomizedtesting.RandomizedRunner$6.evaluate(Rando
>> mizedRunner.java:827)
>>       at
>> com.carrotsearch.randomizedtesting.RandomizedRunner$7.evaluate(Rando
>> mizedRunner.java:863)
>>       at
>> com.carrotsearch.randomizedtesting.RandomizedRunner$8.evaluate(Rando
>> mizedRunner.java:877)
>>       at
>> org.apache.lucene.util.TestRuleSetupTeardownChained$1.evaluate(TestRule
>> SetupTeardownChained.java:50)
>>       at
>> org.apache.lucene.util.TestRuleFieldCacheSanity$1.evaluate(TestRuleFieldCa
>> cheSanity.java:51)
>>       at
>> org.apache.lucene.util.AbstractBeforeAfterRule$1.evaluate(AbstractBeforeA
>> fterRule.java:46)
>>       at
>> com.carrotsearch.randomizedtesting.rules.SystemPropertiesInvariantRule$1
>> .evaluate(SystemPropertiesInvariantRule.java:55)
>>       at
>> org.apache.lucene.util.TestRuleThreadAndTestName$1.evaluate(TestRuleTh
>> readAndTestName.java:49)
>>       at
>> org.apache.lucene.util.TestRuleIgnoreAfterMaxFailures$1.evaluate(TestRule
>> IgnoreAfterMaxFailures.java:65)
>>       at
>> org.apache.lucene.util.TestRuleMarkFailure$1.evaluate(TestRuleMarkFailure
>> .java:48)
>>       at
>> com.carrotsearch.randomizedtesting.rules.StatementAdapter.evaluate(Stat
>> ementAdapter.java:36)
>>       at
>> com.carrotsearch.randomizedtesting.ThreadLeakControl$StatementRunner.
>> run(ThreadLeakControl.java:360)
>>       at
>> com.carrotsearch.randomizedtesting.ThreadLeakControl.forkTimeoutingTask
>> (ThreadLeakControl.java:793)
>>       at
>> com.carrotsearch.randomizedtesting.ThreadLeakControl$3.evaluate(ThreadL
>> eakControl.java:453)
>>       at
>> com.carrotsearch.randomizedtesting.RandomizedRunner.runSingleTest(Ran
>> domizedRunner.java:836)
>>       at
>> com.carrotsearch.randomizedtesting.RandomizedRunner$3.evaluate(Rando
>> mizedRunner.java:738)
>>       at
>> com.carrotsearch.randomizedtesting.RandomizedRunner$4.evaluate(Rando
>> mizedRunner.java:772)
>>       at
>> com.carrotsearch.randomizedtesting.RandomizedRunner$5.evaluate(Rando
>> mizedRunner.java:783)
>>       at
>> org.apache.lucene.util.AbstractBeforeAfterRule$1.evaluate(AbstractBeforeA
>> fterRule.java:46)
>>       at
>> org.apache.lucene.util.TestRuleStoreClassName$1.evaluate(TestRuleStoreCl
>> assName.java:42)
>>       at
>> com.carrotsearch.randomizedtesting.rules.SystemPropertiesInvariantRule$1
>> .evaluate(SystemPropertiesInvariantRule.java:55)
>>       at
>> com.carrotsearch.randomizedtesting.rules.NoShadowingOrOverridesOnMet
>> hodsRule$1.evaluate(NoShadowingOrOverridesOnMethodsRule.java:39)
>>       at
>> com.carrotsearch.randomizedtesting.rules.NoShadowingOrOverridesOnMet
>> hodsRule$1.evaluate(NoShadowingOrOverridesOnMethodsRule.java:39)
>>       at
>> com.carrotsearch.randomizedtesting.rules.StatementAdapter.evaluate(Stat
>> ementAdapter.java:36)
>>       at
>> com.carrotsearch.randomizedtesting.rules.StatementAdapter.evaluate(Stat
>> ementAdapter.java:36)
>>       at
>> org.apache.lucene.util.TestRuleAssertionsRequired$1.evaluate(TestRuleAss
>> ertionsRequired.java:43)
>>       at
>> org.apache.lucene.util.TestRuleMarkFailure$1.evaluate(TestRuleMarkFailure
>> .java:48)
>>       at
>> org.apache.lucene.util.TestRuleIgnoreAfterMaxFailures$1.evaluate(TestRule
>> IgnoreAfterMaxFailures.java:65)
>>       at
>> org.apache.lucene.util.TestRuleIgnoreTestSuites$1.evaluate(TestRuleIgnore
>> TestSuites.java:55)
>>       at
>> com.carrotsearch.randomizedtesting.rules.StatementAdapter.evaluate(Stat
>> ementAdapter.java:36)
>>       at
>> com.carrotsearch.randomizedtesting.ThreadLeakControl$StatementRunner.
>> run(ThreadLeakControl.java:360)
>>       at java.lang.Thread.run(Thread.java:853)
>>
>>
>> REGRESSION:
>> org.apache.lucene.search.TestDocTermOrdsRewriteMethod.testEquals
>>
>> Error Message:
>>
>>
>> Stack Trace:
>> java.lang.ArrayIndexOutOfBoundsException
>>       at
>> org.apache.lucene.store.ByteArrayDataInput.readVLong(ByteArrayDataInpu
>> t.java:126)
>>       at
>> org.apache.lucene.codecs.memory.FSTOrdTermsReader$TermsReader$Base
>> TermsEnum.refillMetadata(FSTOrdTermsReader.java:393)
>>       at
>> org.apache.lucene.codecs.memory.FSTOrdTermsReader$TermsReader$Base
>> TermsEnum.decodeMetaData(FSTOrdTermsReader.java:357)
>>       at
>> org.apache.lucene.codecs.memory.FSTOrdTermsReader$TermsReader$Seg
>> mentTermsEnum.decodeMetaData(FSTOrdTermsReader.java:471)
>>       at
>> org.apache.lucene.codecs.memory.FSTOrdTermsReader$TermsReader$Base
>> TermsEnum.docs(FSTOrdTermsReader.java:426)
>>       at
>> org.apache.lucene.index.BufferedUpdatesStream.applyTermDeletes(Buffer
>> edUpdatesStream.java:418)
>>       at
>> org.apache.lucene.index.BufferedUpdatesStream.applyDeletesAndUpdates
>> (BufferedUpdatesStream.java:283)
>>       at
>> org.apache.lucene.index.IndexWriter.applyAllDeletesAndUpdates(IndexWri
>> ter.java:3247)
>>       at
>> org.apache.lucene.index.IndexWriter.maybeApplyDeletes(IndexWriter.java:
>> 3238)
>>       at
>> org.apache.lucene.index.IndexWriter.prepareCommitInternal(IndexWriter.j
>> ava:2952)
>>       at
>> org.apache.lucene.index.IndexWriter.commitInternal(IndexWriter.java:3101
>> )
>>       at
>> org.apache.lucene.index.IndexWriter.commit(IndexWriter.java:3068)
>>       at
>> org.apache.lucene.index.RandomIndexWriter.getReader(RandomIndexWrit
>> er.java:320)
>>       at
>> org.apache.lucene.index.RandomIndexWriter.getReader(RandomIndexWrit
>> er.java:257)
>>       at
>> org.apache.lucene.search.TestDocTermOrdsRewriteMethod.setUp(TestDoc
>> TermOrdsRewriteMethod.java:91)
>>       at sun.reflect.GeneratedMethodAccessor5.invoke(Unknown Source)
>>       at
>> sun.reflect.DelegatingMethodAccessorImpl.invoke(DelegatingMethodAcces
>> sorImpl.java:55)
>>       at java.lang.reflect.Method.invoke(Method.java:619)
>>       at
>> com.carrotsearch.randomizedtesting.RandomizedRunner.invoke(Randomize
>> dRunner.java:1618)
>>       at
>> com.carrotsearch.randomizedtesting.RandomizedRunner$7.evaluate(Rando
>> mizedRunner.java:861)
>>       at
>> com.carrotsearch.randomizedtesting.RandomizedRunner$8.evaluate(Rando
>> mizedRunner.java:877)
>>       at
>> org.apache.lucene.util.TestRuleSetupTeardownChained$1.evaluate(TestRule
>> SetupTeardownChained.java:50)
>>       at
>> org.apache.lucene.util.TestRuleFieldCacheSanity$1.evaluate(TestRuleFieldCa
>> cheSanity.java:51)
>>       at
>> org.apache.lucene.util.AbstractBeforeAfterRule$1.evaluate(AbstractBeforeA
>> fterRule.java:46)
>>       at
>> com.carrotsearch.randomizedtesting.rules.SystemPropertiesInvariantRule$1
>> .evaluate(SystemPropertiesInvariantRule.java:55)
>>       at
>> org.apache.lucene.util.TestRuleThreadAndTestName$1.evaluate(TestRuleTh
>> readAndTestName.java:49)
>>       at
>> org.apache.lucene.util.TestRuleIgnoreAfterMaxFailures$1.evaluate(TestRule
>> IgnoreAfterMaxFailures.java:65)
>>       at
>> org.apache.lucene.util.TestRuleMarkFailure$1.evaluate(TestRuleMarkFailure
>> .java:48)
>>       at
>> com.carrotsearch.randomizedtesting.rules.StatementAdapter.evaluate(Stat
>> ementAdapter.java:36)
>>       at
>> com.carrotsearch.randomizedtesting.ThreadLeakControl$StatementRunner.
>> run(ThreadLeakControl.java:360)
>>       at
>> com.carrotsearch.randomizedtesting.ThreadLeakControl.forkTimeoutingTask
>> (ThreadLeakControl.java:793)
>>       at
>> com.carrotsearch.randomizedtesting.ThreadLeakControl$3.evaluate(ThreadL
>> eakControl.java:453)
>>       at
>> com.carrotsearch.randomizedtesting.RandomizedRunner.runSingleTest(Ran
>> domizedRunner.java:836)
>>       at
>> com.carrotsearch.randomizedtesting.RandomizedRunner$3.evaluate(Rando
>> mizedRunner.java:738)
>>       at
>> com.carrotsearch.randomizedtesting.RandomizedRunner$4.evaluate(Rando
>> mizedRunner.java:772)
>>       at
>> com.carrotsearch.randomizedtesting.RandomizedRunner$5.evaluate(Rando
>> mizedRunner.java:783)
>>       at
>> org.apache.lucene.util.AbstractBeforeAfterRule$1.evaluate(AbstractBeforeA
>> fterRule.java:46)
>>       at
>> org.apache.lucene.util.TestRuleStoreClassName$1.evaluate(TestRuleStoreCl
>> assName.java:42)
>>       at
>> com.carrotsearch.randomizedtesting.rules.SystemPropertiesInvariantRule$1
>> .evaluate(SystemPropertiesInvariantRule.java:55)
>>       at
>> com.carrotsearch.randomizedtesting.rules.NoShadowingOrOverridesOnMet
>> hodsRule$1.evaluate(NoShadowingOrOverridesOnMethodsRule.java:39)
>>       at
>> com.carrotsearch.randomizedtesting.rules.NoShadowingOrOverridesOnMet
>> hodsRule$1.evaluate(NoShadowingOrOverridesOnMethodsRule.java:39)
>>       at
>> com.carrotsearch.randomizedtesting.rules.StatementAdapter.evaluate(Stat
>> ementAdapter.java:36)
>>       at
>> com.carrotsearch.randomizedtesting.rules.StatementAdapter.evaluate(Stat
>> ementAdapter.java:36)
>>       at
>> org.apache.lucene.util.TestRuleAssertionsRequired$1.evaluate(TestRuleAss
>> ertionsRequired.java:43)
>>       at
>> org.apache.lucene.util.TestRuleMarkFailure$1.evaluate(TestRuleMarkFailure
>> .java:48)
>>       at
>> org.apache.lucene.util.TestRuleIgnoreAfterMaxFailures$1.evaluate(TestRule
>> IgnoreAfterMaxFailures.java:65)
>>       at
>> org.apache.lucene.util.TestRuleIgnoreTestSuites$1.evaluate(TestRuleIgnore
>> TestSuites.java:55)
>>       at
>> com.carrotsearch.randomizedtesting.rules.StatementAdapter.evaluate(Stat
>> ementAdapter.java:36)
>>       at
>> com.carrotsearch.randomizedtesting.ThreadLeakControl$StatementRunner.
>> run(ThreadLeakControl.java:360)
>>       at java.lang.Thread.run(Thread.java:853)
>>
>>
>> REGRESSION:
>> org.apache.lucene.search.TestDocTermOrdsRewriteMethod.testRegexps
>>
>> Error Message:
>>
>>
>> Stack Trace:
>> java.lang.NullPointerException
>>       at
>> org.apache.lucene.search.TestDocTermOrdsRewriteMethod.tearDown(Test
>> DocTermOrdsRewriteMethod.java:99)
>>       at sun.reflect.GeneratedMethodAccessor6.invoke(Unknown Source)
>>       at
>> sun.reflect.DelegatingMethodAccessorImpl.invoke(DelegatingMethodAcces
>> sorImpl.java:55)
>>       at java.lang.reflect.Method.invoke(Method.java:619)
>>       at
>> com.carrotsearch.randomizedtesting.RandomizedRunner.invoke(Randomize
>> dRunner.java:1618)
>>       at
>> com.carrotsearch.randomizedtesting.RandomizedRunner$8.evaluate(Rando
>> mizedRunner.java:885)
>>       at
>> org.apache.lucene.util.TestRuleSetupTeardownChained$1.evaluate(TestRule
>> SetupTeardownChained.java:50)
>>       at
>> org.apache.lucene.util.TestRuleFieldCacheSanity$1.evaluate(TestRuleFieldCa
>> cheSanity.java:51)
>>       at
>> org.apache.lucene.util.AbstractBeforeAfterRule$1.evaluate(AbstractBeforeA
>> fterRule.java:46)
>>       at
>> com.carrotsearch.randomizedtesting.rules.SystemPropertiesInvariantRule$1
>> .evaluate(SystemPropertiesInvariantRule.java:55)
>>       at
>> org.apache.lucene.util.TestRuleThreadAndTestName$1.evaluate(TestRuleTh
>> readAndTestName.java:49)
>>       at
>> org.apache.lucene.util.TestRuleIgnoreAfterMaxFailures$1.evaluate(TestRule
>> IgnoreAfterMaxFailures.java:65)
>>       at
>> org.apache.lucene.util.TestRuleMarkFailure$1.evaluate(TestRuleMarkFailure
>> .java:48)
>>       at
>> com.carrotsearch.randomizedtesting.rules.StatementAdapter.evaluate(Stat
>> ementAdapter.java:36)
>>       at
>> com.carrotsearch.randomizedtesting.ThreadLeakControl$StatementRunner.
>> run(ThreadLeakControl.java:360)
>>       at
>> com.carrotsearch.randomizedtesting.ThreadLeakControl.forkTimeoutingTask
>> (ThreadLeakControl.java:793)
>>       at
>> com.carrotsearch.randomizedtesting.ThreadLeakControl$3.evaluate(ThreadL
>> eakControl.java:453)
>>       at
>> com.carrotsearch.randomizedtesting.RandomizedRunner.runSingleTest(Ran
>> domizedRunner.java:836)
>>       at
>> com.carrotsearch.randomizedtesting.RandomizedRunner$3.evaluate(Rando
>> mizedRunner.java:738)
>>       at
>> com.carrotsearch.randomizedtesting.RandomizedRunner$4.evaluate(Rando
>> mizedRunner.java:772)
>>       at
>> com.carrotsearch.randomizedtesting.RandomizedRunner$5.evaluate(Rando
>> mizedRunner.java:783)
>>       at
>> org.apache.lucene.util.AbstractBeforeAfterRule$1.evaluate(AbstractBeforeA
>> fterRule.java:46)
>>       at
>> org.apache.lucene.util.TestRuleStoreClassName$1.evaluate(TestRuleStoreCl
>> assName.java:42)
>>       at
>> com.carrotsearch.randomizedtesting.rules.SystemPropertiesInvariantRule$1
>> .evaluate(SystemPropertiesInvariantRule.java:55)
>>       at
>> com.carrotsearch.randomizedtesting.rules.NoShadowingOrOverridesOnMet
>> hodsRule$1.evaluate(NoShadowingOrOverridesOnMethodsRule.java:39)
>>       at
>> com.carrotsearch.randomizedtesting.rules.NoShadowingOrOverridesOnMet
>> hodsRule$1.evaluate(NoShadowingOrOverridesOnMethodsRule.java:39)
>>       at
>> com.carrotsearch.randomizedtesting.rules.StatementAdapter.evaluate(Stat
>> ementAdapter.java:36)
>>       at
>> com.carrotsearch.randomizedtesting.rules.StatementAdapter.evaluate(Stat
>> ementAdapter.java:36)
>>       at
>> org.apache.lucene.util.TestRuleAssertionsRequired$1.evaluate(TestRuleAss
>> ertionsRequired.java:43)
>>       at
>> org.apache.lucene.util.TestRuleMarkFailure$1.evaluate(TestRuleMarkFailure
>> .java:48)
>>       at
>> org.apache.lucene.util.TestRuleIgnoreAfterMaxFailures$1.evaluate(TestRule
>> IgnoreAfterMaxFailures.java:65)
>>       at
>> org.apache.lucene.util.TestRuleIgnoreTestSuites$1.evaluate(TestRuleIgnore
>> TestSuites.java:55)
>>       at
>> com.carrotsearch.randomizedtesting.rules.StatementAdapter.evaluate(Stat
>> ementAdapter.java:36)
>>       at
>> com.carrotsearch.randomizedtesting.ThreadLeakControl$StatementRunner.
>> run(ThreadLeakControl.java:360)
>>       at java.lang.Thread.run(Thread.java:853)
>>
>>
>> REGRESSION:
>> org.apache.lucene.search.TestFilteredSearch.testFilteredSearch
>>
>> Error Message:
>>
>>
>> Stack Trace:
>> java.lang.ArrayIndexOutOfBoundsException
>>       at
>> __randomizedtesting.SeedInfo.seed([448BBB0F2B44D6F3:55210B50E849052
>> B]:0)
>>       at
>> org.apache.lucene.store.ByteArrayDataInput.readVLong(ByteArrayDataInpu
>> t.java:126)
>>       at
>> org.apache.lucene.codecs.memory.FSTOrdTermsReader$TermsReader$Base
>> TermsEnum.refillMetadata(FSTOrdTermsReader.java:390)
>>       at
>> org.apache.lucene.codecs.memory.FSTOrdTermsReader$TermsReader$Base
>> TermsEnum.decodeMetaData(FSTOrdTermsReader.java:357)
>>       at
>> org.apache.lucene.codecs.memory.FSTOrdTermsReader$TermsReader$Seg
>> mentTermsEnum.decodeMetaData(FSTOrdTermsReader.java:471)
>>       at
>> org.apache.lucene.codecs.memory.FSTOrdTermsReader$TermsReader$Base
>> TermsEnum.docs(FSTOrdTermsReader.java:426)
>>       at
>> org.apache.lucene.index.MultiTermsEnum.docs(MultiTermsEnum.java:403)
>>       at
>> org.apache.lucene.codecs.TermsConsumer.merge(TermsConsumer.java:106
>> )
>>       at
>> org.apache.lucene.codecs.FieldsConsumer.merge(FieldsConsumer.java:72)
>>       at
>> org.apache.lucene.index.SegmentMerger.mergeTerms(SegmentMerger.jav
>> a:389)
>>       at
>> org.apache.lucene.index.SegmentMerger.merge(SegmentMerger.java:112)
>>       at
>> org.apache.lucene.index.IndexWriter.mergeMiddle(IndexWriter.java:4141)
>>       at
>> org.apache.lucene.index.IndexWriter.merge(IndexWriter.java:3737)
>>       at
>> org.apache.lucene.index.SerialMergeScheduler.merge(SerialMergeSchedule
>> r.java:40)
>>       at
>> org.apache.lucene.index.IndexWriter.maybeMerge(IndexWriter.java:1991)
>>       at
>> org.apache.lucene.index.IndexWriter.forceMerge(IndexWriter.java:1801)
>>       at
>> org.apache.lucene.index.IndexWriter.forceMerge(IndexWriter.java:1754)
>>       at
>> org.apache.lucene.search.TestFilteredSearch.searchFiltered(TestFilteredSea
>> rch.java:69)
>>       at
>> org.apache.lucene.search.TestFilteredSearch.testFilteredSearch(TestFiltered
>> Search.java:51)
>>       at sun.reflect.NativeMethodAccessorImpl.invoke0(Native Method)
>>       at
>> sun.reflect.NativeMethodAccessorImpl.invoke(NativeMethodAccessorImpl.j
>> ava:94)
>>       at
>> sun.reflect.DelegatingMethodAccessorImpl.invoke(DelegatingMethodAcces
>> sorImpl.java:55)
>>       at java.lang.reflect.Method.invoke(Method.java:619)
>>       at
>> com.carrotsearch.randomizedtesting.RandomizedRunner.invoke(Randomize
>> dRunner.java:1618)
>>       at
>> com.carrotsearch.randomizedtesting.RandomizedRunner$6.evaluate(Rando
>> mizedRunner.java:827)
>>       at
>> com.carrotsearch.randomizedtesting.RandomizedRunner$7.evaluate(Rando
>> mizedRunner.java:863)
>>       at
>> com.carrotsearch.randomizedtesting.RandomizedRunner$8.evaluate(Rando
>> mizedRunner.java:877)
>>       at
>> org.apache.lucene.util.TestRuleSetupTeardownChained$1.evaluate(TestRule
>> SetupTeardownChained.java:50)
>>       at
>> org.apache.lucene.util.TestRuleFieldCacheSanity$1.evaluate(TestRuleFieldCa
>> cheSanity.java:51)
>>       at
>> org.apache.lucene.util.AbstractBeforeAfterRule$1.evaluate(AbstractBeforeA
>> fterRule.java:46)
>>       at
>> com.carrotsearch.randomizedtesting.rules.SystemPropertiesInvariantRule$1
>> .evaluate(SystemPropertiesInvariantRule.java:55)
>>       at
>> org.apache.lucene.util.TestRuleThreadAndTestName$1.evaluate(TestRuleTh
>> readAndTestName.java:49)
>>       at
>> org.apache.lucene.util.TestRuleIgnoreAfterMaxFailures$1.evaluate(TestRule
>> IgnoreAfterMaxFailures.java:65)
>>       at
>> org.apache.lucene.util.TestRuleMarkFailure$1.evaluate(TestRuleMarkFailure
>> .java:48)
>>       at
>> com.carrotsearch.randomizedtesting.rules.StatementAdapter.evaluate(Stat
>> ementAdapter.java:36)
>>       at
>> com.carrotsearch.randomizedtesting.ThreadLeakControl$StatementRunner.
>> run(ThreadLeakControl.java:360)
>>       at
>> com.carrotsearch.randomizedtesting.ThreadLeakControl.forkTimeoutingTask
>> (ThreadLeakControl.java:793)
>>       at
>> com.carrotsearch.randomizedtesting.ThreadLeakControl$3.evaluate(ThreadL
>> eakControl.java:453)
>>       at
>> com.carrotsearch.randomizedtesting.RandomizedRunner.runSingleTest(Ran
>> domizedRunner.java:836)
>>       at
>> com.carrotsearch.randomizedtesting.RandomizedRunner$3.evaluate(Rando
>> mizedRunner.java:738)
>>       at
>> com.carrotsearch.randomizedtesting.RandomizedRunner$4.evaluate(Rando
>> mizedRunner.java:772)
>>       at
>> com.carrotsearch.randomizedtesting.RandomizedRunner$5.evaluate(Rando
>> mizedRunner.java:783)
>>       at
>> org.apache.lucene.util.AbstractBeforeAfterRule$1.evaluate(AbstractBeforeA
>> fterRule.java:46)
>>       at
>> org.apache.lucene.util.TestRuleStoreClassName$1.evaluate(TestRuleStoreCl
>> assName.java:42)
>>       at
>> com.carrotsearch.randomizedtesting.rules.SystemPropertiesInvariantRule$1
>> .evaluate(SystemPropertiesInvariantRule.java:55)
>>       at
>> com.carrotsearch.randomizedtesting.rules.NoShadowingOrOverridesOnMet
>> hodsRule$1.evaluate(NoShadowingOrOverridesOnMethodsRule.java:39)
>>       at
>> com.carrotsearch.randomizedtesting.rules.NoShadowingOrOverridesOnMet
>> hodsRule$1.evaluate(NoShadowingOrOverridesOnMethodsRule.java:39)
>>       at
>> com.carrotsearch.randomizedtesting.rules.StatementAdapter.evaluate(Stat
>> ementAdapter.java:36)
>>       at
>> com.carrotsearch.randomizedtesting.rules.StatementAdapter.evaluate(Stat
>> ementAdapter.java:36)
>>       at
>> org.apache.lucene.util.TestRuleAssertionsRequired$1.evaluate(TestRuleAss
>> ertionsRequired.java:43)
>>       at
>> org.apache.lucene.util.TestRuleMarkFailure$1.evaluate(TestRuleMarkFailure
>> .java:48)
>>       at
>> org.apache.lucene.util.TestRuleIgnoreAfterMaxFailures$1.evaluate(TestRule
>> IgnoreAfterMaxFailures.java:65)
>>       at
>> org.apache.lucene.util.TestRuleIgnoreTestSuites$1.evaluate(TestRuleIgnore
>> TestSuites.java:55)
>>       at
>> com.carrotsearch.randomizedtesting.rules.StatementAdapter.evaluate(Stat
>> ementAdapter.java:36)
>>       at
>> com.carrotsearch.randomizedtesting.ThreadLeakControl$StatementRunner.
>> run(ThreadLeakControl.java:360)
>>       at java.lang.Thread.run(Thread.java:853)
>>
>>
>>
>>
>> Build Log:
>> [...truncated 1081 lines...]
>>    [junit4] Suite:
>> org.apache.lucene.codecs.perfield.TestPerFieldDocValuesFormat
>>    [junit4] IGNOR/A 0.01s J1 |
>> TestPerFieldDocValuesFormat.testHugeBinaryValueLimit
>>    [junit4]    > Assumption #1: test requires codec with limits on max binary
>> field length
>>    [junit4]   2> NOTE: reproduce with: ant test  -
>> Dtestcase=TestPerFieldDocValuesFormat -
>> Dtests.method=testShortNumericsVsStoredFields -
>> Dtests.seed=448BBB0F2B44D6F3 -Dtests.multiplier=3 -Dtests.slow=true -
>> Dtests.locale=fi -Dtests.timezone=America/Argentina/Jujuy -
>> Dtests.file.encoding=US-ASCII
>>    [junit4] ERROR   0.77s J1 |
>> TestPerFieldDocValuesFormat.testShortNumericsVsStoredFields <<<
>>    [junit4]    > Throwable #1: java.io.EOFException: read past EOF:
>> RAMInputStream(name=_2e_MockRandom_0.doc)
>>    [junit4]    >      at
>> __randomizedtesting.SeedInfo.seed([448BBB0F2B44D6F3:86FB2E28D75D989
>> C]:0)
>>    [junit4]    >      at
>> org.apache.lucene.store.RAMInputStream.switchCurrentBuffer(RAMInputSt
>> ream.java:94)
>>    [junit4]    >      at
>> org.apache.lucene.store.RAMInputStream.readByte(RAMInputStream.java:
>> 67)
>>    [junit4]    >      at
>> org.apache.lucene.store.DataInput.readVInt(DataInput.java:120)
>>    [junit4]    >      at
>> org.apache.lucene.codecs.mockintblock.MockFixedIntBlockPostingsFormat$
>> MockIntFactory$1$1.readBlock(MockFixedIntBlockPostingsFormat.java:96)
>>    [junit4]    >      at
>> org.apache.lucene.codecs.intblock.FixedIntBlockIndexInput$Reader.next(Fix
>> edIntBlockIndexInput.java:111)
>>    [junit4]    >      at
>> org.apache.lucene.codecs.sep.SepPostingsReader$SepDocsEnum.nextDoc(S
>> epPostingsReader.java:338)
>>    [junit4]    >      at
>> org.apache.lucene.codecs.MappingMultiDocsEnum.nextDoc(MappingMultiD
>> ocsEnum.java:104)
>>    [junit4]    >      at
>> org.apache.lucene.codecs.PostingsConsumer.merge(PostingsConsumer.java
>> :83)
>>    [junit4]    >      at
>> org.apache.lucene.codecs.TermsConsumer.merge(TermsConsumer.java:110
>> )
>>    [junit4]    >      at
>> org.apache.lucene.codecs.FieldsConsumer.merge(FieldsConsumer.java:72)
>>    [junit4]    >      at
>> org.apache.lucene.index.SegmentMerger.mergeTerms(SegmentMerger.jav
>> a:389)
>>    [junit4]    >      at
>> org.apache.lucene.index.SegmentMerger.merge(SegmentMerger.java:112)
>>    [junit4]    >      at
>> org.apache.lucene.index.IndexWriter.mergeMiddle(IndexWriter.java:4141)
>>    [junit4]    >      at
>> org.apache.lucene.index.IndexWriter.merge(IndexWriter.java:3737)
>>    [junit4]    >      at
>> org.apache.lucene.index.SerialMergeScheduler.merge(SerialMergeSchedule
>> r.java:40)
>>    [junit4]    >      at
>> org.apache.lucene.index.IndexWriter.maybeMerge(IndexWriter.java:1991)
>>    [junit4]    >      at
>> org.apache.lucene.index.IndexWriter.prepareCommitInternal(IndexWriter.j
>> ava:2992)
>>    [junit4]    >      at
>> org.apache.lucene.index.IndexWriter.commitInternal(IndexWriter.java:3101
>> )
>>    [junit4]    >      at
>> org.apache.lucene.index.IndexWriter.commit(IndexWriter.java:3068)
>>    [junit4]    >      at
>> org.apache.lucene.index.RandomIndexWriter.commit(RandomIndexWriter.j
>> ava:241)
>>    [junit4]    >      at
>> org.apache.lucene.index.BaseDocValuesFormatTestCase.doTestNumericsVs
>> StoredFields(BaseDocValuesFormatTestCase.java:1250)
>>    [junit4]    >      at
>> org.apache.lucene.index.BaseDocValuesFormatTestCase.doTestNumericsVs
>> StoredFields(BaseDocValuesFormatTestCase.java:1218)
>>    [junit4]    >      at
>> org.apache.lucene.index.BaseDocValuesFormatTestCase.testShortNumerics
>> VsStoredFields(BaseDocValuesFormatTestCase.java:1372)
>>    [junit4]    >      at java.lang.Thread.run(Thread.java:853)
>>    [junit4]   2> NOTE: leaving temporary files on disk at:
>> /mnt/ssd/jenkins/workspace/Lucene-Solr-4.x-
>> Linux@2/lucene/build/core/test/J1/./lucene.codecs.perfield.TestPerFieldDo
>> cValuesFormat-448BBB0F2B44D6F3-001
>>    [junit4]   2> NOTE: test params are: codec=CheapBastard,
>> sim=RandomSimilarityProvider(queryNorm=false,coord=crazy): {docId=DFR
>> G1, fieldname=DFR I(ne)B2, id=DFR I(n)LZ(0.3)}, locale=fi,
>> timezone=America/Argentina/Jujuy
>>    [junit4]   2> NOTE: Linux 3.8.0-38-generic x86/IBM Corporation 1.7.0 (32-
>> bit)/cpus=8,threads=1,free=153359720,total=314507264
>>    [junit4]   2> NOTE: All tests run in this JVM: [TestCodecHoldsOpenFiles,
>> TestSubScorerFreqs, TestEliasFanoSequence, TestBooleanQuery,
>> TestPerFieldPostingsFormat, TestTieredMergePolicy,
>> TestDoubleBarrelLRUCache, Before3, Before3, TestTerm,
>> TestAttributeSource, TestBasics, TestLongPostings, TestEliasFanoDocIdSet,
>> TestHighCompressionMode, TestIndexWriterDelete,
>> TestSnapshotDeletionPolicy, TestRAMDirectory, TestIndexWriterUnicode,
>> TestQueryBuilder, TestLevenshteinAutomata, TestLazyProxSkipping,
>> TestSimilarityBase, TestWorstCaseTestBehavior, TestMinimize,
>> TestRecyclingByteBlockAllocator, TestConsistentFieldNumbers,
>> TestFieldInfos, Nested1, TestIndexWriterConfig, TestGraphTokenizers,
>> Nested1, TestSortDocValues, TestConstantScoreQuery,
>> TestDocInverterPerFieldErrorInfo, TestNRTCachingDirectory, TestPrefixFilter,
>> TestLucene40TermVectorsFormat, TestSpanExplanations,
>> TestIndexWriterLockRelease, TestRegexpRandom, TestMixedCodecs,
>> TestTopDocsCollector, TestCompressingStoredFieldsFormat,
>> TestExplanations, TestBitVector, TestBinaryDocValuesUpdates,
>> InBeforeClass, InAfterClass, InTestMethod, NonStringProperties,
>> TestIndexInput, TestGroupFiltering, TestIndexWriterNRTIsCurrent,
>> TestNearSpansOrdered, TestSpans, TestCrashCausesCorruptIndex,
>> TestLiveFieldValues, TestOmitNorms, TestWildcardRandom, TestTermScorer,
>> TestOmitPositions, TestSimpleSearchEquivalence,
>> TestPerFieldPostingsFormat2, TestDocCount, TestSegmentTermEnum,
>> TestDocValuesIndexing, TestCharFilter, TestDocIdSet, TestDocsAndPositions,
>> TestSimpleAttributeImpl, TestIndexWriterWithThreads,
>> TestAutomatonQuery, Nested1, TestSumDocFreq,
>> TestSpanSearchEquivalence, TestRegexpRandom2, TestDocIdBitSet,
>> TestSmallFloat, TestCodecs, TestPayloadExplanations,
>> TestSpanMultiTermQueryWrapper, TestIndexWriterMergePolicy,
>> TestSearchWithThreads, TestUnicodeUtil, Test2BNumericDocValues,
>> TestNumericUtils, MultiCollectorTest, TestTermVectorsReader,
>> TestDocument, TestToken, TestBackwardsCompatibility3x,
>> TestTermVectorsFormat, TestSpecialOperations, TestPayloadsOnVectors,
>> TestPrefixCodedTerms, TestFilterAtomicReader, TestVersionComparator,
>> TestTransactions, TestBackwardsCompatibility, TestDocumentWriter,
>> TestForUtil, TestTryDelete, TestPerFieldDocValuesFormat]
>>    [junit4] Completed on J1 in 84.02s, 80 tests, 1 error, 1 skipped <<<
>> FAILURES!
>>
>> [...truncated 146 lines...]
>>    [junit4] Suite: org.apache.lucene.index.TestStressIndexing
>>    [junit4]   2> avr. 26, 2014 2:22:53 PM
>> com.carrotsearch.randomizedtesting.RandomizedRunner$QueueUncaughtE
>> xceptionsHandler uncaughtException
>>    [junit4]   2> AVERTISSEMENT: Uncaught exception in thread: Thread[Lucene
>> Merge Thread #1,6,TGRP-TestStressIndexing]
>>    [junit4]   2> org.apache.lucene.index.MergePolicy$MergeException:
>> java.lang.AssertionError: index=523, numBits=426
>>    [junit4]   2>      at
>> __randomizedtesting.SeedInfo.seed([448BBB0F2B44D6F3]:0)
>>    [junit4]   2>      at
>> org.apache.lucene.index.ConcurrentMergeScheduler.handleMergeExceptio
>> n(ConcurrentMergeScheduler.java:545)
>>    [junit4]   2>      at
>> org.apache.lucene.index.ConcurrentMergeScheduler$MergeThread.run(Co
>> ncurrentMergeScheduler.java:518)
>>    [junit4]   2> Caused by: java.lang.AssertionError: index=523, numBits=426
>>    [junit4]   2>      at
>> org.apache.lucene.util.FixedBitSet.set(FixedBitSet.java:245)
>>    [junit4]   2>      at
>> org.apache.lucene.codecs.PostingsConsumer.merge(PostingsConsumer.java
>> :87)
>>    [junit4]   2>      at
>> org.apache.lucene.codecs.TermsConsumer.merge(TermsConsumer.java:110
>> )
>>    [junit4]   2>      at
>> org.apache.lucene.codecs.FieldsConsumer.merge(FieldsConsumer.java:72)
>>    [junit4]   2>      at
>> org.apache.lucene.index.SegmentMerger.mergeTerms(SegmentMerger.jav
>> a:389)
>>    [junit4]   2>      at
>> org.apache.lucene.index.SegmentMerger.merge(SegmentMerger.java:112)
>>    [junit4]   2>      at
>> org.apache.lucene.index.IndexWriter.mergeMiddle(IndexWriter.java:4141)
>>    [junit4]   2>      at
>> org.apache.lucene.index.IndexWriter.merge(IndexWriter.java:3737)
>>    [junit4]   2>      at
>> org.apache.lucene.index.ConcurrentMergeScheduler.doMerge(Concurrent
>> MergeScheduler.java:405)
>>    [junit4]   2>      at
>> org.apache.lucene.index.ConcurrentMergeScheduler$MergeThread.run(Co
>> ncurrentMergeScheduler.java:482)
>>    [junit4]   2>
>>    [junit4]   2> avr. 26, 2014 2:22:53 PM
>> com.carrotsearch.randomizedtesting.RandomizedRunner$QueueUncaughtE
>> xceptionsHandler uncaughtException
>>    [junit4]   2> AVERTISSEMENT: Uncaught exception in thread: Thread[Lucene
>> Merge Thread #2,6,TGRP-TestStressIndexing]
>>    [junit4]   2> org.apache.lucene.index.MergePolicy$MergeException:
>> java.lang.AssertionError: index=523, numBits=426
>>    [junit4]   2>      at
>> __randomizedtesting.SeedInfo.seed([448BBB0F2B44D6F3]:0)
>>    [junit4]   2>      at
>> org.apache.lucene.index.ConcurrentMergeScheduler.handleMergeExceptio
>> n(ConcurrentMergeScheduler.java:545)
>>    [junit4]   2>      at
>> org.apache.lucene.index.ConcurrentMergeScheduler$MergeThread.run(Co
>> ncurrentMergeScheduler.java:518)
>>    [junit4]   2> Caused by: java.lang.AssertionError: index=523, numBits=426
>>    [junit4]   2>      at
>> org.apache.lucene.util.FixedBitSet.set(FixedBitSet.java:245)
>>    [junit4]   2>      at
>> org.apache.lucene.codecs.PostingsConsumer.merge(PostingsConsumer.java
>> :87)
>>    [junit4]   2>      at
>> org.apache.lucene.codecs.TermsConsumer.merge(TermsConsumer.java:110
>> )
>>    [junit4]   2>      at
>> org.apache.lucene.codecs.FieldsConsumer.merge(FieldsConsumer.java:72)
>>    [junit4]   2>      at
>> org.apache.lucene.index.SegmentMerger.mergeTerms(SegmentMerger.jav
>> a:389)
>>    [junit4]   2>      at
>> org.apache.lucene.index.SegmentMerger.merge(SegmentMerger.java:112)
>>    [junit4]   2>      at
>> org.apache.lucene.index.IndexWriter.mergeMiddle(IndexWriter.java:4141)
>>    [junit4]   2>      at
>> org.apache.lucene.index.IndexWriter.merge(IndexWriter.java:3737)
>>    [junit4]   2>      at
>> org.apache.lucene.index.ConcurrentMergeScheduler.doMerge(Concurrent
>> MergeScheduler.java:405)
>>    [junit4]   2>      at
>> org.apache.lucene.index.ConcurrentMergeScheduler$MergeThread.run(Co
>> ncurrentMergeScheduler.java:482)
>>    [junit4]   2>
>>    [junit4]   2> avr. 26, 2014 2:22:53 PM
>> com.carrotsearch.randomizedtesting.RandomizedRunner$QueueUncaughtE
>> xceptionsHandler uncaughtException
>>    [junit4]   2> AVERTISSEMENT: Uncaught exception in thread: Thread[Lucene
>> Merge Thread #3,6,TGRP-TestStressIndexing]
>>    [junit4]   2> org.apache.lucene.index.MergePolicy$MergeException:
>> java.lang.AssertionError: index=523, numBits=426
>>    [junit4]   2>      at
>> __randomizedtesting.SeedInfo.seed([448BBB0F2B44D6F3]:0)
>>    [junit4]   2>      at
>> org.apache.lucene.index.ConcurrentMergeScheduler.handleMergeExceptio
>> n(ConcurrentMergeScheduler.java:545)
>>    [junit4]   2>      at
>> org.apache.lucene.index.ConcurrentMergeScheduler$MergeThread.run(Co
>> ncurrentMergeScheduler.java:518)
>>    [junit4]   2> Caused by: java.lang.AssertionError: index=523, numBits=426
>>    [junit4]   2>      at
>> org.apache.lucene.util.FixedBitSet.set(FixedBitSet.java:245)
>>    [junit4]   2>      at
>> org.apache.lucene.codecs.PostingsConsumer.merge(PostingsConsumer.java
>> :87)
>>    [junit4]   2>      at
>> org.apache.lucene.codecs.TermsConsumer.merge(TermsConsumer.java:110
>> )
>>    [junit4]   2>      at
>> org.apache.lucene.codecs.FieldsConsumer.merge(FieldsConsumer.java:72)
>>    [junit4]   2>      at
>> org.apache.lucene.index.SegmentMerger.mergeTerms(SegmentMerger.jav
>> a:389)
>>    [junit4]   2>      at
>> org.apache.lucene.index.SegmentMerger.merge(SegmentMerger.java:112)
>>    [junit4]   2>      at
>> org.apache.lucene.index.IndexWriter.mergeMiddle(IndexWriter.java:4141)
>>    [junit4]   2>      at
>> org.apache.lucene.index.IndexWriter.merge(IndexWriter.java:3737)
>>    [junit4]   2>      at
>> org.apache.lucene.index.ConcurrentMergeScheduler.doMerge(Concurrent
>> MergeScheduler.java:405)
>>    [junit4]   2>      at
>> org.apache.lucene.index.ConcurrentMergeScheduler$MergeThread.run(Co
>> ncurrentMergeScheduler.java:482)
>>    [junit4]   2>
>>    [junit4]   2> avr. 26, 2014 2:22:54 PM
>> com.carrotsearch.randomizedtesting.RandomizedRunner$QueueUncaughtE
>> xceptionsHandler uncaughtException
>>    [junit4]   2> AVERTISSEMENT: Uncaught exception in thread: Thread[Lucene
>> Merge Thread #4,6,TGRP-TestStressIndexing]
>>    [junit4]   2> org.apache.lucene.index.MergePolicy$MergeException:
>> java.lang.AssertionError: index=523, numBits=426
>>    [junit4]   2>      at
>> __randomizedtesting.SeedInfo.seed([448BBB0F2B44D6F3]:0)
>>    [junit4]   2>      at
>> org.apache.lucene.index.ConcurrentMergeScheduler.handleMergeExceptio
>> n(ConcurrentMergeScheduler.java:545)
>>    [junit4]   2>      at
>> org.apache.lucene.index.ConcurrentMergeScheduler$MergeThread.run(Co
>> ncurrentMergeScheduler.java:518)
>>    [junit4]   2> Caused by: java.lang.AssertionError: index=523, numBits=426
>>    [junit4]   2>      at
>> org.apache.lucene.util.FixedBitSet.set(FixedBitSet.java:245)
>>    [junit4]   2>      at
>> org.apache.lucene.codecs.PostingsConsumer.merge(PostingsConsumer.java
>> :87)
>>    [junit4]   2>      at
>> org.apache.lucene.codecs.TermsConsumer.merge(TermsConsumer.java:110
>> )
>>    [junit4]   2>      at
>> org.apache.lucene.codecs.FieldsConsumer.merge(FieldsConsumer.java:72)
>>    [junit4]   2>      at
>> org.apache.lucene.index.SegmentMerger.mergeTerms(SegmentMerger.jav
>> a:389)
>>    [junit4]   2>      at
>> org.apache.lucene.index.SegmentMerger.merge(SegmentMerger.java:112)
>>    [junit4]   2>      at
>> org.apache.lucene.index.IndexWriter.mergeMiddle(IndexWriter.java:4141)
>>    [junit4]   2>      at
>> org.apache.lucene.index.IndexWriter.merge(IndexWriter.java:3737)
>>    [junit4]   2>      at
>> org.apache.lucene.index.ConcurrentMergeScheduler.doMerge(Concurrent
>> MergeScheduler.java:405)
>>    [junit4]   2>      at
>> org.apache.lucene.index.ConcurrentMergeScheduler$MergeThread.run(Co
>> ncurrentMergeScheduler.java:482)
>>    [junit4]   2>
>>    [junit4]   2> avr. 26, 2014 2:22:54 PM
>> com.carrotsearch.randomizedtesting.RandomizedRunner$QueueUncaughtE
>> xceptionsHandler uncaughtException
>>    [junit4]   2> AVERTISSEMENT: Uncaught exception in thread: Thread[Lucene
>> Merge Thread #5,6,TGRP-TestStressIndexing]
>>    [junit4]   2> org.apache.lucene.index.MergePolicy$MergeException:
>> java.lang.AssertionError: index=523, numBits=426
>>    [junit4]   2>      at
>> __randomizedtesting.SeedInfo.seed([448BBB0F2B44D6F3]:0)
>>    [junit4]   2>      at
>> org.apache.lucene.index.ConcurrentMergeScheduler.handleMergeExceptio
>> n(ConcurrentMergeScheduler.java:545)
>>    [junit4]   2>      at
>> org.apache.lucene.index.ConcurrentMergeScheduler$MergeThread.run(Co
>> ncurrentMergeScheduler.java:518)
>>    [junit4]   2> Caused by: java.lang.AssertionError: index=523, numBits=426
>>    [junit4]   2>      at
>> org.apache.lucene.util.FixedBitSet.set(FixedBitSet.java:245)
>>    [junit4]   2>      at
>> org.apache.lucene.codecs.PostingsConsumer.merge(PostingsConsumer.java
>> :87)
>>    [junit4]   2>      at
>> org.apache.lucene.codecs.TermsConsumer.merge(TermsConsumer.java:110
>> )
>>    [junit4]   2>      at
>> org.apache.lucene.codecs.FieldsConsumer.merge(FieldsConsumer.java:72)
>>    [junit4]   2>      at
>> org.apache.lucene.index.SegmentMerger.mergeTerms(SegmentMerger.jav
>> a:389)
>>    [junit4]   2>      at
>> org.apache.lucene.index.SegmentMerger.merge(SegmentMerger.java:112)
>>    [junit4]   2>      at
>> org.apache.lucene.index.IndexWriter.mergeMiddle(IndexWriter.java:4141)
>>    [junit4]   2>      at
>> org.apache.lucene.index.IndexWriter.merge(IndexWriter.java:3737)
>>    [junit4]   2>      at
>> org.apache.lucene.index.ConcurrentMergeScheduler.doMerge(Concurrent
>> MergeScheduler.java:405)
>>    [junit4]   2>      at
>> org.apache.lucene.index.ConcurrentMergeScheduler$MergeThread.run(Co
>> ncurrentMergeScheduler.java:482)
>>    [junit4]   2>
>>    [junit4]   2> avr. 26, 2014 2:22:54 PM
>> com.carrotsearch.randomizedtesting.RandomizedRunner$QueueUncaughtE
>> xceptionsHandler uncaughtException
>>    [junit4]   2> AVERTISSEMENT: Uncaught exception in thread: Thread[Lucene
>> Merge Thread #6,6,TGRP-TestStressIndexing]
>>    [junit4]   2> org.apache.lucene.index.MergePolicy$MergeException:
>> java.lang.AssertionError: index=523, numBits=426
>>    [junit4]   2>      at
>> __randomizedtesting.SeedInfo.seed([448BBB0F2B44D6F3]:0)
>>    [junit4]   2>      at
>> org.apache.lucene.index.ConcurrentMergeScheduler.handleMergeExceptio
>> n(ConcurrentMergeScheduler.java:545)
>>    [junit4]   2>      at
>> org.apache.lucene.index.ConcurrentMergeScheduler$MergeThread.run(Co
>> ncurrentMergeScheduler.java:518)
>>    [junit4]   2> Caused by: java.lang.AssertionError: index=523, numBits=426
>>    [junit4]   2>      at
>> org.apache.lucene.util.FixedBitSet.set(FixedBitSet.java:245)
>>    [junit4]   2>      at
>> org.apache.lucene.codecs.PostingsConsumer.merge(PostingsConsumer.java
>> :87)
>>    [junit4]   2>      at
>> org.apache.lucene.codecs.TermsConsumer.merge(TermsConsumer.java:110
>> )
>>    [junit4]   2>      at
>> org.apache.lucene.codecs.FieldsConsumer.merge(FieldsConsumer.java:72)
>>    [junit4]   2>      at
>> org.apache.lucene.index.SegmentMerger.mergeTerms(SegmentMerger.jav
>> a:389)
>>    [junit4]   2>      at
>> org.apache.lucene.index.SegmentMerger.merge(SegmentMerger.java:112)
>>    [junit4]   2>      at
>> org.apache.lucene.index.IndexWriter.mergeMiddle(IndexWriter.java:4141)
>>    [junit4]   2>      at
>> org.apache.lucene.index.IndexWriter.merge(IndexWriter.java:3737)
>>    [junit4]   2>      at
>> org.apache.lucene.index.ConcurrentMergeScheduler.doMerge(Concurrent
>> MergeScheduler.java:405)
>>    [junit4]   2>      at
>> org.apache.lucene.index.ConcurrentMergeScheduler$MergeThread.run(Co
>> ncurrentMergeScheduler.java:482)
>>    [junit4]   2>
>>    [junit4]   2> avr. 26, 2014 2:22:54 PM
>> com.carrotsearch.randomizedtesting.RandomizedRunner$QueueUncaughtE
>> xceptionsHandler uncaughtException
>>    [junit4]   2> AVERTISSEMENT: Uncaught exception in thread: Thread[Lucene
>> Merge Thread #7,6,TGRP-TestStressIndexing]
>>    [junit4]   2> org.apache.lucene.index.MergePolicy$MergeException:
>> java.lang.AssertionError: index=523, numBits=426
>>    [junit4]   2>      at
>> __randomizedtesting.SeedInfo.seed([448BBB0F2B44D6F3]:0)
>>    [junit4]   2>      at
>> org.apache.lucene.index.ConcurrentMergeScheduler.handleMergeExceptio
>> n(ConcurrentMergeScheduler.java:545)
>>    [junit4]   2>      at
>> org.apache.lucene.index.ConcurrentMergeScheduler$MergeThread.run(Co
>> ncurrentMergeScheduler.java:518)
>>    [junit4]   2> Caused by: java.lang.AssertionError: index=523, numBits=426
>>    [junit4]   2>      at
>> org.apache.lucene.util.FixedBitSet.set(FixedBitSet.java:245)
>>    [junit4]   2>      at
>> org.apache.lucene.codecs.PostingsConsumer.merge(PostingsConsumer.java
>> :87)
>>    [junit4]   2>      at
>> org.apache.lucene.codecs.TermsConsumer.merge(TermsConsumer.java:110
>> )
>>    [junit4]   2>      at
>> org.apache.lucene.codecs.FieldsConsumer.merge(FieldsConsumer.java:72)
>>    [junit4]   2>      at
>> org.apache.lucene.index.SegmentMerger.mergeTerms(SegmentMerger.jav
>> a:389)
>>    [junit4]   2>      at
>> org.apache.lucene.index.SegmentMerger.merge(SegmentMerger.java:112)
>>    [junit4]   2>      at
>> org.apache.lucene.index.IndexWriter.mergeMiddle(IndexWriter.java:4141)
>>    [junit4]   2>      at
>> org.apache.lucene.index.IndexWriter.merge(IndexWriter.java:3737)
>>    [junit4]   2>      at
>> org.apache.lucene.index.ConcurrentMergeScheduler.doMerge(Concurrent
>> MergeScheduler.java:405)
>>    [junit4]   2>      at
>> org.apache.lucene.index.ConcurrentMergeScheduler$MergeThread.run(Co
>> ncurrentMergeScheduler.java:482)
>>    [junit4]   2>
>>    [junit4]   2> avr. 26, 2014 2:22:54 PM
>> com.carrotsearch.randomizedtesting.RandomizedRunner$QueueUncaughtE
>> xceptionsHandler uncaughtException
>>    [junit4]   2> AVERTISSEMENT: Uncaught exception in thread: Thread[Lucene
>> Merge Thread #8,6,TGRP-TestStressIndexing]
>>    [junit4]   2> org.apache.lucene.index.MergePolicy$MergeException:
>> java.lang.AssertionError: index=523, numBits=426
>>    [junit4]   2>      at
>> __randomizedtesting.SeedInfo.seed([448BBB0F2B44D6F3]:0)
>>    [junit4]   2>      at
>> org.apache.lucene.index.ConcurrentMergeScheduler.handleMergeExceptio
>> n(ConcurrentMergeScheduler.java:545)
>>    [junit4]   2>      at
>> org.apache.lucene.index.ConcurrentMergeScheduler$MergeThread.run(Co
>> ncurrentMergeScheduler.java:518)
>>    [junit4]   2> Caused by: java.lang.AssertionError: index=523, numBits=426
>>    [junit4]   2>      at
>> org.apache.lucene.util.FixedBitSet.set(FixedBitSet.java:245)
>>    [junit4]   2>      at
>> org.apache.lucene.codecs.PostingsConsumer.merge(PostingsConsumer.java
>> :87)
>>    [junit4]   2>      at
>> org.apache.lucene.codecs.TermsConsumer.merge(TermsConsumer.java:110
>> )
>>    [junit4]   2>      at
>> org.apache.lucene.codecs.FieldsConsumer.merge(FieldsConsumer.java:72)
>>    [junit4]   2>      at
>> org.apache.lucene.index.SegmentMerger.mergeTerms(SegmentMerger.jav
>> a:389)
>>    [junit4]   2>      at
>> org.apache.lucene.index.SegmentMerger.merge(SegmentMerger.java:112)
>>    [junit4]   2>      at
>> org.apache.lucene.index.IndexWriter.mergeMiddle(IndexWriter.java:4141)
>>    [junit4]   2>      at
>> org.apache.lucene.index.IndexWriter.merge(IndexWriter.java:3737)
>>    [junit4]   2>      at
>> org.apache.lucene.index.ConcurrentMergeScheduler.doMerge(Concurrent
>> MergeScheduler.java:405)
>>    [junit4]   2>      at
>> org.apache.lucene.index.ConcurrentMergeScheduler$MergeThread.run(Co
>> ncurrentMergeScheduler.java:482)
>>    [junit4]   2>
>>    [junit4]   2> avr. 26, 2014 2:22:55 PM
>> com.carrotsearch.randomizedtesting.RandomizedRunner$QueueUncaughtE
>> xceptionsHandler uncaughtException
>>    [junit4]   2> AVERTISSEMENT: Uncaught exception in thread: Thread[Lucene
>> Merge Thread #10,6,TGRP-TestStressIndexing]
>>    [junit4]   2> org.apache.lucene.index.MergePolicy$MergeException:
>> java.lang.AssertionError: index=523, numBits=426
>>    [junit4]   2>      at
>> __randomizedtesting.SeedInfo.seed([448BBB0F2B44D6F3]:0)
>>    [junit4]   2>      at
>> org.apache.lucene.index.ConcurrentMergeScheduler.handleMergeExceptio
>> n(ConcurrentMergeScheduler.java:545)
>>    [junit4]   2>      at
>> org.apache.lucene.index.ConcurrentMergeScheduler$MergeThread.run(Co
>> ncurrentMergeScheduler.java:518)
>>    [junit4]   2> Caused by: java.lang.AssertionError: index=523, numBits=426
>>    [junit4]   2>      at
>> org.apache.lucene.util.FixedBitSet.set(FixedBitSet.java:245)
>>    [junit4]   2>      at
>> org.apache.lucene.codecs.PostingsConsumer.merge(PostingsConsumer.java
>> :87)
>>    [junit4]   2>      at
>> org.apache.lucene.codecs.TermsConsumer.merge(TermsConsumer.java:110
>> )
>>    [junit4]   2>      at
>> org.apache.lucene.codecs.FieldsConsumer.merge(FieldsConsumer.java:72)
>>    [junit4]   2>      at
>> org.apache.lucene.index.SegmentMerger.mergeTerms(SegmentMerger.jav
>> a:389)
>>    [junit4]   2>      at
>> org.apache.lucene.index.SegmentMerger.merge(SegmentMerger.java:112)
>>    [junit4]   2>      at
>> org.apache.lucene.index.IndexWriter.mergeMiddle(IndexWriter.java:4141)
>>    [junit4]   2>      at
>> org.apache.lucene.index.IndexWriter.merge(IndexWriter.java:3737)
>>    [junit4]   2>      at
>> org.apache.lucene.index.ConcurrentMergeScheduler.doMerge(Concurrent
>> MergeScheduler.java:405)
>>    [junit4]   2>      at
>> org.apache.lucene.index.ConcurrentMergeScheduler$MergeThread.run(Co
>> ncurrentMergeScheduler.java:482)
>>    [junit4]   2>
>>    [junit4]   2> avr. 26, 2014 2:22:55 PM
>> com.carrotsearch.randomizedtesting.RandomizedRunner$QueueUncaughtE
>> xceptionsHandler uncaughtException
>>    [junit4]   2> AVERTISSEMENT: Uncaught exception in thread: Thread[Lucene
>> Merge Thread #11,6,TGRP-TestStressIndexing]
>>    [junit4]   2> org.apache.lucene.index.MergePolicy$MergeException:
>> java.lang.AssertionError: index=523, numBits=426
>>    [junit4]   2>      at
>> __randomizedtesting.SeedInfo.seed([448BBB0F2B44D6F3]:0)
>>    [junit4]   2>      at
>> org.apache.lucene.index.ConcurrentMergeScheduler.handleMergeExceptio
>> n(ConcurrentMergeScheduler.java:545)
>>    [junit4]   2>      at
>> org.apache.lucene.index.ConcurrentMergeScheduler$MergeThread.run(Co
>> ncurrentMergeScheduler.java:518)
>>    [junit4]   2> Caused by: java.lang.AssertionError: index=523, numBits=426
>>    [junit4]   2>      at
>> org.apache.lucene.util.FixedBitSet.set(FixedBitSet.java:245)
>>    [junit4]   2>      at
>> org.apache.lucene.codecs.PostingsConsumer.merge(PostingsConsumer.java
>> :87)
>>    [junit4]   2>      at
>> org.apache.lucene.codecs.TermsConsumer.merge(TermsConsumer.java:110
>> )
>>    [junit4]   2>      at
>> org.apache.lucene.codecs.FieldsConsumer.merge(FieldsConsumer.java:72)
>>    [junit4]   2>      at
>> org.apache.lucene.index.SegmentMerger.mergeTerms(SegmentMerger.jav
>> a:389)
>>    [junit4]   2>      at
>> org.apache.lucene.index.SegmentMerger.merge(SegmentMerger.java:112)
>>    [junit4]   2>      at
>> org.apache.lucene.index.IndexWriter.mergeMiddle(IndexWriter.java:4141)
>>    [junit4]   2>      at
>> org.apache.lucene.index.IndexWriter.merge(IndexWriter.java:3737)
>>    [junit4]   2>      at
>> org.apache.lucene.index.ConcurrentMergeScheduler.doMerge(Concurrent
>> MergeScheduler.java:405)
>>    [junit4]   2>      at
>> org.apache.lucene.index.ConcurrentMergeScheduler$MergeThread.run(Co
>> ncurrentMergeScheduler.java:482)
>>    [junit4]   2>
>>    [junit4]   2> avr. 26, 2014 2:22:55 PM
>> com.carrotsearch.randomizedtesting.RandomizedRunner$QueueUncaughtE
>> xceptionsHandler uncaughtException
>>    [junit4]   2> AVERTISSEMENT: Uncaught exception in thread: Thread[Lucene
>> Merge Thread #12,6,TGRP-TestStressIndexing]
>>    [junit4]   2> org.apache.lucene.index.MergePolicy$MergeException:
>> java.lang.AssertionError: index=523, numBits=426
>>    [junit4]   2>      at
>> __randomizedtesting.SeedInfo.seed([448BBB0F2B44D6F3]:0)
>>    [junit4]   2>      at
>> org.apache.lucene.index.ConcurrentMergeScheduler.handleMergeExceptio
>> n(ConcurrentMergeScheduler.java:545)
>>    [junit4]   2>      at
>> org.apache.lucene.index.ConcurrentMergeScheduler$MergeThread.run(Co
>> ncurrentMergeScheduler.java:518)
>>    [junit4]   2> Caused by: java.lang.AssertionError: index=523, numBits=426
>>    [junit4]   2>      at
>> org.apache.lucene.util.FixedBitSet.set(FixedBitSet.java:245)
>>    [junit4]   2>      at
>> org.apache.lucene.codecs.PostingsConsumer.merge(PostingsConsumer.java
>> :87)
>>    [junit4]   2>      at
>> org.apache.lucene.codecs.TermsConsumer.merge(TermsConsumer.java:110
>> )
>>    [junit4]   2>      at
>> org.apache.lucene.codecs.FieldsConsumer.merge(FieldsConsumer.java:72)
>>    [junit4]   2>      at
>> org.apache.lucene.index.SegmentMerger.mergeTerms(SegmentMerger.jav
>> a:389)
>>    [junit4]   2>      at
>> org.apache.lucene.index.SegmentMerger.merge(SegmentMerger.java:112)
>>    [junit4]   2>      at
>> org.apache.lucene.index.IndexWriter.mergeMiddle(IndexWriter.java:4141)
>>    [junit4]   2>      at
>> org.apache.lucene.index.IndexWriter.merge(IndexWriter.java:3737)
>>    [junit4]   2>      at
>> org.apache.lucene.index.ConcurrentMergeScheduler.doMerge(Concurrent
>> MergeScheduler.java:405)
>>    [junit4]   2>      at
>> org.apache.lucene.index.ConcurrentMergeScheduler$MergeThread.run(Co
>> ncurrentMergeScheduler.java:482)
>>    [junit4]   2>
>>    [junit4]   2> avr. 26, 2014 2:22:55 PM
>> com.carrotsearch.randomizedtesting.RandomizedRunner$QueueUncaughtE
>> xceptionsHandler uncaughtException
>>    [junit4]   2> AVERTISSEMENT: Uncaught exception in thread: Thread[Lucene
>> Merge Thread #13,6,TGRP-TestStressIndexing]
>>    [junit4]   2> org.apache.lucene.index.MergePolicy$MergeException:
>> java.lang.AssertionError: index=523, numBits=426
>>    [junit4]   2>      at
>> __randomizedtesting.SeedInfo.seed([448BBB0F2B44D6F3]:0)
>>    [junit4]   2>      at
>> org.apache.lucene.index.ConcurrentMergeScheduler.handleMergeExceptio
>> n(ConcurrentMergeScheduler.java:545)
>>    [junit4]   2>      at
>> org.apache.lucene.index.ConcurrentMergeScheduler$MergeThread.run(Co
>> ncurrentMergeScheduler.java:518)
>>    [junit4]   2> Caused by: java.lang.AssertionError: index=523, numBits=426
>>    [junit4]   2>      at
>> org.apache.lucene.util.FixedBitSet.set(FixedBitSet.java:245)
>>    [junit4]   2>      at
>> org.apache.lucene.codecs.PostingsConsumer.merge(PostingsConsumer.java
>> :87)
>>    [junit4]   2>      at
>> org.apache.lucene.codecs.TermsConsumer.merge(TermsConsumer.java:110
>> )
>>    [junit4]   2>      at
>> org.apache.lucene.codecs.FieldsConsumer.merge(FieldsConsumer.java:72)
>>    [junit4]   2>      at
>> org.apache.lucene.index.SegmentMerger.mergeTerms(SegmentMerger.jav
>> a:389)
>>    [junit4]   2>      at
>> org.apache.lucene.index.SegmentMerger.merge(SegmentMerger.java:112)
>>    [junit4]   2>      at
>> org.apache.lucene.index.IndexWriter.mergeMiddle(IndexWriter.java:4141)
>>    [junit4]   2>      at
>> org.apache.lucene.index.IndexWriter.merge(IndexWriter.java:3737)
>>    [junit4]   2>      at
>> org.apache.lucene.index.ConcurrentMergeScheduler.doMerge(Concurrent
>> MergeScheduler.java:405)
>>    [junit4]   2>      at
>> org.apache.lucene.index.ConcurrentMergeScheduler$MergeThread.run(Co
>> ncurrentMergeScheduler.java:482)
>>    [junit4]   2>
>>    [junit4]   2> avr. 26, 2014 2:22:56 PM
>> com.carrotsearch.randomizedtesting.RandomizedRunner$QueueUncaughtE
>> xceptionsHandler uncaughtException
>>    [junit4]   2> AVERTISSEMENT: Uncaught exception in thread: Thread[Lucene
>> Merge Thread #14,6,TGRP-TestStressIndexing]
>>    [junit4]   2> org.apache.lucene.index.MergePolicy$MergeException:
>> java.lang.AssertionError: index=523, numBits=426
>>    [junit4]   2>      at
>> __randomizedtesting.SeedInfo.seed([448BBB0F2B44D6F3]:0)
>>    [junit4]   2>      at
>> org.apache.lucene.index.ConcurrentMergeScheduler.handleMergeExceptio
>> n(ConcurrentMergeScheduler.java:545)
>>    [junit4]   2>      at
>> org.apache.lucene.index.ConcurrentMergeScheduler$MergeThread.run(Co
>> ncurrentMergeScheduler.java:518)
>>    [junit4]   2> Caused by: java.lang.AssertionError: index=523, numBits=426
>>    [junit4]   2>      at
>> org.apache.lucene.util.FixedBitSet.set(FixedBitSet.java:245)
>>    [junit4]   2>      at
>> org.apache.lucene.codecs.PostingsConsumer.merge(PostingsConsumer.java
>> :87)
>>    [junit4]   2>      at
>> org.apache.lucene.codecs.TermsConsumer.merge(TermsConsumer.java:110
>> )
>>    [junit4]   2>      at
>> org.apache.lucene.codecs.FieldsConsumer.merge(FieldsConsumer.java:72)
>>    [junit4]   2>      at
>> org.apache.lucene.index.SegmentMerger.mergeTerms(SegmentMerger.jav
>> a:389)
>>    [junit4]   2>      at
>> org.apache.lucene.index.SegmentMerger.merge(SegmentMerger.java:112)
>>    [junit4]   2>      at
>> org.apache.lucene.index.IndexWriter.mergeMiddle(IndexWriter.java:4141)
>>    [junit4]   2>      at
>> org.apache.lucene.index.IndexWriter.merge(IndexWriter.java:3737)
>>    [junit4]   2>      at
>> org.apache.lucene.index.ConcurrentMergeScheduler.doMerge(Concurrent
>> MergeScheduler.java:405)
>>    [junit4]   2>      at
>> org.apache.lucene.index.ConcurrentMergeScheduler$MergeThread.run(Co
>> ncurrentMergeScheduler.java:482)
>>    [junit4]   2>
>>    [junit4]   1> CheckIndex failed
>>    [junit4]   1> Segments file=segments_2 numSegments=77 version=4.9
>> format=
>>    [junit4]   1>   1 of 77: name=_1c docCount=216
>>    [junit4]   1>     codec=Lucene46
>>    [junit4]   1>     compound=false
>>    [junit4]   1>     numFiles=14
>>    [junit4]   1>     size (MB)=0.017
>>    [junit4]   1>     diagnostics = {java.version=1.7.0, mergeFactor=43,
>> source=merge, os.version=3.8.0-38-generic, java.vendor=IBM Corporation,
>> mergeMaxNumSegments=-1, lucene.version=4.9-SNAPSHOT,
>> timestamp=1398540172628, os.arch=x86, os=Linux}
>>    [junit4]   1>     no deletions
>>    [junit4]   1>     test: open reader.........OK
>>    [junit4]   1>     test: check integrity.....OK
>>    [junit4]   1>     test: check live docs.....OK
>>    [junit4]   1>     test: fields..............OK [2 fields]
>>    [junit4]   1>     test: field norms.........OK [1 fields]
>>    [junit4]   1>     test: terms, freq, prox...ERROR: java.lang.AssertionError:
>> index=235, numBits=216
>>    [junit4]   1> java.lang.AssertionError: index=235, numBits=216
>>    [junit4]   1>      at
>> org.apache.lucene.util.FixedBitSet.set(FixedBitSet.java:245)
>>    [junit4]   1>      at
>> org.apache.lucene.index.CheckIndex.checkFields(CheckIndex.java:927)
>>    [junit4]   1>      at
>> org.apache.lucene.index.CheckIndex.testPostings(CheckIndex.java:1320)
>>    [junit4]   1>      at
>> org.apache.lucene.index.CheckIndex.checkIndex(CheckIndex.java:626)
>>    [junit4]   1>      at
>> org.apache.lucene.util.TestUtil.checkIndex(TestUtil.java:199)
>>    [junit4]   1>      at
>> org.apache.lucene.store.MockDirectoryWrapper.close(MockDirectoryWrapp
>> er.java:681)
>>    [junit4]   1>      at
>> org.apache.lucene.index.TestStressIndexing.testStressIndexAndSearching(T
>> estStressIndexing.java:173)
>>    [junit4]   1>      at sun.reflect.NativeMethodAccessorImpl.invoke0(Native
>> Method)
>>    [junit4]   1>      at
>> sun.reflect.NativeMethodAccessorImpl.invoke(NativeMethodAccessorImpl.j
>> ava:94)
>>    [junit4]   1>      at
>> sun.reflect.DelegatingMethodAccessorImpl.invoke(DelegatingMethodAcces
>> sorImpl.java:55)
>>    [junit4]   1>      at java.lang.reflect.Method.invoke(Method.java:619)
>>    [junit4]   1>      at
>> com.carrotsearch.randomizedtesting.RandomizedRunner.invoke(Randomize
>> dRunner.java:1618)
>>    [junit4]   1>      at
>> com.carrotsearch.randomizedtesting.RandomizedRunner$6.evaluate(Rando
>> mizedRunner.java:827)
>>    [junit4]   1>      at
>> com.carrotsearch.randomizedtesting.RandomizedRunner$7.evaluate(Rando
>> mizedRunner.java:863)
>>    [junit4]   1>      at
>> com.carrotsearch.randomizedtesting.RandomizedRunner$8.evaluate(Rando
>> mizedRunner.java:877)
>>    [junit4]   1>      at
>> org.apache.lucene.util.TestRuleSetupTeardownChained$1.evaluate(TestRule
>> SetupTeardownChained.java:50)
>>    [junit4]   1>      at
>> org.apache.lucene.util.TestRuleFieldCacheSanity$1.evaluate(TestRuleFieldCa
>> cheSanity.java:51)
>>    [junit4]   1>      at
>> org.apache.lucene.util.AbstractBeforeAfterRule$1.evaluate(AbstractBeforeA
>> fterRule.java:46)
>>    [junit4]   1>      at
>> com.carrotsearch.randomizedtesting.rules.SystemPropertiesInvariantRule$1
>> .evaluate(SystemPropertiesInvariantRule.java:55)
>>    [junit4]   1>      at
>> org.apache.lucene.util.TestRuleThreadAndTestName$1.evaluate(TestRuleTh
>> readAndTestName.java:49)
>>    [junit4]   1>      at
>> org.apache.lucene.util.TestRuleIgnoreAfterMaxFailures$1.evaluate(TestRule
>> IgnoreAfterMaxFailures.java:65)
>>    [junit4]   1>      at
>> org.apache.lucene.util.TestRuleMarkFailure$1.evaluate(TestRuleMarkFailure
>> .java:48)
>>    [junit4]   1>      at
>> com.carrotsearch.randomizedtesting.rules.StatementAdapter.evaluate(Stat
>> ementAdapter.java:36)
>>    [junit4]   1>      at
>> com.carrotsearch.randomizedtesting.ThreadLeakControl$StatementRunner.
>> run(ThreadLeakControl.java:360)
>>    [junit4]   1>      at
>> com.carrotsearch.randomizedtesting.ThreadLeakControl.forkTimeoutingTask
>> (ThreadLeakControl.java:793)
>>    [junit4]   1>      at
>> com.carrotsearch.randomizedtesting.ThreadLeakControl$3.evaluate(ThreadL
>> eakControl.java:453)
>>    [junit4]   1>      at
>> com.carrotsearch.randomizedtesting.RandomizedRunner.runSingleTest(Ran
>> domizedRunner.java:836)
>>    [junit4]   1>      at
>> com.carrotsearch.randomizedtesting.RandomizedRunner$3.evaluate(Rando
>> mizedRunner.java:738)
>>    [junit4]   1>      at
>> com.carrotsearch.randomizedtesting.RandomizedRunner$4.evaluate(Rando
>> mizedRunner.java:772)
>>    [junit4]   1>      at
>> com.carrotsearch.randomizedtesting.RandomizedRunner$5.evaluate(Rando
>> mizedRunner.java:783)
>>    [junit4]   1>      at
>> org.apache.lucene.util.AbstractBeforeAfterRule$1.evaluate(AbstractBeforeA
>> fterRule.java:46)
>>    [junit4]   1>      at
>> org.apache.lucene.util.TestRuleStoreClassName$1.evaluate(TestRuleStoreCl
>> assName.java:42)
>>    [junit4]   1>      at
>> com.carrotsearch.randomizedtesting.rules.SystemPropertiesInvariantRule$1
>> .evaluate(SystemPropertiesInvariantRule.java:55)
>>    [junit4]   1>      at
>> com.carrotsearch.randomizedtesting.rules.NoShadowingOrOverridesOnMet
>> hodsRule$1.evaluate(NoShadowingOrOverridesOnMethodsRule.java:39)
>>    [junit4]   1>      at
>> com.carrotsearch.randomizedtesting.rules.NoShadowingOrOverridesOnMet
>> hodsRule$1.evaluate(NoShadowingOrOverridesOnMethodsRule.java:39)
>>    [junit4]   1>      at
>> com.carrotsearch.randomizedtesting.rules.StatementAdapter.evaluate(Stat
>> ementAdapter.java:36)
>>    [junit4]   1>      at
>> com.carrotsearch.randomizedtesting.rules.StatementAdapter.evaluate(Stat
>> ementAdapter.java:36)
>>    [junit4]   1>      at
>> org.apache.lucene.util.TestRuleAssertionsRequired$1.evaluate(TestRuleAss
>> ertionsRequired.java:43)
>>    [junit4]   1>      at
>> org.apache.lucene.util.TestRuleMarkFailure$1.evaluate(TestRuleMarkFailure
>> .java:48)
>>    [junit4]   1>      at
>> org.apache.lucene.util.TestRuleIgnoreAfterMaxFailures$1.evaluate(TestRule
>> IgnoreAfterMaxFailures.java:65)
>>    [junit4]   1>      at
>> org.apache.lucene.util.TestRuleIgnoreTestSuites$1.evaluate(TestRuleIgnore
>> TestSuites.java:55)
>>    [junit4]   1>      at
>> com.carrotsearch.randomizedtesting.rules.StatementAdapter.evaluate(Stat
>> ementAdapter.java:36)
>>    [junit4]   1>      at
>> com.carrotsearch.randomizedtesting.ThreadLeakControl$StatementRunner.
>> run(ThreadLeakControl.java:360)
>>    [junit4]   1>      at java.lang.Thread.run(Thread.java:853)
>>    [junit4]   1>     test: stored fields.......OK [218 total field count; avg 1.009
>> fields per doc]
>>    [junit4]   1>     test: term vectors........ERROR [null]
>>    [junit4]   1> java.lang.ArrayIndexOutOfBoundsException
>>    [junit4]   1>      at
>> org.apache.lucene.store.ByteArrayDataInput.readVLong(ByteArrayDataInpu
>> t.java:126)
>>    [junit4]   1>      at
>> org.apache.lucene.codecs.memory.FSTOrdTermsReader$TermsReader$Base
>> TermsEnum.refillMetadata(FSTOrdTermsReader.java:393)
>>    [junit4]   1>      at
>> org.apache.lucene.codecs.memory.FSTOrdTermsReader$TermsReader$Base
>> TermsEnum.decodeMetaData(FSTOrdTermsReader.java:357)
>>    [junit4]   1>      at
>> org.apache.lucene.codecs.memory.FSTOrdTermsReader$TermsReader$Seg
>> mentTermsEnum.decodeMetaData(FSTOrdTermsReader.java:471)
>>    [junit4]   1>      at
>> org.apache.lucene.codecs.memory.FSTOrdTermsReader$TermsReader$Base
>> TermsEnum.docs(FSTOrdTermsReader.java:426)
>>    [junit4]   1>      at
>> org.apache.lucene.index.TermsEnum.docs(TermsEnum.java:149)
>>    [junit4]   1>      at
>> org.apache.lucene.index.CheckIndex.testTermVectors(CheckIndex.java:173
>> 1)
>>    [junit4]   1>      at
>> org.apache.lucene.index.CheckIndex.checkIndex(CheckIndex.java:632)
>>    [junit4]   1>      at
>> org.apache.lucene.util.TestUtil.checkIndex(TestUtil.java:199)
>>    [junit4]   1>      at
>> org.apache.lucene.store.MockDirectoryWrapper.close(MockDirectoryWrapp
>> er.java:681)
>>    [junit4]   1>      at
>> org.apache.lucene.index.TestStressIndexing.testStressIndexAndSearching(T
>> estStressIndexing.java:173)
>>    [junit4]   1>      at sun.reflect.NativeMethodAccessorImpl.invoke0(Native
>> Method)
>>    [junit4]   1>      at
>> sun.reflect.NativeMethodAccessorImpl.invoke(NativeMethodAccessorImpl.j
>> ava:94)
>>    [junit4]   1>      at
>> sun.reflect.DelegatingMethodAccessorImpl.invoke(DelegatingMethodAcces
>> sorImpl.java:55)
>>    [junit4]   1>      at java.lang.reflect.Method.invoke(Method.java:619)
>>    [junit4]   1>      at
>> com.carrotsearch.randomizedtesting.RandomizedRunner.invoke(Randomize
>> dRunner.java:1618)
>>    [junit4]   1>      at
>> com.carrotsearch.randomizedtesting.RandomizedRunner$6.evaluate(Rando
>> mizedRunner.java:827)
>>    [junit4]   1>      at
>> com.carrotsearch.randomizedtesting.RandomizedRunner$7.evaluate(Rando
>> mizedRunner.java:863)
>>    [junit4]   1>      at
>> com.carrotsearch.randomizedtesting.RandomizedRunner$8.evaluate(Rando
>> mizedRunner.java:877)
>>    [junit4]   1>      at
>> org.apache.lucene.util.TestRuleSetupTeardownChained$1.evaluate(TestRule
>> SetupTeardownChained.java:50)
>>    [junit4]   1>      at
>> org.apache.lucene.util.TestRuleFieldCacheSanity$1.evaluate(TestRuleFieldCa
>> cheSanity.java:51)
>>    [junit4]   1>      at
>> org.apache.lucene.util.AbstractBeforeAfterRule$1.evaluate(AbstractBeforeA
>> fterRule.java:46)
>>    [junit4]   1>      at
>> com.carrotsearch.randomizedtesting.rules.SystemPropertiesInvariantRule$1
>> .evaluate(SystemPropertiesInvariantRule.java:55)
>>    [junit4]   1>      at
>> org.apache.lucene.util.TestRuleThreadAndTestName$1.evaluate(TestRuleTh
>> readAndTestName.java:49)
>>    [junit4]   1>      at
>> org.apache.lucene.util.TestRuleIgnoreAfterMaxFailures$1.evaluate(TestRule
>> IgnoreAfterMaxFailures.java:65)
>>    [junit4]   1>      at
>> org.apache.lucene.util.TestRuleMarkFailure$1.evaluate(TestRuleMarkFailure
>> .java:48)
>>    [junit4]   1>      at
>> com.carrotsearch.randomizedtesting.rules.StatementAdapter.evaluate(Stat
>> ementAdapter.java:36)
>>    [junit4]   1>      at
>> com.carrotsearch.randomizedtesting.ThreadLeakControl$StatementRunner.
>> run(ThreadLeakControl.java:360)
>>    [junit4]   1>      at
>> com.carrotsearch.randomizedtesting.ThreadLeakControl.forkTimeoutingTask
>> (ThreadLeakControl.java:793)
>>    [junit4]   1>      at
>> com.carrotsearch.randomizedtesting.ThreadLeakControl$3.evaluate(ThreadL
>> eakControl.java:453)
>>    [junit4]   1>      at
>> com.carrotsearch.randomizedtesting.RandomizedRunner.runSingleTest(Ran
>> domizedRunner.java:836)
>>    [junit4]   1>      at
>> com.carrotsearch.randomizedtesting.RandomizedRunner$3.evaluate(Rando
>> mizedRunner.java:738)
>>    [junit4]   1>      at
>> com.carrotsearch.randomizedtesting.RandomizedRunner$4.evaluate(Rando
>> mizedRunner.java:772)
>>    [junit4]   1>      at
>> com.carrotsearch.randomizedtesting.RandomizedRunner$5.evaluate(Rando
>> mizedRunner.java:783)
>>    [junit4]   1>      at
>> org.apache.lucene.util.AbstractBeforeAfterRule$1.evaluate(AbstractBeforeA
>> fterRule.java:46)
>>    [junit4]   1>      at
>> org.apache.lucene.util.TestRuleStoreClassName$1.evaluate(TestRuleStoreCl
>> assName.java:42)
>>    [junit4]   1>      at
>> com.carrotsearch.randomizedtesting.rules.SystemPropertiesInvariantRule$1
>> .evaluate(SystemPropertiesInvariantRule.java:55)
>>    [junit4]   1>      at
>> com.carrotsearch.randomizedtesting.rules.NoShadowingOrOverridesOnMet
>> hodsRule$1.evaluate(NoShadowingOrOverridesOnMethodsRule.java:39)
>>    [junit4]   1>      at
>> com.carrotsearch.randomizedtesting.rules.NoShadowingOrOverridesOnMet
>> hodsRule$1.evaluate(NoShadowingOrOverridesOnMethodsRule.java:39)
>>    [junit4]   1>      at
>> com.carrotsearch.randomizedtesting.rules.StatementAdapter.evaluate(Stat
>> ementAdapter.java:36)
>>    [junit4]   1>      at
>> com.carrotsearch.randomizedtesting.rules.StatementAdapter.evaluate(Stat
>> ementAdapter.java:36)
>>    [junit4]   1>      at
>> org.apache.lucene.util.TestRuleAssertionsRequired$1.evaluate(TestRuleAss
>> ertionsRequired.java:43)
>>    [junit4]   1>      at
>> org.apache.lucene.util.TestRuleMarkFailure$1.evaluate(TestRuleMarkFailure
>> .java:48)
>>    [junit4]   1>      at
>> org.apache.lucene.util.TestRuleIgnoreAfterMaxFailures$1.evaluate(TestRule
>> IgnoreAfterMaxFailures.java:65)
>>    [junit4]   1>      at
>> org.apache.lucene.util.TestRuleIgnoreTestSuites$1.evaluate(TestRuleIgnore
>> TestSuites.java:55)
>>    [junit4]   1>      at
>> com.carrotsearch.randomizedtesting.rules.StatementAdapter.evaluate(Stat
>> ementAdapter.java:36)
>>    [junit4]   1>      at
>> com.carrotsearch.randomizedtesting.ThreadLeakControl$StatementRunner.
>> run(ThreadLeakControl.java:360)
>>    [junit4]   1>      at java.lang.Thread.run(Thread.java:853)
>>    [junit4]   1>     test: docvalues...........OK [0 docvalues fields; 0 BINARY; 0
>> NUMERIC; 0 SORTED; 0 SORTED_SET]
>>    [junit4]   1> FAILED
>>    [junit4]   1>     WARNING: fixIndex() would remove reference to this
>> segment; full exception:
>>    [junit4]   1> java.lang.RuntimeException: Term Index test failed
>>    [junit4]   1>      at
>> org.apache.lucene.index.CheckIndex.checkIndex(CheckIndex.java:641)
>>    [junit4]   1>      at
>> org.apache.lucene.util.TestUtil.checkIndex(TestUtil.java:199)
>>    [junit4]   1>      at
>> org.apache.lucene.store.MockDirectoryWrapper.close(MockDirectoryWrapp
>> er.java:681)
>>    [junit4]   1>      at
>> org.apache.lucene.index.TestStressIndexing.testStressIndexAndSearching(T
>> estStressIndexing.java:173)
>>    [junit4]   1>      at sun.reflect.NativeMethodAccessorImpl.invoke0(Native
>> Method)
>>    [junit4]   1>      at
>> sun.reflect.NativeMethodAccessorImpl.invoke(NativeMethodAccessorImpl.j
>> ava:94)
>>    [junit4]   1>      at
>> sun.reflect.DelegatingMethodAccessorImpl.invoke(DelegatingMethodAcces
>> sorImpl.java:55)
>>    [junit4]   1>      at java.lang.reflect.Method.invoke(Method.java:619)
>>    [junit4]   1>      at
>> com.carrotsearch.randomizedtesting.RandomizedRunner.invoke(Randomize
>> dRunner.java:1618)
>>    [junit4]   1>      at
>> com.carrotsearch.randomizedtesting.RandomizedRunner$6.evaluate(Rando
>> mizedRunner.java:827)
>>    [junit4]   1>      at
>> com.carrotsearch.randomizedtesting.RandomizedRunner$7.evaluate(Rando
>> mizedRunner.java:863)
>>    [junit4]   1>      at
>> com.carrotsearch.randomizedtesting.RandomizedRunner$8.evaluate(Rando
>> mizedRunner.java:877)
>>    [junit4]   1>      at
>> org.apache.lucene.util.TestRuleSetupTeardownChained$1.evaluate(TestRule
>> SetupTeardownChained.java:50)
>>    [junit4]   1>      at
>> org.apache.lucene.util.TestRuleFieldCacheSanity$1.evaluate(TestRuleFieldCa
>> cheSanity.java:51)
>>    [junit4]   1>      at
>> org.apache.lucene.util.AbstractBeforeAfterRule$1.evaluate(AbstractBeforeA
>> fterRule.java:46)
>>    [junit4]   1>      at
>> com.carrotsearch.randomizedtesting.rules.SystemPropertiesInvariantRule$1
>> .evaluate(SystemPropertiesInvariantRule.java:55)
>>    [junit4]   1>      at
>> org.apache.lucene.util.TestRuleThreadAndTestName$1.evaluate(TestRuleTh
>> readAndTestName.java:49)
>>    [junit4]   1>      at
>> org.apache.lucene.util.TestRuleIgnoreAfterMaxFailures$1.evaluate(TestRule
>> IgnoreAfterMaxFailures.java:65)
>>    [junit4]   1>      at
>> org.apache.lucene.util.TestRuleMarkFailure$1.evaluate(TestRuleMarkFailure
>> .java:48)
>>    [junit4]   1>      at
>> com.carrotsearch.randomizedtesting.rules.StatementAdapter.evaluate(Stat
>> ementAdapter.java:36)
>>    [junit4]   1>      at
>> com.carrotsearch.randomizedtesting.ThreadLeakControl$StatementRunner.
>> run(ThreadLeakControl.java:360)
>>    [junit4]   1>      at
>> com.carrotsearch.randomizedtesting.ThreadLeakControl.forkTimeoutingTask
>> (ThreadLeakControl.java:793)
>>    [junit4]   1>      at
>> com.carrotsearch.randomizedtesting.ThreadLeakControl$3.evaluate(ThreadL
>> eakControl.java:453)
>>    [junit4]   1>      at
>> com.carrotsearch.randomizedtesting.RandomizedRunner.runSingleTest(Ran
>> domizedRunner.java:836)
>>    [junit4]   1>      at
>> com.carrotsearch.randomizedtesting.RandomizedRunner$3.evaluate(Rando
>> mizedRunner.java:738)
>>    [junit4]   1>      at
>> com.carrotsearch.randomizedtesting.RandomizedRunner$4.evaluate(Rando
>> mizedRunner.java:772)
>>    [junit4]   1>      at
>> com.carrotsearch.randomizedtesting.RandomizedRunner$5.evaluate(Rando
>> mizedRunner.java:783)
>>    [junit4]   1>      at
>> org.apache.lucene.util.AbstractBeforeAfterRule$1.evaluate(AbstractBeforeA
>> fterRule.java:46)
>>    [junit4]   1>      at
>> org.apache.lucene.util.TestRuleStoreClassName$1.evaluate(TestRuleStoreCl
>> assName.java:42)
>>    [junit4]   1>      at
>> com.carrotsearch.randomizedtesting.rules.SystemPropertiesInvariantRule$1
>> .evaluate(SystemPropertiesInvariantRule.java:55)
>>    [junit4]   1>      at
>> com.carrotsearch.randomizedtesting.rules.NoShadowingOrOverridesOnMet
>> hodsRule$1.evaluate(NoShadowingOrOverridesOnMethodsRule.java:39)
>>    [junit4]   1>      at
>> com.carrotsearch.randomizedtesting.rules.NoShadowingOrOverridesOnMet
>> hodsRule$1.evaluate(NoShadowingOrOverridesOnMethodsRule.java:39)
>>    [junit4]   1>      at
>> com.carrotsearch.randomizedtesting.rules.StatementAdapter.evaluate(Stat
>> ementAdapter.java:36)
>>    [junit4]   1>      at
>> com.carrotsearch.randomizedtesting.rules.StatementAdapter.evaluate(Stat
>> ementAdapter.java:36)
>>    [junit4]   1>      at
>> org.apache.lucene.util.TestRuleAssertionsRequired$1.evaluate(TestRuleAss
>> ertionsRequired.java:43)
>>    [junit4]   1>      at
>> org.apache.lucene.util.TestRuleMarkFailure$1.evaluate(TestRuleMarkFailure
>> .java:48)
>>    [junit4]   1>      at
>> org.apache.lucene.util.TestRuleIgnoreAfterMaxFailures$1.evaluate(TestRule
>> IgnoreAfterMaxFailures.java:65)
>>    [junit4]   1>      at
>> org.apache.lucene.util.TestRuleIgnoreTestSuites$1.evaluate(TestRuleIgnore
>> TestSuites.java:55)
>>    [junit4]   1>      at
>> com.carrotsearch.randomizedtesting.rules.StatementAdapter.evaluate(Stat
>> ementAdapter.java:36)
>>    [junit4]   1>      at
>> com.carrotsearch.randomizedtesting.ThreadLeakControl$StatementRunner.
>> run(ThreadLeakControl.java:360)
>>    [junit4]   1>      at java.lang.Thread.run(Thread.java:853)
>>    [junit4]   1>
>>    [junit4]   1>   2 of 77: name=_17 docCount=10
>>    [junit4]   1>     codec=Lucene46
>>    [junit4]   1>     compound=false
>>    [junit4]   1>     numFiles=13
>>    [junit4]   1>     size (MB)=0.002
>>    [junit4]   1>     diagnostics = {java.version=1.7.0, source=flush,
>> os.version=3.8.0-38-generic, java.vendor=IBM Corporation,
>> lucene.version=4.9-SNAPSHOT, timestamp=1398540172474, os.arch=x86,
>> os=Linux}
>>    [junit4]   1>     has deletions [delGen=1]
>>    [junit4]   1>     test: open reader.........OK
>>    [junit4]   1>     test: check integrity.....OK
>>    [junit4]   1>     test: check live docs.....OK [5 deleted docs]
>>    [junit4]   1>     test: fields..............OK [2 fields]
>>    [junit4]   1>     test: field norms.........OK [1 fields]
>>    [junit4]   1>     test: terms, freq, prox...OK [31 terms; 55 terms/docs pairs; 58
>> tokens]
>>    [junit4]   1>     test (ignoring deletes): terms, freq, prox...OK [44 terms; 104
>> terms/docs pairs; 114 tokens]
>>    [junit4]   1>     test: stored fields.......OK [5 total field count; avg 1 fields per
>> doc]
>>    [junit4]   1>     test: term vectors........OK [0 total vector count; avg 0
>> term/freq vector fields per doc]
>>    [junit4]   1>     test: docvalues...........OK [0 docvalues fields; 0 BINARY; 0
>> NUMERIC; 0 SORTED; 0 SORTED_SET]
>>    [junit4]   1>
>>    [junit4]   1>   3 of 77: name=_18 docCount=10
>>    [junit4]   1>     codec=Lucene46
>>    [junit4]   1>     compound=false
>>    [junit4]   1>     numFiles=13
>>    [junit4]   1>     size (MB)=0.002
>>    [junit4]   1>     diagnostics = {java.version=1.7.0, source=flush,
>> os.version=3.8.0-38-generic, java.vendor=IBM Corporation,
>> lucene.version=4.9-SNAPSHOT, timestamp=1398540172483, os.arch=x86,
>> os=Linux}
>>    [junit4]   1>     has deletions [delGen=2]
>>    [junit4]   1>     test: open reader.........OK
>>    [junit4]   1>     test: check integrity.....OK
>>    [junit4]   1>     test: check live docs.....OK [5 deleted docs]
>>    [junit4]   1>     test: fields..............OK [2 fields]
>>    [junit4]   1>     test: field norms.........OK [1 fields]
>>    [junit4]   1>     test: terms, freq, prox...OK [30 terms; 55 terms/docs pairs; 63
>> tokens]
>>    [junit4]   1>     test (ignoring deletes): terms, freq, prox...OK [47 terms; 110
>> terms/docs pairs; 124 tokens]
>>    [junit4]   1>     test: stored fields.......OK [5 total field count; avg 1 fields per
>> doc]
>>    [junit4]   1>     test: term vectors........OK [0 total vector count; avg 0
>> term/freq vector fields per doc]
>>    [junit4]   1>     test: docvalues...........OK [0 docvalues fields; 0 BINARY; 0
>> NUMERIC; 0 SORTED; 0 SORTED_SET]
>>    [junit4]   1>
>>    [junit4]   1>   4 of 77: name=_19 docCount=10
>>    [junit4]   1>     codec=Lucene46
>>    [junit4]   1>     compound=false
>>    [junit4]   1>     numFiles=13
>>    [junit4]   1>     size (MB)=0.002
>>    [junit4]   1>     diagnostics = {java.version=1.7.0, source=flush,
>> os.version=3.8.0-38-generic, java.vendor=IBM Corporation,
>> lucene.version=4.9-SNAPSHOT, timestamp=1398540172483, os.arch=x86,
>> os=Linux}
>>    [junit4]   1>     has deletions [delGen=1]
>>    [junit4]   1>     test: open reader.........OK
>>    [junit4]   1>     test: check integrity.....OK
>>    [junit4]   1>     test: check live docs.....OK [5 deleted docs]
>>    [junit4]   1>     test: fields..............OK [2 fields]
>>    [junit4]   1>     test: field norms.........OK [1 fields]
>>    [junit4]   1>     test: terms, freq, prox...OK [30 terms; 55 terms/docs pairs; 58
>> tokens]
>>    [junit4]   1>     test (ignoring deletes): terms, freq, prox...OK [46 terms; 110
>> terms/docs pairs; 117 tokens]
>>    [junit4]   1>     test: stored fields.......OK [5 total field count; avg 1 fields per
>> doc]
>>    [junit4]   1>     test: term vectors........OK [0 total vector count; avg 0
>> term/freq vector fields per doc]
>>    [junit4]   1>     test: docvalues...........OK [0 docvalues fields; 0 BINARY; 0
>> NUMERIC; 0 SORTED; 0 SORTED_SET]
>>    [junit4]   1>
>>    [junit4]   1>   5 of 77: name=_1a docCount=10
>>    [junit4]   1>     codec=Lucene46
>>    [junit4]   1>     compound=false
>>    [junit4]   1>     numFiles=13
>>    [junit4]   1>     size (MB)=0.002
>>    [junit4]   1>     diagnostics = {java.version=1.7.0, source=flush,
>> os.version=3.8.0-38-generic, java.vendor=IBM Corporation,
>> lucene.version=4.9-SNAPSHOT, timestamp=1398540172498, os.arch=x86,
>> os=Linux}
>>    [junit4]   1>     has deletions [delGen=2]
>>    [junit4]   1>     test: open reader.........OK
>>    [junit4]   1>     test: check integrity.....OK
>>    [junit4]   1>     test: check live docs.....OK [5 deleted docs]
>>    [junit4]   1>     test: fields..............OK [2 fields]
>>    [junit4]   1>     test: field norms.........OK [1 fields]
>>    [junit4]   1>     test: terms, freq, prox...OK [30 terms; 52 terms/docs pairs; 61
>> tokens]
>>    [junit4]   1>     test (ignoring deletes): terms, freq, prox...OK [49 terms; 106
>> terms/docs pairs; 121 tokens]
>>    [junit4]   1>     test: stored fields.......OK [5 total field count; avg 1 fields per
>> doc]
>>    [junit4]   1>     test: term vectors........OK [0 total vector count; avg 0
>> term/freq vector fields per doc]
>>    [junit4]   1>     test: docvalues...........OK [0 docvalues fields; 0 BINARY; 0
>> NUMERIC; 0 SORTED; 0 SORTED_SET]
>>    [junit4]   1>
>>    [junit4]   1>   6 of 77: name=_1b docCount=10
>>    [junit4]   1>     codec=Lucene46
>>    [junit4]   1>     compound=false
>>    [junit4]   1>     numFiles=15
>>    [junit4]   1>     size (MB)=0.003
>>    [junit4]   1>     diagnostics = {java.version=1.7.0, source=flush,
>> os.version=3.8.0-38-generic, java.vendor=IBM Corporation,
>> lucene.version=4.9-SNAPSHOT, timestamp=1398540172492, os.arch=x86,
>> os=Linux}
>>    [junit4]   1>     has deletions [delGen=1]
>>    [junit4]   1>     test: open reader.........OK
>>    [junit4]   1>     test: check integrity.....OK
>>    [junit4]   1>     test: check live docs.....OK [5 deleted docs]
>>    [junit4]   1>     test: fields..............OK [2 fields]
>>    [junit4]   1>     test: field norms.........OK [1 fields]
>>    [junit4]   1>     test: terms, freq, prox...OK [30 terms; 54 terms/docs pairs; 59
>> tokens]
>>    [junit4]   1>     test (ignoring deletes): terms, freq, prox...OK [48 terms; 106
>> terms/docs pairs; 118 tokens]
>>    [junit4]   1>     test: stored fields.......OK [5 total field count; avg 1 fields per
>> doc]
>>    [junit4]   1>     test: term vectors........OK [1 total vector count; avg 1
>> term/freq vector fields per doc]
>>    [junit4]   1>     test: docvalues...........OK [0 docvalues fields; 0 BINARY; 0
>> NUMERIC; 0 SORTED; 0 SORTED_SET]
>>    [junit4]   1>
>>    [junit4]   1>   7 of 77: name=_1d docCount=10
>>    [junit4]   1>     codec=Lucene46
>>    [junit4]   1>     compound=false
>>    [junit4]   1>     numFiles=13
>>    [junit4]   1>     size (MB)=0.002
>>    [junit4]   1>     diagnostics = {java.version=1.7.0, source=flush,
>> os.version=3.8.0-38-generic, java.vendor=IBM Corporation,
>> lucene.version=4.9-SNAPSHOT, timestamp=1398540172641, os.arch=x86,
>> os=Linux}
>>    [junit4]   1>     has deletions [delGen=2]
>>    [junit4]   1>     test: open reader.........OK
>>    [junit4]   1>     test: check integrity.....OK
>>    [junit4]   1>     test: check live docs.....OK [5 deleted docs]
>>    [junit4]   1>     test: fields..............OK [2 fields]
>>    [junit4]   1>     test: field norms.........OK [1 fields]
>>    [junit4]   1>     test: terms, freq, prox...OK [30 terms; 55 terms/docs pairs; 64
>> tokens]
>>    [junit4]   1>     test (ignoring deletes): terms, freq, prox...OK [48 terms; 108
>> terms/docs pairs; 124 tokens]
>>    [junit4]   1>     test: stored fields.......OK [5 total field count; avg 1 fields per
>> doc]
>>    [junit4]   1>     test: term vectors........OK [0 total vector count; avg 0
>> term/freq vector fields per doc]
>>    [junit4]   1>     test: docvalues...........OK [0 docvalues fields; 0 BINARY; 0
>> NUMERIC; 0 SORTED; 0 SORTED_SET]
>>    [junit4]   1>
>>    [junit4]   1>   8 of 77: name=_1e docCount=10
>>    [junit4]   1>     codec=Lucene46
>>    [junit4]   1>     compound=false
>>    [junit4]   1>     numFiles=13
>>    [junit4]   1>     size (MB)=0.002
>>    [junit4]   1>     diagnostics = {java.version=1.7.0, source=flush,
>> os.version=3.8.0-38-generic, java.vendor=IBM Corporation,
>> lucene.version=4.9-SNAPSHOT, timestamp=1398540172642, os.arch=x86,
>> os=Linux}
>>    [junit4]   1>     has deletions [delGen=1]
>>    [junit4]   1>     test: open reader.........OK
>>    [junit4]   1>     test: check integrity.....OK
>>    [junit4]   1>     test: check live docs.....OK [5 deleted docs]
>>    [junit4]   1>     test: fields..............OK [2 fields]
>>    [junit4]   1>     test: field norms.........OK [1 fields]
>>    [junit4]   1>     test: terms, freq, prox...OK [30 terms; 56 terms/docs pairs; 61
>> tokens]
>>    [junit4]   1>     test (ignoring deletes): terms, freq, prox...OK [47 terms; 103
>> terms/docs pairs; 111 tokens]
>>    [junit4]   1>     test: stored fields.......OK [5 total field count; avg 1 fields per
>> doc]
>>    [junit4]   1>     test: term vectors........OK [0 total vector count; avg 0
>> term/freq vector fields per doc]
>>    [junit4]   1>     test: docvalues...........OK [0 docvalues fields; 0 BINARY; 0
>> NUMERIC; 0 SORTED; 0 SORTED_SET]
>>    [junit4]   1>
>>    [junit4]   1>   9 of 77: name=_1f docCount=10
>>    [junit4]   1>     codec=Lucene46
>>    [junit4]   1>     compound=false
>>    [junit4]   1>     numFiles=13
>>    [junit4]   1>     size (MB)=0.002
>>    [junit4]   1>     diagnostics = {java.version=1.7.0, source=flush,
>> os.version=3.8.0-38-generic, java.vendor=IBM Corporation,
>> lucene.version=4.9-SNAPSHOT, timestamp=1398540172652, os.arch=x86,
>> os=Linux}
>>    [junit4]   1>     has deletions [delGen=2]
>>    [junit4]   1>     test: open reader.........OK
>>    [junit4]   1>     test: check integrity.....OK
>>    [junit4]   1>     test: check live docs.....OK [5 deleted docs]
>>    [junit4]   1>     test: fields..............OK [2 fields]
>>    [junit4]   1>     test: field norms.........OK [1 fields]
>>    [junit4]   1>     test: terms, freq, prox...OK [30 terms; 51 terms/docs pairs; 57
>> tokens]
>>    [junit4]   1>     test (ignoring deletes): terms, freq, prox...OK [46 terms; 100
>> terms/docs pairs; 108 tokens]
>>    [junit4]   1>     test: stored fields.......OK [5 total field count; avg 1 fields per
>> doc]
>>    [junit4]   1>     test: term vectors........OK [0 total vector count; avg 0
>> term/freq vector fields per doc]
>>    [junit4]   1>     test: docvalues...........OK [0 docvalues fields; 0 BINARY; 0
>> NUMERIC; 0 SORTED; 0 SORTED_SET]
>>    [junit4]   1>
>>    [junit4]   1>   10 of 77: name=_1g docCount=10
>>    [junit4]   1>     codec=Lucene46
>>    [junit4]   1>     compound=false
>>    [junit4]   1>     numFiles=13
>>    [junit4]   1>     size (MB)=0.002
>>    [junit4]   1>     diagnostics = {java.version=1.7.0, source=flush,
>> os.version=3.8.0-38-generic, java.vendor=IBM Corporation,
>> lucene.version=4.9-SNAPSHOT, timestamp=1398540172652, os.arch=x86,
>> os=Linux}
>>    [junit4]   1>     has deletions [delGen=1]
>>    [junit4]   1>     test: open reader.........OK
>>    [junit4]   1>     test: check integrity.....OK
>>    [junit4]   1>     test: check live docs.....OK [5 deleted docs]
>>    [junit4]   1>     test: fields..............OK [2 fields]
>>    [junit4]   1>     test: field norms.........OK [1 fields]
>>    [junit4]   1>     test: terms, freq, prox...OK [31 terms; 54 terms/docs pairs; 59
>> tokens]
>>    [junit4]   1>     test (ignoring deletes): terms, freq, prox...OK [47 terms; 110
>> terms/docs pairs; 120 tokens]
>>    [junit4]   1>     test: stored fields.......OK [5 total field count; avg 1 fields per
>> doc]
>>    [junit4]   1>     test: term vectors........OK [0 total vector count; avg 0
>> term/freq vector fields per doc]
>>    [junit4]   1>     test: docvalues...........OK [0 docvalues fields; 0 BINARY; 0
>> NUMERIC; 0 SORTED; 0 SORTED_SET]
>>    [junit4]   1>
>>    [junit4]   1>   11 of 77: name=_1h docCount=10
>>    [junit4]   1>     codec=Lucene46
>>    [junit4]   1>     compound=false
>>    [junit4]   1>     numFiles=13
>>    [junit4]   1>     size (MB)=0.002
>>    [junit4]   1>     diagnostics = {java.version=1.7.0, source=flush,
>> os.version=3.8.0-38-generic, java.vendor=IBM Corporation,
>> lucene.version=4.9-SNAPSHOT, timestamp=1398540172666, os.arch=x86,
>> os=Linux}
>>    [junit4]   1>     has deletions [delGen=2]
>>    [junit4]   1>     test: open reader.........OK
>>    [junit4]   1>     test: check integrity.....OK
>>    [junit4]   1>     test: check live docs.....OK [5 deleted docs]
>>    [junit4]   1>     test: fields..............OK [2 fields]
>>    [junit4]   1>     test: field norms.........OK [1 fields]
>>    [junit4]   1>     test: terms, freq, prox...OK [29 terms; 51 terms/docs pairs; 58
>> tokens]
>>    [junit4]   1>     test (ignoring deletes): terms, freq, prox...OK [46 terms; 106
>> terms/docs pairs; 120 tokens]
>>    [junit4]   1>     test: stored fields.......OK [6 total field count; avg 1.2 fields per
>> doc]
>>    [junit4]   1>     test: term vectors........OK [0 total vector count; avg 0
>> term/freq vector fields per doc]
>>    [junit4]   1>     test: docvalues...........OK [0 docvalues fields; 0 BINARY; 0
>> NUMERIC; 0 SORTED; 0 SORTED_SET]
>>    [junit4]   1>
>>    [junit4]   1>   12 of 77: name=_1i docCount=10
>>    [junit4]   1>     codec=Lucene46
>>    [junit4]   1>     compound=false
>>    [junit4]   1>     numFiles=13
>>    [junit4]   1>     size (MB)=0.002
>>    [junit4]   1>     diagnostics = {java.version=1.7.0, source=flush,
>> os.version=3.8.0-38-generic, java.vendor=IBM Corporation,
>> lucene.version=4.9-SNAPSHOT, timestamp=1398540172666, os.arch=x86,
>> os=Linux}
>>    [junit4]   1>     has deletions [delGen=1]
>>    [junit4]   1>     test: open reader.........OK
>>    [junit4]   1>     test: check integrity.....OK
>>    [junit4]   1>     test: check live docs.....OK [5 deleted docs]
>>    [junit4]   1>     test: fields..............OK [2 fields]
>>    [junit4]   1>     test: field norms.........OK [1 fields]
>>    [junit4]   1>     test: terms, freq, prox...OK [30 terms; 55 terms/docs pairs; 63
>> tokens]
>>    [junit4]   1>     test (ignoring deletes): terms, freq, prox...OK [46 terms; 109
>> terms/docs pairs; 125 tokens]
>>    [junit4]   1>     test: stored fields.......OK [5 total field count; avg 1 fields per
>> doc]
>>    [junit4]   1>     test: term vectors........OK [0 total vector count; avg 0
>> term/freq vector fields per doc]
>>    [junit4]   1>     test: docvalues...........OK [0 docvalues fields; 0 BINARY; 0
>> NUMERIC; 0 SORTED; 0 SORTED_SET]
>>    [junit4]   1>
>>    [junit4]   1>   13 of 77: name=_1j docCount=10
>>    [junit4]   1>     codec=Lucene46
>>    [junit4]   1>     compound=false
>>    [junit4]   1>     numFiles=13
>>    [junit4]   1>     size (MB)=0.002
>>    [junit4]   1>     diagnostics = {java.version=1.7.0, source=flush,
>> os.version=3.8.0-38-generic, java.vendor=IBM Corporation,
>> lucene.version=4.9-SNAPSHOT, timestamp=1398540172684, os.arch=x86,
>> os=Linux}
>>    [junit4]   1>     has deletions [delGen=2]
>>    [junit4]   1>     test: open reader.........OK
>>    [junit4]   1>     test: check integrity.....OK
>>    [junit4]   1>     test: check live docs.....OK [5 deleted docs]
>>    [junit4]   1>     test: fields..............OK [2 fields]
>>    [junit4]   1>     test: field norms.........OK [1 fields]
>>    [junit4]   1>     test: terms, freq, prox...OK [30 terms; 55 terms/docs pairs; 61
>> tokens]
>>    [junit4]   1>     test (ignoring deletes): terms, freq, prox...OK [44 terms; 108
>> terms/docs pairs; 119 tokens]
>>    [junit4]   1>     test: stored fields.......OK [5 total field count; avg 1 fields per
>> doc]
>>    [junit4]   1>     test: term vectors........OK [0 total vector count; avg 0
>> term/freq vector fields per doc]
>>    [junit4]   1>     test: docvalues...........OK [0 docvalues fields; 0 BINARY; 0
>> NUMERIC; 0 SORTED; 0 SORTED_SET]
>>    [junit4]   1>
>>    [junit4]   1>   14 of 77: name=_1k docCount=10
>>    [junit4]   1>     codec=Lucene46
>>    [junit4]   1>     compound=false
>>    [junit4]   1>     numFiles=13
>>    [junit4]   1>     size (MB)=0.002
>>    [junit4]   1>     diagnostics = {java.version=1.7.0, source=flush,
>> os.version=3.8.0-38-generic, java.vendor=IBM Corporation,
>> lucene.version=4.9-SNAPSHOT, timestamp=1398540172682, os.arch=x86,
>> os=Linux}
>>    [junit4]   1>     has deletions [delGen=1]
>>    [junit4]   1>     test: open reader.........OK
>>    [junit4]   1>     test: check integrity.....OK
>>    [junit4]   1>     test: check live docs.....OK [5 deleted docs]
>>    [junit4]   1>     test: fields..............OK [2 fields]
>>    [junit4]   1>     test: field norms.........OK [1 fields]
>>    [junit4]   1>     test: terms, freq, prox...OK [30 terms; 53 terms/docs pairs; 63
>> tokens]
>>    [junit4]   1>     test (ignoring deletes): terms, freq, prox...OK [48 terms; 108
>> terms/docs pairs; 124 tokens]
>>    [junit4]   1>     test: stored fields.......OK [5 total field count; avg 1 fields per
>> doc]
>>    [junit4]   1>     test: term vectors........OK [0 total vector count; avg 0
>> term/freq vector fields per doc]
>>    [junit4]   1>     test: docvalues...........OK [0 docvalues fields; 0 BINARY; 0
>> NUMERIC; 0 SORTED; 0 SORTED_SET]
>>    [junit4]   1>
>>    [junit4]   1>   15 of 77: name=_1l docCount=10
>>    [junit4]   1>     codec=Lucene46
>>    [junit4]   1>     compound=false
>>    [junit4]   1>     numFiles=13
>>    [junit4]   1>     size (MB)=0.002
>>    [junit4]   1>     diagnostics = {java.version=1.7.0, source=flush,
>> os.version=3.8.0-38-generic, java.vendor=IBM Corporation,
>> lucene.version=4.9-SNAPSHOT, timestamp=1398540172688, os.arch=x86,
>> os=Linux}
>>    [junit4]   1>     has deletions [delGen=1]
>>    [junit4]   1>     test: open reader.........OK
>>    [junit4]   1>     test: check integrity.....OK
>>    [junit4]   1>     test: check live docs.....OK [5 deleted docs]
>>    [junit4]   1>     test: fields..............OK [2 fields]
>>    [junit4]   1>     test: field norms.........OK [1 fields]
>>    [junit4]   1>     test: terms, freq, prox...OK [29 terms; 52 terms/docs pairs; 60
>> tokens]
>>    [junit4]   1>     test (ignoring deletes): terms, freq, prox...OK [46 terms; 103
>> terms/docs pairs; 116 tokens]
>>    [junit4]   1>     test: stored fields.......OK [5 total field count; avg 1 fields per
>> doc]
>>    [junit4]   1>     test: term vectors........OK [0 total vector count; avg 0
>> term/freq vector fields per doc]
>>    [junit4]   1>     test: docvalues...........OK [0 docvalues fields; 0 BINARY; 0
>> NUMERIC; 0 SORTED; 0 SORTED_SET]
>>    [junit4]   1>
>>    [junit4]   1>   16 of 77: name=_1m docCount=10
>>    [junit4]   1>     codec=Lucene46
>>    [junit4]   1>     compound=false
>>    [junit4]   1>     numFiles=13
>>    [junit4]   1>     size (MB)=0.002
>>    [junit4]   1>     diagnostics = {java.version=1.7.0, source=flush,
>> os.version=3.8.0-38-generic, java.vendor=IBM Corporation,
>> lucene.version=4.9-SNAPSHOT, timestamp=1398540172691, os.arch=x86,
>> os=Linux}
>>    [junit4]   1>     has deletions [delGen=2]
>>    [junit4]   1>     test: open reader.........OK
>>    [junit4]   1>     test: check integrity.....OK
>>    [junit4]   1>     test: check live docs.....OK [5 deleted docs]
>>    [junit4]   1>     test: fields..............OK [2 fields]
>>    [junit4]   1>     test: field norms.........OK [1 fields]
>>    [junit4]   1>     test: terms, freq, prox...OK [29 terms; 57 terms/docs pairs; 65
>> tokens]
>>    [junit4]   1>     test (ignoring deletes): terms, freq, prox...OK [44 terms; 109
>> terms/docs pairs; 124 tokens]
>>    [junit4]   1>     test: stored fields.......OK [5 total field count; avg 1 fields per
>> doc]
>>    [junit4]   1>     test: term vectors........OK [0 total vector count; avg 0
>> term/freq vector fields per doc]
>>    [junit4]   1>     test: docvalues...........OK [0 docvalues fields; 0 BINARY; 0
>> NUMERIC; 0 SORTED; 0 SORTED_SET]
>>    [junit4]   1>
>>    [junit4]   1>   17 of 77: name=_1n docCount=10
>>    [junit4]   1>     codec=Lucene46
>>    [junit4]   1>     compound=false
>>    [junit4]   1>     numFiles=13
>>    [junit4]   1>     size (MB)=0.002
>>    [junit4]   1>     diagnostics = {java.version=1.7.0, source=flush,
>> os.version=3.8.0-38-generic, java.vendor=IBM Corporation,
>> lucene.version=4.9-SNAPSHOT, timestamp=1398540172692, os.arch=x86,
>> os=Linux}
>>    [junit4]   1>     has deletions [delGen=1]
>>    [junit4]   1>     test: open reader.........OK
>>    [junit4]   1>     test: check integrity.....OK
>>    [junit4]   1>     test: check live docs.....OK [5 deleted docs]
>>    [junit4]   1>     test: fields..............OK [2 fields]
>>    [junit4]   1>     test: field norms.........OK [1 fields]
>>    [junit4]   1>     test: terms, freq, prox...OK [29 terms; 52 terms/docs pairs; 59
>> tokens]
>>    [junit4]   1>     test (ignoring deletes): terms, freq, prox...OK [45 terms; 102
>> terms/docs pairs; 112 tokens]
>>    [junit4]   1>     test: stored fields.......OK [5 total field count; avg 1 fields per
>> doc]
>>    [junit4]   1>     test: term vectors........OK [0 total vector count; avg 0 term/f
>>
>> [...truncated too long message...]
>>
>> estSubScorerFreqs, TestEliasFanoSequence, TestBooleanQuery,
>> TestPerFieldPostingsFormat, TestTieredMergePolicy,
>> TestDoubleBarrelLRUCache, Before3, Before3, TestTerm,
>> TestAttributeSource, TestBasics, TestLongPostings, TestEliasFanoDocIdSet,
>> TestHighCompressionMode, TestIndexWriterDelete,
>> TestSnapshotDeletionPolicy, TestRAMDirectory, TestIndexWriterUnicode,
>> TestQueryBuilder, TestLevenshteinAutomata, TestLazyProxSkipping,
>> TestSimilarityBase, TestWorstCaseTestBehavior, TestMinimize,
>> TestRecyclingByteBlockAllocator, TestConsistentFieldNumbers,
>> TestFieldInfos, Nested1, TestIndexWriterConfig, TestGraphTokenizers,
>> Nested1, TestSortDocValues, TestConstantScoreQuery,
>> TestDocInverterPerFieldErrorInfo, TestNRTCachingDirectory, TestPrefixFilter,
>> TestLucene40TermVectorsFormat, TestSpanExplanations,
>> TestIndexWriterLockRelease, TestRegexpRandom, TestMixedCodecs,
>> TestTopDocsCollector, TestCompressingStoredFieldsFormat,
>> TestExplanations, TestBitVector, TestBinaryDocValuesUpdates,
>> InBeforeClass, InAfterClass, InTestMethod, NonStringProperties,
>> TestIndexInput, TestGroupFiltering, TestIndexWriterNRTIsCurrent,
>> TestNearSpansOrdered, TestSpans, TestCrashCausesCorruptIndex,
>> TestLiveFieldValues, TestOmitNorms, TestWildcardRandom, TestTermScorer,
>> TestOmitPositions, TestSimpleSearchEquivalence,
>> TestPerFieldPostingsFormat2, TestDocCount, TestSegmentTermEnum,
>> TestDocValuesIndexing, TestCharFilter, TestDocIdSet, TestDocsAndPositions,
>> TestSimpleAttributeImpl, TestIndexWriterWithThreads,
>> TestAutomatonQuery, Nested1, TestSumDocFreq,
>> TestSpanSearchEquivalence, TestRegexpRandom2, TestDocIdBitSet,
>> TestSmallFloat, TestCodecs, TestPayloadExplanations,
>> TestSpanMultiTermQueryWrapper, TestIndexWriterMergePolicy,
>> TestSearchWithThreads, TestUnicodeUtil, Test2BNumericDocValues,
>> TestNumericUtils, MultiCollectorTest, TestTermVectorsReader,
>> TestDocument, TestToken, TestBackwardsCompatibility3x,
>> TestTermVectorsFormat, TestSpecialOperations, TestPayloadsOnVectors,
>> TestPrefixCodedTerms, TestFilterAtomicReader, TestVersionComparator,
>> TestTransactions, TestBackwardsCompatibility, TestDocumentWriter,
>> TestForUtil, TestTryDelete, TestPerFieldDocValuesFormat,
>> TestCompressingTermVectorsFormat, TestNumericRangeQuery64,
>> TestBytesStore, TestLookaheadTokenFilter, TestAddIndexes,
>> TestIndexWriterExceptions, TestStressIndexing, TestBlockPostingsFormat2,
>> TestDocTermOrdsRewriteMethod]
>>    [junit4] Completed on J1 in 0.26s, 2 tests, 2 errors <<< FAILURES!
>>
>> [...truncated 257 lines...]
>>    [junit4] Suite: org.apache.lucene.search.TestFilteredSearch
>>    [junit4]   2> NOTE: reproduce with: ant test  -Dtestcase=TestFilteredSearch
>> -Dtests.method=testFilteredSearch -Dtests.seed=448BBB0F2B44D6F3 -
>> Dtests.multiplier=3 -Dtests.slow=true -Dtests.locale=ja -
>> Dtests.timezone=Atlantic/Stanley -Dtests.file.encoding=US-ASCII
>>    [junit4] ERROR   0.01s J1 | TestFilteredSearch.testFilteredSearch <<<
>>    [junit4]    > Throwable #1: java.lang.ArrayIndexOutOfBoundsException
>>    [junit4]    >      at
>> __randomizedtesting.SeedInfo.seed([448BBB0F2B44D6F3:55210B50E849052
>> B]:0)
>>    [junit4]    >      at
>> org.apache.lucene.store.ByteArrayDataInput.readVLong(ByteArrayDataInpu
>> t.java:126)
>>    [junit4]    >      at
>> org.apache.lucene.codecs.memory.FSTOrdTermsReader$TermsReader$Base
>> TermsEnum.refillMetadata(FSTOrdTermsReader.java:390)
>>    [junit4]    >      at
>> org.apache.lucene.codecs.memory.FSTOrdTermsReader$TermsReader$Base
>> TermsEnum.decodeMetaData(FSTOrdTermsReader.java:357)
>>    [junit4]    >      at
>> org.apache.lucene.codecs.memory.FSTOrdTermsReader$TermsReader$Seg
>> mentTermsEnum.decodeMetaData(FSTOrdTermsReader.java:471)
>>    [junit4]    >      at
>> org.apache.lucene.codecs.memory.FSTOrdTermsReader$TermsReader$Base
>> TermsEnum.docs(FSTOrdTermsReader.java:426)
>>    [junit4]    >      at
>> org.apache.lucene.index.MultiTermsEnum.docs(MultiTermsEnum.java:403)
>>    [junit4]    >      at
>> org.apache.lucene.codecs.TermsConsumer.merge(TermsConsumer.java:106
>> )
>>    [junit4]    >      at
>> org.apache.lucene.codecs.FieldsConsumer.merge(FieldsConsumer.java:72)
>>    [junit4]    >      at
>> org.apache.lucene.index.SegmentMerger.mergeTerms(SegmentMerger.jav
>> a:389)
>>    [junit4]    >      at
>> org.apache.lucene.index.SegmentMerger.merge(SegmentMerger.java:112)
>>    [junit4]    >      at
>> org.apache.lucene.index.IndexWriter.mergeMiddle(IndexWriter.java:4141)
>>    [junit4]    >      at
>> org.apache.lucene.index.IndexWriter.merge(IndexWriter.java:3737)
>>    [junit4]    >      at
>> org.apache.lucene.index.SerialMergeScheduler.merge(SerialMergeSchedule
>> r.java:40)
>>    [junit4]    >      at
>> org.apache.lucene.index.IndexWriter.maybeMerge(IndexWriter.java:1991)
>>    [junit4]    >      at
>> org.apache.lucene.index.IndexWriter.forceMerge(IndexWriter.java:1801)
>>    [junit4]    >      at
>> org.apache.lucene.index.IndexWriter.forceMerge(IndexWriter.java:1754)
>>    [junit4]    >      at
>> org.apache.lucene.search.TestFilteredSearch.searchFiltered(TestFilteredSea
>> rch.java:69)
>>    [junit4]    >      at
>> org.apache.lucene.search.TestFilteredSearch.testFilteredSearch(TestFiltered
>> Search.java:51)
>>    [junit4]    >      at java.lang.Thread.run(Thread.java:853)
>>    [junit4]   2> NOTE: test params are: codec=Lucene46:
>> {category=PostingsFormat(name=MockRandom)}, docValues:{},
>> sim=DefaultSimilarity, locale=ja, timezone=Atlantic/Stanley
>>    [junit4]   2> NOTE: Linux 3.8.0-38-generic x86/IBM Corporation 1.7.0 (32-
>> bit)/cpus=8,threads=1,free=213084160,total=297009152
>>    [junit4]   2> NOTE: All tests run in this JVM: [TestCodecHoldsOpenFiles,
>> TestSubScorerFreqs, TestEliasFanoSequence, TestBooleanQuery,
>> TestPerFieldPostingsFormat, TestTieredMergePolicy,
>> TestDoubleBarrelLRUCache, Before3, Before3, TestTerm,
>> TestAttributeSource, TestBasics, TestLongPostings, TestEliasFanoDocIdSet,
>> TestHighCompressionMode, TestIndexWriterDelete,
>> TestSnapshotDeletionPolicy, TestRAMDirectory, TestIndexWriterUnicode,
>> TestQueryBuilder, TestLevenshteinAutomata, TestLazyProxSkipping,
>> TestSimilarityBase, TestWorstCaseTestBehavior, TestMinimize,
>> TestRecyclingByteBlockAllocator, TestConsistentFieldNumbers,
>> TestFieldInfos, Nested1, TestIndexWriterConfig, TestGraphTokenizers,
>> Nested1, TestSortDocValues, TestConstantScoreQuery,
>> TestDocInverterPerFieldErrorInfo, TestNRTCachingDirectory, TestPrefixFilter,
>> TestLucene40TermVectorsFormat, TestSpanExplanations,
>> TestIndexWriterLockRelease, TestRegexpRandom, TestMixedCodecs,
>> TestTopDocsCollector, TestCompressingStoredFieldsFormat,
>> TestExplanations, TestBitVector, TestBinaryDocValuesUpdates,
>> InBeforeClass, InAfterClass, InTestMethod, NonStringProperties,
>> TestIndexInput, TestGroupFiltering, TestIndexWriterNRTIsCurrent,
>> TestNearSpansOrdered, TestSpans, TestCrashCausesCorruptIndex,
>> TestLiveFieldValues, TestOmitNorms, TestWildcardRandom, TestTermScorer,
>> TestOmitPositions, TestSimpleSearchEquivalence,
>> TestPerFieldPostingsFormat2, TestDocCount, TestSegmentTermEnum,
>> TestDocValuesIndexing, TestCharFilter, TestDocIdSet, TestDocsAndPositions,
>> TestSimpleAttributeImpl, TestIndexWriterWithThreads,
>> TestAutomatonQuery, Nested1, TestSumDocFreq,
>> TestSpanSearchEquivalence, TestRegexpRandom2, TestDocIdBitSet,
>> TestSmallFloat, TestCodecs, TestPayloadExplanations,
>> TestSpanMultiTermQueryWrapper, TestIndexWriterMergePolicy,
>> TestSearchWithThreads, TestUnicodeUtil, Test2BNumericDocValues,
>> TestNumericUtils, MultiCollectorTest, TestTermVectorsReader,
>> TestDocument, TestToken, TestBackwardsCompatibility3x,
>> TestTermVectorsFormat, TestSpecialOperations, TestPayloadsOnVectors,
>> TestPrefixCodedTerms, TestFilterAtomicReader, TestVersionComparator,
>> TestTransactions, TestBackwardsCompatibility, TestDocumentWriter,
>> TestForUtil, TestTryDelete, TestPerFieldDocValuesFormat,
>> TestCompressingTermVectorsFormat, TestNumericRangeQuery64,
>> TestBytesStore, TestLookaheadTokenFilter, TestAddIndexes,
>> TestIndexWriterExceptions, TestStressIndexing, TestBlockPostingsFormat2,
>> TestDocTermOrdsRewriteMethod, TestLucene40PostingsReader,
>> TestIndexWriterForceMerge, TestByteSlices, TestBufferedIndexInput,
>> TestWeakIdentityMap, TestSegmentMerger, TestPhraseQuery,
>> TestCollectionUtil, TestBagOfPositions, TestFixedBitSet,
>> TestComplexExplanations, TestSegmentReader,
>> TestFastDecompressionMode, TestParallelCompositeReader,
>> TestFieldCacheRewriteMethod, TestMultiThreadTermVectors,
>> TestSegmentTermDocs, TestBlockPostingsFormat, TestMultiDocValues,
>> TestFlex, TestUTF32ToUTF8, TestFilteredQuery, TestOmitTf,
>> TestTermRangeQuery, TestDocumentsWriterDeleteQueue,
>> TestPayloadNearQuery, TestScorerPerf, TestForTooMuchCloning,
>> TestFuzzyQuery, TestDoc, TestSimilarity2, TestFieldMaskingSpanQuery,
>> TestExternalCodecs, TestPerSegmentDeletes, TestIntBlockPool,
>> TestTopFieldCollector, TestIndexableField, TestSentinelIntSet, TestDirectory,
>> TestCheckIndex, TestBooleanQueryVisitSubscorers,
>> TestSizeBoundedForceMerge, TestCompiledAutomaton, TestFilteredSearch]
>>    [junit4] Completed on J1 in 0.02s, 1 test, 1 error <<< FAILURES!
>>
>> [...truncated 283 lines...]
>> BUILD FAILED
>> /mnt/ssd/jenkins/workspace/Lucene-Solr-4.x-Linux@2/build.xml:467: The
>> following error occurred while executing this line:
>> /mnt/ssd/jenkins/workspace/Lucene-Solr-4.x-Linux@2/build.xml:460: The
>> following error occurred while executing this line:
>> /mnt/ssd/jenkins/workspace/Lucene-Solr-4.x-Linux@2/build.xml:45: The
>> following error occurred while executing this line:
>> /mnt/ssd/jenkins/workspace/Lucene-Solr-4.x-Linux@2/extra-
>> targets.xml:37: The following error occurred while executing this line:
>> /mnt/ssd/jenkins/workspace/Lucene-Solr-4.x-Linux@2/lucene/build.xml:49:
>> The following error occurred while executing this line:
>> /mnt/ssd/jenkins/workspace/Lucene-Solr-4.x-Linux@2/lucene/common-
>> build.xml:1297: The following error occurred while executing this line:
>> /mnt/ssd/jenkins/workspace/Lucene-Solr-4.x-Linux@2/lucene/common-
>> build.xml:921: There were test failures: 400 suites, 3108 tests, 5 errors, 100
>> ignored (90 assumptions)
>>
>> Total time: 20 minutes 2 seconds
>> Build step 'Invoke Ant' marked build as failure
>> Description set: Java: 32bit/ibm-j9-jdk7 -
>> Xjit:exclude={org/apache/lucene/util/fst/FST.pack(IIF)Lorg/apache/lucene/u
>> til/fst/FST;}
>> Archiving artifacts
>> Recording test results
>> Email was triggered for: Failure
>> Sending email for trigger: Failure
>>
>
>
>
> ---------------------------------------------------------------------
> To unsubscribe, e-mail: dev-unsubscribe@lucene.apache.org
> For additional commands, e-mail: dev-help@lucene.apache.org
>

---------------------------------------------------------------------
To unsubscribe, e-mail: dev-unsubscribe@lucene.apache.org
For additional commands, e-mail: dev-help@lucene.apache.org


Mime
View raw message