lucene-dev mailing list archives

Site index · List index
Message view « Date » · « Thread »
Top « Date » · « Thread »
From Robert Muir <rcm...@gmail.com>
Subject Re: [JENKINS] Lucene-Solr-4.x-Linux (32bit/jdk1.7.0_60-ea-b10) - Build # 9897 - Failure!
Date Thu, 10 Apr 2014 21:53:07 GMT
this is a different bug, in this case the offsets computation is wrong.
i'll open an issue.

On Sat, Apr 5, 2014 at 6:37 PM, Policeman Jenkins Server
<jenkins@thetaphi.de> wrote:
> Build: http://jenkins.thetaphi.de/job/Lucene-Solr-4.x-Linux/9897/
> Java: 32bit/jdk1.7.0_60-ea-b10 -server -XX:+UseSerialGC
>
> 1 tests failed.
> REGRESSION:  org.apache.lucene.analysis.icu.TestICUNormalizer2CharFilter.testRandomStrings
>
> Error Message:
> startOffset 107 expected:<587> but was:<588>
>
> Stack Trace:
> java.lang.AssertionError: startOffset 107 expected:<587> but was:<588>
>         at __randomizedtesting.SeedInfo.seed([19423CE8988D3E11:91CB3C563B896924]:0)
>         at org.junit.Assert.fail(Assert.java:93)
>         at org.junit.Assert.failNotEquals(Assert.java:647)
>         at org.junit.Assert.assertEquals(Assert.java:128)
>         at org.junit.Assert.assertEquals(Assert.java:472)
>         at org.apache.lucene.analysis.BaseTokenStreamTestCase.assertTokenStreamContents(BaseTokenStreamTestCase.java:181)
>         at org.apache.lucene.analysis.BaseTokenStreamTestCase.assertTokenStreamContents(BaseTokenStreamTestCase.java:294)
>         at org.apache.lucene.analysis.BaseTokenStreamTestCase.assertTokenStreamContents(BaseTokenStreamTestCase.java:298)
>         at org.apache.lucene.analysis.BaseTokenStreamTestCase.checkAnalysisConsistency(BaseTokenStreamTestCase.java:857)
>         at org.apache.lucene.analysis.BaseTokenStreamTestCase.checkRandomData(BaseTokenStreamTestCase.java:612)
>         at org.apache.lucene.analysis.BaseTokenStreamTestCase.checkRandomData(BaseTokenStreamTestCase.java:511)
>         at org.apache.lucene.analysis.BaseTokenStreamTestCase.checkRandomData(BaseTokenStreamTestCase.java:435)
>         at org.apache.lucene.analysis.icu.TestICUNormalizer2CharFilter.testRandomStrings(TestICUNormalizer2CharFilter.java:186)
>         at sun.reflect.NativeMethodAccessorImpl.invoke0(Native Method)
>         at sun.reflect.NativeMethodAccessorImpl.invoke(NativeMethodAccessorImpl.java:57)
>         at sun.reflect.DelegatingMethodAccessorImpl.invoke(DelegatingMethodAccessorImpl.java:43)
>         at java.lang.reflect.Method.invoke(Method.java:606)
>         at com.carrotsearch.randomizedtesting.RandomizedRunner.invoke(RandomizedRunner.java:1618)
>         at com.carrotsearch.randomizedtesting.RandomizedRunner$6.evaluate(RandomizedRunner.java:827)
>         at com.carrotsearch.randomizedtesting.RandomizedRunner$7.evaluate(RandomizedRunner.java:863)
>         at com.carrotsearch.randomizedtesting.RandomizedRunner$8.evaluate(RandomizedRunner.java:877)
>         at org.apache.lucene.util.TestRuleSetupTeardownChained$1.evaluate(TestRuleSetupTeardownChained.java:50)
>         at org.apache.lucene.util.TestRuleFieldCacheSanity$1.evaluate(TestRuleFieldCacheSanity.java:51)
>         at org.apache.lucene.util.AbstractBeforeAfterRule$1.evaluate(AbstractBeforeAfterRule.java:46)
>         at com.carrotsearch.randomizedtesting.rules.SystemPropertiesInvariantRule$1.evaluate(SystemPropertiesInvariantRule.java:55)
>         at org.apache.lucene.util.TestRuleThreadAndTestName$1.evaluate(TestRuleThreadAndTestName.java:49)
>         at org.apache.lucene.util.TestRuleIgnoreAfterMaxFailures$1.evaluate(TestRuleIgnoreAfterMaxFailures.java:65)
>         at org.apache.lucene.util.TestRuleMarkFailure$1.evaluate(TestRuleMarkFailure.java:48)
>         at com.carrotsearch.randomizedtesting.rules.StatementAdapter.evaluate(StatementAdapter.java:36)
>         at com.carrotsearch.randomizedtesting.ThreadLeakControl$StatementRunner.run(ThreadLeakControl.java:360)
>         at com.carrotsearch.randomizedtesting.ThreadLeakControl.forkTimeoutingTask(ThreadLeakControl.java:793)
>         at com.carrotsearch.randomizedtesting.ThreadLeakControl$3.evaluate(ThreadLeakControl.java:453)
>         at com.carrotsearch.randomizedtesting.RandomizedRunner.runSingleTest(RandomizedRunner.java:836)
>         at com.carrotsearch.randomizedtesting.RandomizedRunner$3.evaluate(RandomizedRunner.java:738)
>         at com.carrotsearch.randomizedtesting.RandomizedRunner$4.evaluate(RandomizedRunner.java:772)
>         at com.carrotsearch.randomizedtesting.RandomizedRunner$5.evaluate(RandomizedRunner.java:783)
>         at org.apache.lucene.util.AbstractBeforeAfterRule$1.evaluate(AbstractBeforeAfterRule.java:46)
>         at org.apache.lucene.util.TestRuleStoreClassName$1.evaluate(TestRuleStoreClassName.java:42)
>         at com.carrotsearch.randomizedtesting.rules.SystemPropertiesInvariantRule$1.evaluate(SystemPropertiesInvariantRule.java:55)
>         at com.carrotsearch.randomizedtesting.rules.NoShadowingOrOverridesOnMethodsRule$1.evaluate(NoShadowingOrOverridesOnMethodsRule.java:39)
>         at com.carrotsearch.randomizedtesting.rules.NoShadowingOrOverridesOnMethodsRule$1.evaluate(NoShadowingOrOverridesOnMethodsRule.java:39)
>         at com.carrotsearch.randomizedtesting.rules.StatementAdapter.evaluate(StatementAdapter.java:36)
>         at com.carrotsearch.randomizedtesting.rules.StatementAdapter.evaluate(StatementAdapter.java:36)
>         at org.apache.lucene.util.TestRuleAssertionsRequired$1.evaluate(TestRuleAssertionsRequired.java:43)
>         at org.apache.lucene.util.TestRuleMarkFailure$1.evaluate(TestRuleMarkFailure.java:48)
>         at org.apache.lucene.util.TestRuleIgnoreAfterMaxFailures$1.evaluate(TestRuleIgnoreAfterMaxFailures.java:65)
>         at org.apache.lucene.util.TestRuleIgnoreTestSuites$1.evaluate(TestRuleIgnoreTestSuites.java:55)
>         at com.carrotsearch.randomizedtesting.rules.StatementAdapter.evaluate(StatementAdapter.java:36)
>         at com.carrotsearch.randomizedtesting.ThreadLeakControl$StatementRunner.run(ThreadLeakControl.java:360)
>         at java.lang.Thread.run(Thread.java:744)
>
>
>
>
> Build Log:
> [...truncated 6159 lines...]
>    [junit4] Suite: org.apache.lucene.analysis.icu.TestICUNormalizer2CharFilter
>    [junit4]   2> TEST FAIL: useCharFilter=false text='\u25f4\u25a7\u25aa\u25dd\u25ee\u25e2
 \u03bb\u0395\u03ad\u03f0\u03c3\u03fb\u03c6\u03c1\u039f\u03b7 \u048c xq </ exe  yvjq  qhpgwza
c  yex \ud834\ude20\ud834\ude33    \u27fb\u27f5\u27f0\u27fb tcrwozsy \u3013\u302b\u301a\u3029\u300e
\u14c8\u1557\u15ac\u15db \ud97b\udcda\u0019 \ua78f\ua724 \ufe5f\u0656\u296f\u4c43s \u273e\u275e\u2779\u2783\u27a1
\u21d6\u21ac\u219e\u21b9 oziajo %\u04f2\uf2c5 \ue1f8\u8aaa\u14d3\u84d8\u0100\udbda\udead\u122bR\u03d0\ue053
y\u013f[ eojnm qw.y  schfb keva cne \udbdc\udc8f\ud963\ude1c\ue018 dlzjytso govlhp \uf2b4
\u10cc\u10f3\u10ab ihu {1,5}(e)  fsmzu qp rctzcqbz xbaakers  \u1c21\u1c26\u1c40\u1c24\u1c0b
 dtggut mwtkmvsk wy uuw \uda62\udfec\uf298\u0216\u0605\u01e1\udbf9\udc4b \u4daa nogsr gxt
gkdqwg \uef6eR\u612a^\u00f7g \u185d\u1877 tio \u89d6\u000e\ueab8\u06b8\udafc\udd4e\uf8d3 
rjsvyw luwf  vzk \ue6ee\u4388\u9a3d$\ub197\u014c t \u13a8\u13b9\u13e6\u13e2 \ucd92\uc78e\u81ccB
wqrq  jjpw \ud83c\udc6e\ud83c\udc37 ed  m \u16eb\u16f7\u16cf\u16d2\u16fb\u16c6\u16fa mocoy
bc q \ueab4\u1fa5\u0421\u3e91\udaf3\udf98\ud914\udeef\u0658\u0099 kq \\\"<!- bxrqay \ud834\ude19
          \u2ce1\u2caf\u2c8d\u2cc6\u2cae\u2c8a\u2cb3 btjl lw  vumawv x i \ud83c\udc4d\ud83c\udc5c
\udbbe\udee3  \ud935\udfd9\uf4ba \u1fc1 \ued66\ud822\udd97\u32af\u0353\u04b2\udb2f\uddb9m\ud966\udf6fw
o oqpfar g hhlhijssq \uabca\uabcc\uabe7\uabd4\uabec\uabe9\uabdc kyxn \ufe51 kgif aaj i xbzxslo
NsG &#<sc \ud802\ude4d\ud802\ude3f \u17f3\u17d7\u17bb\u179f \u2ca8\u2c9a \u18e7\u18f4\u18b1\u18ff\u18b4\u18b1
\uec19{d\u034d \u2dec -\udbd5\udef6 \u0742\u15dc\ubdd2 \u0f73\u0f9f \ubec3\ufee0\ue75b\u0563\ue49b
x{0,5}uaw \ufab9\ufa1b\uf931\uf97e  \u3192\u3193 \ue7dc\u95b1  xyogyh xpmz gfaq \u045a\u04c6\u04c7\u044d\u043d
u \ua9ca\ua994\ua9d5 \u18b8 kx pw l \u057b\u06e4k vihm \udb15\udd7d\u06d1\u04e3\u0281\ud937\udf03
 \u5a9f\\\u0092\ue932eh  -u \ud8c0\udfb0\u556dC\uc01b\uc0c5\u47ff \ud859\udc21 \u8c11\u2878
whf \u1d05\u1d49\u1d5c\u1d7f\u1d7d\u1d46\u1d6d \n\uf4ee\u0525\u062a\u000b\ud864\udc8e xgazbaa
\ufb1b\ufb24\ufb33\ufb04\ufb3d\ufb09 uxj \ud800\ude87 \n< \u47f2\ud592\u0166. shctn \ufffb\ufffc\ufffe\uffff\ufff3
a '  eqmmpk \u028b\u2427\u0cdc\u01baO amnf \uee30\uf083\u0445\ud879\udc5a\u02d9 \u1704\u171e\u1711\u171e\u1707
\u080c qpz ppsikyqne g{0 kis \u02d4\u07e7\u020ff \u076a\u0779\u0769 vhi &#25445 \u0ce6\u0cc6
bi  i \uf0b8 iDomV \u30e0\u30e6\u30a9\u30b9\u30e8 zuywf  \u0491\u4e5d\u0569 \u03b6 an gywmsbohy
uujtcs {0,5} \u02d5\u02b2\u02fd\u02c2\u02ce \u0ac5\u0a8c\u0a8b\u0a85\u0ae7\u0ae1  MCvdH \ua4d0\ua4ff\ua4e2\ua4ef\ua4fe\ua4e7
\u2b4c\u2bc3\u2b9e\u2b7a\u2bbf ydgilcrg ykqpj \u1757\u174c\u1748 \u1a89\u1a61\u1a7f\u1a7e\u1a8f
\u10fa\u10d9 qn u \u017f\uf0d7\ud965\udff3\ufd22\u6d99 ex  <p \u99d9\u03f1:N 142927405
\u1245 mpcv \u2e20\u2e11\u2e1d\u2e40 <QD (]{0 qwudKP ccuisf akp \u1727\u1733\u1734\u1739\u1725
xoakcfek \ue56e h cz zbgv \u171d\u1719\u1713\u1715 \u021f\u5792\u5d58\ueddb\u08f0 tghaxfndv
  \u692a\u0602 uepfu oarw \udbaa\udd25\ub31f\ufb54a\u98ae>\uda14\udf32 \u05d8 yrl zvt </scrip
onub  spvz ;?> tlozlt  wfhieo lxxm grk n \u249f\u24ff\u24ea\u248a\u2491 \u2f3d\u2f89\u2f07
u  oubw  pycmhmug \u0c31\u0c59\u0c3c\u0c1a\u0c37\u0c16\u0c4d\u0c2c gwbah y|bq r cjck m q \ucc75\ud81c\udd20
 gzidkrvsy \u973d\ue506\u8a46r \ua943\ua947\ua955\ua931  \uf583\u04ce \ue36a\u0136\u2f34 \u175b\u1748\u1746\u1745\u1757
</ aaanike lwaqk \u1967\u196b\u1967\u1973 \ue1ad hmegkn \ud800\udc6e\ud800\udc37 \u1784\u17b9\u17e6
\u0266\uf36a\udaac\udcab rxq escl dls \u23fb\u23ba\u23f9\u2370\u23e3 --> slvrgr  \uf7e4
\ud834\udf71 niieyfu  \u1390\u1391\u139f \ua6ae\ua6db\ua6d1\ua6f2 kt  \ud83c\udd97\ud83c\udd7f\ud83c\udd6d
\u3124\u3116\u312b\u3112 wtr \ua717\ua702\ua714\ua70c\ua709   \u0750\u0765 we  wuq xsf qlnf
{1,5 ngchrb  pcvc \u38d3\uccc7\u06e1 \ud802\ude61 \udaaa\ude59\uf719\u5d92\u0428\u0019\u04a0\ue6b0=
p \uda81\udd0d\uef72y\u0698\uda3d\udca6\u000b xuook \ud802\udd23\ud802\udd29\ud802\udd3f \udaeb\udca2\u7f5c
\u2178\u2167\u2183\u218c\u2154\u218d\u2165\u2152\u218d\u215a  rn \ua64a\ua65f\ua68f\ua66d\ua697\ua67e
\u0c0d\u0c12\u0c08\u0c38\u0c35\u0c10\u0c09\u0c0d\u0c3c \u10d2\u10da\u10bb\u10c2\u10ee eywb
yitqcmt  cgt \u0277\u0283 t..p oi jpsejmk \u04a8\u1d0bm\uf447@&\u03ff\uaca0 \u0982\u09a7
nqnd mzgybt ozerlggh  bs \u000f\uae45\u0454#\ue355\uc1e5\uda7b\udd0f \ufb3d\u0342 </ MPsgS
 e kbmlhu \ud800\udf4c\ud800\udf4f \ue8ed\u993bG\u8434\ubd2c\u060a \u19b6\u19af\u19ad b nhajp
\u0002\uf10c\uae0e68R\u0008\ufda2 wzxhmeo  [-. pqetvez \u278d\u2707\u2738\u279c ;</</p><
xl \ue80d\u0017\u07ee\u0552A\u233c yobgoi \ue8ac\ueb29&qj\u0247  <p>  yn  < cel
\ud802\udc53\ud802\udc4e\ud802\udc4b\ud802\udc5e\ud802\udc4b\ud802\udc42\ud802\udc4d \uaaa1\uaaba\uaaa9
 \ua711\ua714\ua713\ua71b\ua705\ua702 zuu pw vcfb xzh k lai mmzb drubl  pgonam cmfrojcz \ud800\udf16\ud800\udf27\ud800\udf22\ud800\udf24
ksq rccf \ufa46\u0015\u641a qo fkxktja \u0470\u421b%\ued70\u04fd\u00f4\ue749 pv \ua682\ua679\ua657
 fkwtsi a nalov \ud800\udf14 @\u0012\udb07\udf2bo\uff2c\uf693\u0201 \u00c3\u00b8\u0099\u00c0\u009f
\u35a1\u3f6c\u35d7\u431b\u3e34\u4316\u4b59\u43c5\u408b\u494c\u4189 \ufe14\ufe15\ufe1d\ufe19\ufe11
\ud83c\udc86 \ud800\udde0\ud800\uddfa\ud800\uddd1 \u1cfc\u1cf0\u1cd1\u1cd9 \u51ba  \u27c1\u27dc\u27d3
\uda91\udfde\ufd7c hsyt jrl B  hhwjk \u0381\u03d3\u03fd\u038d\u0378 zvg   (-m{0,  c \uc79d\u23bd\ud80e\udfcc\u986b
fwlal \u3869\ud91d\udda5\uf141\ue556\ub990\ub9ef zgf fsdeqvyndy cvh yvtxj P \ue049 \u071c
zi w   fzhi \";  j u v\u15f8\uabc6\ufb27 oxyagu jvaqub urvw oyf eh-]b ahdmyn \ue5a8 xxu rfav
\u051a \ufe30\ufe4a\ufe37\ufe34\ufe30\ufe3a \ua9a1\ua9d4\ua9b1\ua9ab\ua9a5\ua9d1  < kk
rjvmo hwrkplx  cfmgx lmwy a!  abqf emzpv & hg jk  ahvch \u0545\u0537\u055e\u056c\u0562
\ufe14\ufe1e\ufe1e\ufe18\ufe14\ufe11\ufe1f\ufe12 d uurt tf dke <!- uvb i\ud81c\udf21 \u11f9\u03d2\ufa06\udaa9\udda5\u9d29
bef eaosj hg dkqxcl xdjsfl \u2dc3\u2da7\u2dc7\u2dad\u2dde kous \u0a1b\u0a1a\u0a73\u0a1d \ud869\udfa7\ud86a\uddfc
mhdmovx \u0006 uirl  qztwlzcr \u0ec0\u0eda\u0e90\u0ed6\u0eea\u0e92\u0ebd\u0e91\u0ec1\u0e9d
dicmqx Xhs efnndqbwn \u32e3\u3231\u321c\u32f3\u321d\u3267    \u0655\u0007` lamkepase <!-
\ud843\udfba\ud846\udeaa\ud842\udef3 wzk |[t) sboagel \u00cb\ud93a\uddb3\uf8e0u'\u061c\uda9b\udedd
tcw fpldkoj \u258a\u2589\u2597 jrsmjehd \u0391 \udb92\udf25\u02e1\u075e \u0001x {1,5}]  )t?{
it sfm \ue65a\u05e4\ufb32\u06e0\ub3d1 dot mbvwqxu xj </br><p \u4739d\ue3d3\uc8d5O
usacsy q hvtwb  k dak fkkhlhph  rl w \ua95a\ua93b\ua949\ua950\ua951\ua939\ua933\ua94b umkmldr
wueuxhwj \u1df2 thqwfwu'
>    [junit4]   2> NOTE: reproduce with: ant test  -Dtestcase=TestICUNormalizer2CharFilter
-Dtests.method=testRandomStrings -Dtests.seed=19423CE8988D3E11 -Dtests.multiplier=3 -Dtests.slow=true
-Dtests.locale=en -Dtests.timezone=America/Bahia_Banderas -Dtests.file.encoding=UTF-8
>    [junit4] FAILURE 2.37s J0 | TestICUNormalizer2CharFilter.testRandomStrings <<<
>    [junit4]    > Throwable #1: java.lang.AssertionError: startOffset 107 expected:<587>
but was:<588>
>    [junit4]    >        at __randomizedtesting.SeedInfo.seed([19423CE8988D3E11:91CB3C563B896924]:0)
>    [junit4]    >        at org.apache.lucene.analysis.BaseTokenStreamTestCase.assertTokenStreamContents(BaseTokenStreamTestCase.java:181)
>    [junit4]    >        at org.apache.lucene.analysis.BaseTokenStreamTestCase.assertTokenStreamContents(BaseTokenStreamTestCase.java:294)
>    [junit4]    >        at org.apache.lucene.analysis.BaseTokenStreamTestCase.assertTokenStreamContents(BaseTokenStreamTestCase.java:298)
>    [junit4]    >        at org.apache.lucene.analysis.BaseTokenStreamTestCase.checkAnalysisConsistency(BaseTokenStreamTestCase.java:857)
>    [junit4]    >        at org.apache.lucene.analysis.BaseTokenStreamTestCase.checkRandomData(BaseTokenStreamTestCase.java:612)
>    [junit4]    >        at org.apache.lucene.analysis.BaseTokenStreamTestCase.checkRandomData(BaseTokenStreamTestCase.java:511)
>    [junit4]    >        at org.apache.lucene.analysis.BaseTokenStreamTestCase.checkRandomData(BaseTokenStreamTestCase.java:435)
>    [junit4]    >        at org.apache.lucene.analysis.icu.TestICUNormalizer2CharFilter.testRandomStrings(TestICUNormalizer2CharFilter.java:186)
>    [junit4]    >        at java.lang.Thread.run(Thread.java:744)
>    [junit4]   2> NOTE: test params are: codec=Lucene46: {dummy=PostingsFormat(name=Direct)},
docValues:{}, sim=RandomSimilarityProvider(queryNorm=false,coord=crazy): {}, locale=en, timezone=America/Bahia_Banderas
>    [junit4]   2> NOTE: Linux 3.8.0-38-generic i386/Oracle Corporation 1.7.0_60-ea
(32-bit)/cpus=8,threads=1,free=32659784,total=64880640
>    [junit4]   2> NOTE: All tests run in this JVM: [TestICUTransformFilterFactory,
TestICUFoldingFilterFactory, TestICUTokenizer, TestICUCollationKeyFilter, TestICUCollationKeyFilterFactory,
TestICUCollationKeyAnalyzer, TestWithCJKBigramFilter, TestICUNormalizer2FilterFactory, TestCharArrayIterator,
TestICUNormalizer2CharFilter]
>    [junit4] Completed on J0 in 10.35s, 17 tests, 1 failure <<< FAILURES!
>
> [...truncated 13 lines...]
> BUILD FAILED
> /mnt/ssd/jenkins/workspace/Lucene-Solr-4.x-Linux/build.xml:467: The following error occurred
while executing this line:
> /mnt/ssd/jenkins/workspace/Lucene-Solr-4.x-Linux/build.xml:447: The following error occurred
while executing this line:
> /mnt/ssd/jenkins/workspace/Lucene-Solr-4.x-Linux/build.xml:45: The following error occurred
while executing this line:
> /mnt/ssd/jenkins/workspace/Lucene-Solr-4.x-Linux/extra-targets.xml:37: The following
error occurred while executing this line:
> /mnt/ssd/jenkins/workspace/Lucene-Solr-4.x-Linux/lucene/build.xml:539: The following
error occurred while executing this line:
> /mnt/ssd/jenkins/workspace/Lucene-Solr-4.x-Linux/lucene/common-build.xml:2002: The following
error occurred while executing this line:
> /mnt/ssd/jenkins/workspace/Lucene-Solr-4.x-Linux/lucene/analysis/build.xml:106: The following
error occurred while executing this line:
> /mnt/ssd/jenkins/workspace/Lucene-Solr-4.x-Linux/lucene/analysis/build.xml:38: The following
error occurred while executing this line:
> /mnt/ssd/jenkins/workspace/Lucene-Solr-4.x-Linux/lucene/module-build.xml:60: The following
error occurred while executing this line:
> /mnt/ssd/jenkins/workspace/Lucene-Solr-4.x-Linux/lucene/common-build.xml:1282: The following
error occurred while executing this line:
> /mnt/ssd/jenkins/workspace/Lucene-Solr-4.x-Linux/lucene/common-build.xml:908: There were
test failures: 17 suites, 125 tests, 1 failure
>
> Total time: 21 minutes 51 seconds
> Build step 'Invoke Ant' marked build as failure
> Description set: Java: 32bit/jdk1.7.0_60-ea-b10 -server -XX:+UseSerialGC
> Archiving artifacts
> Recording test results
> Email was triggered for: Failure
> Sending email for trigger: Failure
>
>
>
>
> ---------------------------------------------------------------------
> To unsubscribe, e-mail: dev-unsubscribe@lucene.apache.org
> For additional commands, e-mail: dev-help@lucene.apache.org

---------------------------------------------------------------------
To unsubscribe, e-mail: dev-unsubscribe@lucene.apache.org
For additional commands, e-mail: dev-help@lucene.apache.org


Mime
View raw message