lucene-dev mailing list archives

Site index · List index
Message view « Date » · « Thread »
Top « Date » · « Thread »
From Policeman Jenkins Server <jenk...@thetaphi.de>
Subject [JENKINS] Lucene-Solr-trunk-MacOSX (64bit/jdk1.8.0) - Build # 1486 - Still Failing!
Date Fri, 11 Apr 2014 22:14:36 GMT
Build: http://jenkins.thetaphi.de/job/Lucene-Solr-trunk-MacOSX/1486/
Java: 64bit/jdk1.8.0 -XX:+UseCompressedOops -XX:+UseG1GC

1 tests failed.
REGRESSION:  org.apache.solr.core.TestNonNRTOpen.testReaderIsNotNRT

Error Message:
SOLR-5815? : wrong maxDoc: core=org.apache.solr.core.SolrCore@466bd027 searcher=Searcher@57f47266[collection1] main{StandardDirectoryReader(segments_8:16 _4(5.0):C1 _5(5.0):C1)} expected:<3> but was:<2>

Stack Trace:
java.lang.AssertionError: SOLR-5815? : wrong maxDoc: core=org.apache.solr.core.SolrCore@466bd027 searcher=Searcher@57f47266[collection1] main{StandardDirectoryReader(segments_8:16 _4(5.0):C1 _5(5.0):C1)} expected:<3> but was:<2>
	at __randomizedtesting.SeedInfo.seed([AEEA33790E83F9B6:1B6C52FEB1424B42]:0)
	at org.junit.Assert.fail(Assert.java:93)
	at org.junit.Assert.failNotEquals(Assert.java:647)
	at org.junit.Assert.assertEquals(Assert.java:128)
	at org.junit.Assert.assertEquals(Assert.java:472)
	at org.apache.solr.core.TestNonNRTOpen.assertNotNRT(TestNonNRTOpen.java:142)
	at org.apache.solr.core.TestNonNRTOpen.testReaderIsNotNRT(TestNonNRTOpen.java:100)
	at sun.reflect.NativeMethodAccessorImpl.invoke0(Native Method)
	at sun.reflect.NativeMethodAccessorImpl.invoke(NativeMethodAccessorImpl.java:62)
	at sun.reflect.DelegatingMethodAccessorImpl.invoke(DelegatingMethodAccessorImpl.java:43)
	at java.lang.reflect.Method.invoke(Method.java:483)
	at com.carrotsearch.randomizedtesting.RandomizedRunner.invoke(RandomizedRunner.java:1618)
	at com.carrotsearch.randomizedtesting.RandomizedRunner$6.evaluate(RandomizedRunner.java:827)
	at com.carrotsearch.randomizedtesting.RandomizedRunner$7.evaluate(RandomizedRunner.java:863)
	at com.carrotsearch.randomizedtesting.RandomizedRunner$8.evaluate(RandomizedRunner.java:877)
	at com.carrotsearch.randomizedtesting.rules.SystemPropertiesRestoreRule$1.evaluate(SystemPropertiesRestoreRule.java:53)
	at org.apache.lucene.util.TestRuleSetupTeardownChained$1.evaluate(TestRuleSetupTeardownChained.java:50)
	at org.apache.lucene.util.TestRuleFieldCacheSanity$1.evaluate(TestRuleFieldCacheSanity.java:51)
	at org.apache.lucene.util.AbstractBeforeAfterRule$1.evaluate(AbstractBeforeAfterRule.java:46)
	at com.carrotsearch.randomizedtesting.rules.SystemPropertiesInvariantRule$1.evaluate(SystemPropertiesInvariantRule.java:55)
	at org.apache.lucene.util.TestRuleThreadAndTestName$1.evaluate(TestRuleThreadAndTestName.java:49)
	at org.apache.lucene.util.TestRuleIgnoreAfterMaxFailures$1.evaluate(TestRuleIgnoreAfterMaxFailures.java:65)
	at org.apache.lucene.util.TestRuleMarkFailure$1.evaluate(TestRuleMarkFailure.java:48)
	at com.carrotsearch.randomizedtesting.rules.StatementAdapter.evaluate(StatementAdapter.java:36)
	at com.carrotsearch.randomizedtesting.ThreadLeakControl$StatementRunner.run(ThreadLeakControl.java:360)
	at com.carrotsearch.randomizedtesting.ThreadLeakControl.forkTimeoutingTask(ThreadLeakControl.java:793)
	at com.carrotsearch.randomizedtesting.ThreadLeakControl$3.evaluate(ThreadLeakControl.java:453)
	at com.carrotsearch.randomizedtesting.RandomizedRunner.runSingleTest(RandomizedRunner.java:836)
	at com.carrotsearch.randomizedtesting.RandomizedRunner$3.evaluate(RandomizedRunner.java:738)
	at com.carrotsearch.randomizedtesting.RandomizedRunner$4.evaluate(RandomizedRunner.java:772)
	at com.carrotsearch.randomizedtesting.RandomizedRunner$5.evaluate(RandomizedRunner.java:783)
	at com.carrotsearch.randomizedtesting.rules.StatementAdapter.evaluate(StatementAdapter.java:36)
	at com.carrotsearch.randomizedtesting.rules.SystemPropertiesRestoreRule$1.evaluate(SystemPropertiesRestoreRule.java:53)
	at org.apache.lucene.util.AbstractBeforeAfterRule$1.evaluate(AbstractBeforeAfterRule.java:46)
	at org.apache.lucene.util.TestRuleStoreClassName$1.evaluate(TestRuleStoreClassName.java:42)
	at com.carrotsearch.randomizedtesting.rules.SystemPropertiesInvariantRule$1.evaluate(SystemPropertiesInvariantRule.java:55)
	at com.carrotsearch.randomizedtesting.rules.NoShadowingOrOverridesOnMethodsRule$1.evaluate(NoShadowingOrOverridesOnMethodsRule.java:39)
	at com.carrotsearch.randomizedtesting.rules.NoShadowingOrOverridesOnMethodsRule$1.evaluate(NoShadowingOrOverridesOnMethodsRule.java:39)
	at com.carrotsearch.randomizedtesting.rules.StatementAdapter.evaluate(StatementAdapter.java:36)
	at com.carrotsearch.randomizedtesting.rules.StatementAdapter.evaluate(StatementAdapter.java:36)
	at org.apache.lucene.util.TestRuleAssertionsRequired$1.evaluate(TestRuleAssertionsRequired.java:43)
	at org.apache.lucene.util.TestRuleMarkFailure$1.evaluate(TestRuleMarkFailure.java:48)
	at org.apache.lucene.util.TestRuleIgnoreAfterMaxFailures$1.evaluate(TestRuleIgnoreAfterMaxFailures.java:65)
	at org.apache.lucene.util.TestRuleIgnoreTestSuites$1.evaluate(TestRuleIgnoreTestSuites.java:55)
	at com.carrotsearch.randomizedtesting.rules.StatementAdapter.evaluate(StatementAdapter.java:36)
	at com.carrotsearch.randomizedtesting.ThreadLeakControl$StatementRunner.run(ThreadLeakControl.java:360)
	at java.lang.Thread.run(Thread.java:744)




Build Log:
[...truncated 11480 lines...]
   [junit4] Suite: org.apache.solr.core.TestNonNRTOpen
   [junit4]   2> Creating dataDir: /Users/jenkins/workspace/Lucene-Solr-trunk-MacOSX/solr/build/solr-core/test/J0/./solr.core.TestNonNRTOpen-AEEA33790E83F9B6-001/init-core-data-001
   [junit4]   2> 3344990 T12264 oas.SolrTestCaseJ4.buildSSLConfig Randomized ssl (true) and clientAuth (false)
   [junit4]   2> 3344992 T12264 oas.SolrTestCaseJ4.initCore ####initCore
   [junit4]   2> 3344993 T12264 oasc.SolrResourceLoader.<init> new SolrResourceLoader for directory: '/Users/jenkins/workspace/Lucene-Solr-trunk-MacOSX/solr/core/src/test-files/solr/collection1/'
   [junit4]   2> 3344994 T12264 oasc.SolrResourceLoader.replaceClassLoader Adding 'file:/Users/jenkins/workspace/Lucene-Solr-trunk-MacOSX/solr/core/src/test-files/solr/collection1/lib/.svn/' to classloader
   [junit4]   2> 3344995 T12264 oasc.SolrResourceLoader.replaceClassLoader Adding 'file:/Users/jenkins/workspace/Lucene-Solr-trunk-MacOSX/solr/core/src/test-files/solr/collection1/lib/classes/' to classloader
   [junit4]   2> 3344996 T12264 oasc.SolrResourceLoader.replaceClassLoader Adding 'file:/Users/jenkins/workspace/Lucene-Solr-trunk-MacOSX/solr/core/src/test-files/solr/collection1/lib/README' to classloader
   [junit4]   2> 3345072 T12264 oasc.SolrConfig.<init> Using Lucene MatchVersion: LUCENE_50
   [junit4]   2> 3345079 T12264 oasc.SolrConfig.<init> Loaded SolrConfig: solrconfig-basic.xml
   [junit4]   2> 3345081 T12264 oass.IndexSchema.readSchema Reading Solr Schema from schema-minimal.xml
   [junit4]   2> 3345085 T12264 oass.IndexSchema.readSchema [null] Schema name=minimal
   [junit4]   2> 3345090 T12264 oass.IndexSchema.readSchema WARN no uniqueKey specified in schema.
   [junit4]   2> 3345091 T12264 oasc.SolrResourceLoader.locateSolrHome JNDI not configured for solr (NoInitialContextEx)
   [junit4]   2> 3345092 T12264 oasc.SolrResourceLoader.locateSolrHome using system property solr.solr.home: /Users/jenkins/workspace/Lucene-Solr-trunk-MacOSX/solr/core/src/test-files/solr
   [junit4]   2> 3345092 T12264 oasc.SolrResourceLoader.<init> new SolrResourceLoader for directory: '/Users/jenkins/workspace/Lucene-Solr-trunk-MacOSX/solr/core/src/test-files/solr/'
   [junit4]   2> 3345129 T12264 oasc.CoreContainer.<init> New CoreContainer 1331456909
   [junit4]   2> 3345129 T12264 oasc.CoreContainer.load Loading cores into CoreContainer [instanceDir=/Users/jenkins/workspace/Lucene-Solr-trunk-MacOSX/solr/core/src/test-files/solr/]
   [junit4]   2> 3345130 T12264 oashc.HttpShardHandlerFactory.getParameter Setting socketTimeout to: 0
   [junit4]   2> 3345135 T12264 oashc.HttpShardHandlerFactory.getParameter Setting urlScheme to: null
   [junit4]   2> 3345135 T12264 oashc.HttpShardHandlerFactory.getParameter Setting connTimeout to: 0
   [junit4]   2> 3345135 T12264 oashc.HttpShardHandlerFactory.getParameter Setting maxConnectionsPerHost to: 20
   [junit4]   2> 3345136 T12264 oashc.HttpShardHandlerFactory.getParameter Setting corePoolSize to: 0
   [junit4]   2> 3345136 T12264 oashc.HttpShardHandlerFactory.getParameter Setting maximumPoolSize to: 2147483647
   [junit4]   2> 3345136 T12264 oashc.HttpShardHandlerFactory.getParameter Setting maxThreadIdleTime to: 5
   [junit4]   2> 3345136 T12264 oashc.HttpShardHandlerFactory.getParameter Setting sizeOfQueue to: -1
   [junit4]   2> 3345137 T12264 oashc.HttpShardHandlerFactory.getParameter Setting fairnessPolicy to: false
   [junit4]   2> 3345142 T12264 oasl.LogWatcher.createWatcher SLF4J impl is org.slf4j.impl.Log4jLoggerFactory
   [junit4]   2> 3345143 T12264 oasl.LogWatcher.newRegisteredLogWatcher Registering Log Listener [Log4j (org.slf4j.impl.Log4jLoggerFactory)]
   [junit4]   2> 3345143 T12264 oasc.CoreContainer.load Host Name: 
   [junit4]   2> 3345147 T12265 oasc.SolrResourceLoader.<init> new SolrResourceLoader for directory: '/Users/jenkins/workspace/Lucene-Solr-trunk-MacOSX/solr/core/src/test-files/solr/collection1/'
   [junit4]   2> 3345148 T12265 oasc.SolrResourceLoader.replaceClassLoader Adding 'file:/Users/jenkins/workspace/Lucene-Solr-trunk-MacOSX/solr/core/src/test-files/solr/collection1/lib/.svn/' to classloader
   [junit4]   2> 3345148 T12265 oasc.SolrResourceLoader.replaceClassLoader Adding 'file:/Users/jenkins/workspace/Lucene-Solr-trunk-MacOSX/solr/core/src/test-files/solr/collection1/lib/classes/' to classloader
   [junit4]   2> 3345149 T12265 oasc.SolrResourceLoader.replaceClassLoader Adding 'file:/Users/jenkins/workspace/Lucene-Solr-trunk-MacOSX/solr/core/src/test-files/solr/collection1/lib/README' to classloader
   [junit4]   2> 3345189 T12265 oasc.SolrConfig.<init> Using Lucene MatchVersion: LUCENE_50
   [junit4]   2> 3345240 T12265 oasc.SolrConfig.<init> Loaded SolrConfig: solrconfig-basic.xml
   [junit4]   2> 3345241 T12265 oass.IndexSchema.readSchema Reading Solr Schema from schema-minimal.xml
   [junit4]   2> 3345244 T12265 oass.IndexSchema.readSchema [collection1] Schema name=minimal
   [junit4]   2> 3345246 T12265 oass.IndexSchema.readSchema WARN no uniqueKey specified in schema.
   [junit4]   2> 3345247 T12265 oasc.CoreContainer.create Creating SolrCore 'collection1' using configuration from instancedir /Users/jenkins/workspace/Lucene-Solr-trunk-MacOSX/solr/core/src/test-files/solr/collection1/
   [junit4]   2> 3345247 T12265 oasc.SolrCore.initDirectoryFactory solr.StandardDirectoryFactory
   [junit4]   2> 3345248 T12265 oasc.SolrCore.<init> [collection1] Opening new SolrCore at /Users/jenkins/workspace/Lucene-Solr-trunk-MacOSX/solr/core/src/test-files/solr/collection1/, dataDir=/Users/jenkins/workspace/Lucene-Solr-trunk-MacOSX/solr/build/solr-core/test/J0/./solr.core.TestNonNRTOpen-AEEA33790E83F9B6-001/init-core-data-001/
   [junit4]   2> 3345249 T12265 oasc.SolrCore.<init> JMX monitoring not detected for core: collection1
   [junit4]   2> 3345250 T12265 oasc.CachingDirectoryFactory.get return new directory for /Users/jenkins/workspace/Lucene-Solr-trunk-MacOSX/solr/build/solr-core/test/J0/solr.core.TestNonNRTOpen-AEEA33790E83F9B6-001/init-core-data-001
   [junit4]   2> 3345250 T12265 oasc.SolrCore.getNewIndexDir New index directory detected: old=null new=/Users/jenkins/workspace/Lucene-Solr-trunk-MacOSX/solr/build/solr-core/test/J0/./solr.core.TestNonNRTOpen-AEEA33790E83F9B6-001/init-core-data-001/index/
   [junit4]   2> 3345251 T12265 oasc.SolrCore.initIndex WARN [collection1] Solr index directory '/Users/jenkins/workspace/Lucene-Solr-trunk-MacOSX/solr/build/solr-core/test/J0/./solr.core.TestNonNRTOpen-AEEA33790E83F9B6-001/init-core-data-001/index' doesn't exist. Creating new index...
   [junit4]   2> 3345252 T12265 oasc.CachingDirectoryFactory.get return new directory for /Users/jenkins/workspace/Lucene-Solr-trunk-MacOSX/solr/build/solr-core/test/J0/solr.core.TestNonNRTOpen-AEEA33790E83F9B6-001/init-core-data-001/index
   [junit4]   2> 3345255 T12265 oasc.SolrDeletionPolicy.onCommit SolrDeletionPolicy.onCommit: commits: num=1
   [junit4]   2> 		commit{dir=/Users/jenkins/workspace/Lucene-Solr-trunk-MacOSX/solr/build/solr-core/test/J0/solr.core.TestNonNRTOpen-AEEA33790E83F9B6-001/init-core-data-001/index,segFN=segments_1,generation=1}
   [junit4]   2> 3345256 T12265 oasc.SolrDeletionPolicy.updateCommits newest commit generation = 1
   [junit4]   2> 3345259 T12265 oasc.SolrCore.loadUpdateProcessorChains no updateRequestProcessorChain defined as default, creating implicit default
   [junit4]   2> 3345260 T12265 oasc.RequestHandlers.initHandlersFromConfig created standard: solr.StandardRequestHandler
   [junit4]   2> 3345260 T12265 oasc.RequestHandlers.initHandlersFromConfig created /update: solr.UpdateRequestHandler
   [junit4]   2> 3345268 T12265 oashl.XMLLoader.init xsltCacheLifetimeSeconds=60
   [junit4]   2> 3345270 T12265 oasu.CommitTracker.<init> Hard AutoCommit: disabled
   [junit4]   2> 3345270 T12265 oasu.CommitTracker.<init> Soft AutoCommit: disabled
   [junit4]   2> 3345271 T12265 oass.SolrIndexSearcher.<init> Opening Searcher@8a9c82d[collection1] main
   [junit4]   2> 3345272 T12265 oasr.ManagedResourceStorage$FileStorageIO.configure File-based storage initialized to use dir: /Users/jenkins/workspace/Lucene-Solr-trunk-MacOSX/solr/core/src/test-files/solr/collection1/conf
   [junit4]   2> 3345272 T12265 oasr.RestManager.init Initializing RestManager with initArgs: {storageDir=/Users/jenkins/workspace/Lucene-Solr-trunk-MacOSX/solr/core/src/test-files/solr/collection1/conf/}
   [junit4]   2> 3345272 T12265 oasr.ManagedResourceStorage.load Reading _rest_managed.json using file:dir=/Users/jenkins/workspace/Lucene-Solr-trunk-MacOSX/solr/core/src/test-files/solr/collection1/conf
   [junit4]   2> 3345272 T12265 oasr.ManagedResource.reloadFromStorage WARN No stored data found for /rest/managed
   [junit4]   2> 3345273 T12265 oasr.ManagedResource.notifyObserversDuringInit WARN No registered observers for /rest/managed
   [junit4]   2> 3345274 T12265 oasr.RestManager.init Initializing 0 registered ManagedResources
   [junit4]   2> 3345274 T12266 oasc.SolrCore.registerSearcher [collection1] Registered new searcher Searcher@8a9c82d[collection1] main{StandardDirectoryReader(segments_1:1)}
   [junit4]   2> 3345274 T12265 oasc.CoreContainer.registerCore registering core: collection1
   [junit4]   2> 3345277 T12264 oas.SolrTestCaseJ4.initCore ####initCore end
   [junit4]   2> ASYNC  NEW_CORE C2249 name=collection1 org.apache.solr.core.SolrCore@74e6f659
   [junit4]   2> 3345282 T12264 C2249 oasc.SolrDeletionPolicy.onInit SolrDeletionPolicy.onInit: commits: num=1
   [junit4]   2> 		commit{dir=/Users/jenkins/workspace/Lucene-Solr-trunk-MacOSX/solr/build/solr-core/test/J0/solr.core.TestNonNRTOpen-AEEA33790E83F9B6-001/init-core-data-001/index,segFN=segments_1,generation=1}
   [junit4]   2> 3345282 T12264 C2249 oasc.SolrDeletionPolicy.updateCommits newest commit generation = 1
   [junit4]   2> 3345285 T12264 C2249 oasup.LogUpdateProcessor.finish [collection1] webapp=null path=null params={} {add=[(null)]} 0 7
   [junit4]   2> 3345288 T12264 C2249 oasu.DirectUpdateHandler2.commit start commit{,optimize=false,openSearcher=true,waitSearcher=true,expungeDeletes=false,softCommit=false,prepareCommit=false}
   [junit4]   2> 3345307 T12264 C2249 oasc.SolrDeletionPolicy.onCommit SolrDeletionPolicy.onCommit: commits: num=2
   [junit4]   2> 		commit{dir=/Users/jenkins/workspace/Lucene-Solr-trunk-MacOSX/solr/build/solr-core/test/J0/solr.core.TestNonNRTOpen-AEEA33790E83F9B6-001/init-core-data-001/index,segFN=segments_1,generation=1}
   [junit4]   2> 		commit{dir=/Users/jenkins/workspace/Lucene-Solr-trunk-MacOSX/solr/build/solr-core/test/J0/solr.core.TestNonNRTOpen-AEEA33790E83F9B6-001/init-core-data-001/index,segFN=segments_2,generation=2}
   [junit4]   2> 3345307 T12264 C2249 oasc.SolrDeletionPolicy.updateCommits newest commit generation = 2
   [junit4]   2> 3345316 T12264 C2249 oass.SolrIndexSearcher.<init> Opening Searcher@7138165f[collection1] main
   [junit4]   2> 3345317 T12266 oasc.SolrCore.registerSearcher [collection1] Registered new searcher Searcher@7138165f[collection1] main{StandardDirectoryReader(segments_2:3 _0(5.0):C1)}
   [junit4]   2> 3345318 T12264 C2249 oasu.DirectUpdateHandler2.commit end_commit_flush
   [junit4]   2> 3345318 T12264 C2249 oasup.LogUpdateProcessor.finish [collection1] webapp=null path=null params={} {commit=} 0 30
   [junit4]   2> 3345320 T12264 oas.SolrTestCaseJ4.deleteCore ###deleteCore
   [junit4]   2> 3345321 T12264 oasc.CoreContainer.shutdown Shutting down CoreContainer instance=1331456909
   [junit4]   2> 3345321 T12264 oasc.SolrCore.close [collection1]  CLOSING SolrCore org.apache.solr.core.SolrCore@74e6f659
   [junit4]   2> 3345322 T12264 oasu.DirectUpdateHandler2.close closing DirectUpdateHandler2{commits=1,autocommits=0,soft autocommits=0,optimizes=0,rollbacks=0,expungeDeletes=0,docsPending=0,adds=0,deletesById=0,deletesByQuery=0,errors=0,cumulative_adds=1,cumulative_deletesById=0,cumulative_deletesByQuery=0,cumulative_errors=0}
   [junit4]   2> 3345322 T12264 oasu.SolrCoreState.decrefSolrCoreState Closing SolrCoreState
   [junit4]   2> 3345322 T12264 oasu.DefaultSolrCoreState.closeIndexWriter SolrCoreState ref count has reached 0 - closing IndexWriter
   [junit4]   2> 3345323 T12264 oasu.DefaultSolrCoreState.closeIndexWriter closing IndexWriter with IndexWriterCloser
   [junit4]   2> 3345326 T12264 oasc.SolrCore.closeSearcher [collection1] Closing main searcher on request.
   [junit4]   2> 3345326 T12264 oasc.CachingDirectoryFactory.close Closing StandardDirectoryFactory - 2 directories currently being tracked
   [junit4]   2> 3345327 T12264 oasc.CachingDirectoryFactory.closeCacheValue looking to close /Users/jenkins/workspace/Lucene-Solr-trunk-MacOSX/solr/build/solr-core/test/J0/solr.core.TestNonNRTOpen-AEEA33790E83F9B6-001/init-core-data-001 [CachedDir<<refCount=0;path=/Users/jenkins/workspace/Lucene-Solr-trunk-MacOSX/solr/build/solr-core/test/J0/solr.core.TestNonNRTOpen-AEEA33790E83F9B6-001/init-core-data-001;done=false>>]
   [junit4]   2> 3345327 T12264 oasc.CachingDirectoryFactory.close Closing directory: /Users/jenkins/workspace/Lucene-Solr-trunk-MacOSX/solr/build/solr-core/test/J0/solr.core.TestNonNRTOpen-AEEA33790E83F9B6-001/init-core-data-001
   [junit4]   2> 3345327 T12264 oasc.CachingDirectoryFactory.closeCacheValue looking to close /Users/jenkins/workspace/Lucene-Solr-trunk-MacOSX/solr/build/solr-core/test/J0/solr.core.TestNonNRTOpen-AEEA33790E83F9B6-001/init-core-data-001/index [CachedDir<<refCount=0;path=/Users/jenkins/workspace/Lucene-Solr-trunk-MacOSX/solr/build/solr-core/test/J0/solr.core.TestNonNRTOpen-AEEA33790E83F9B6-001/init-core-data-001/index;done=false>>]
   [junit4]   2> 3345328 T12264 oasc.CachingDirectoryFactory.close Closing directory: /Users/jenkins/workspace/Lucene-Solr-trunk-MacOSX/solr/build/solr-core/test/J0/solr.core.TestNonNRTOpen-AEEA33790E83F9B6-001/init-core-data-001/index
   [junit4]   2> 3345330 T12264 oas.SolrTestCaseJ4.initCore ####initCore
   [junit4]   2> 3345330 T12264 oasc.SolrResourceLoader.<init> new SolrResourceLoader for directory: '/Users/jenkins/workspace/Lucene-Solr-trunk-MacOSX/solr/core/src/test-files/solr/collection1/'
   [junit4]   2> 3345332 T12264 oasc.SolrResourceLoader.replaceClassLoader Adding 'file:/Users/jenkins/workspace/Lucene-Solr-trunk-MacOSX/solr/core/src/test-files/solr/collection1/lib/.svn/' to classloader
   [junit4]   2> 3345332 T12264 oasc.SolrResourceLoader.replaceClassLoader Adding 'file:/Users/jenkins/workspace/Lucene-Solr-trunk-MacOSX/solr/core/src/test-files/solr/collection1/lib/classes/' to classloader
   [junit4]   2> 3345333 T12264 oasc.SolrResourceLoader.replaceClassLoader Adding 'file:/Users/jenkins/workspace/Lucene-Solr-trunk-MacOSX/solr/core/src/test-files/solr/collection1/lib/README' to classloader
   [junit4]   2> 3345408 T12264 oasc.SolrConfig.<init> Using Lucene MatchVersion: LUCENE_50
   [junit4]   2> 3345415 T12264 oasc.SolrConfig.<init> Loaded SolrConfig: solrconfig-basic.xml
   [junit4]   2> 3345416 T12264 oass.IndexSchema.readSchema Reading Solr Schema from schema-minimal.xml
   [junit4]   2> 3345420 T12264 oass.IndexSchema.readSchema [null] Schema name=minimal
   [junit4]   2> 3345424 T12264 oass.IndexSchema.readSchema WARN no uniqueKey specified in schema.
   [junit4]   2> 3345426 T12264 oasc.SolrResourceLoader.locateSolrHome JNDI not configured for solr (NoInitialContextEx)
   [junit4]   2> 3345427 T12264 oasc.SolrResourceLoader.locateSolrHome using system property solr.solr.home: /Users/jenkins/workspace/Lucene-Solr-trunk-MacOSX/solr/core/src/test-files/solr
   [junit4]   2> 3345427 T12264 oasc.SolrResourceLoader.<init> new SolrResourceLoader for directory: '/Users/jenkins/workspace/Lucene-Solr-trunk-MacOSX/solr/core/src/test-files/solr/'
   [junit4]   2> 3345468 T12264 oasc.CoreContainer.<init> New CoreContainer 907117865
   [junit4]   2> 3345470 T12264 oasc.CoreContainer.load Loading cores into CoreContainer [instanceDir=/Users/jenkins/workspace/Lucene-Solr-trunk-MacOSX/solr/core/src/test-files/solr/]
   [junit4]   2> 3345470 T12264 oashc.HttpShardHandlerFactory.getParameter Setting socketTimeout to: 0
   [junit4]   2> 3345470 T12264 oashc.HttpShardHandlerFactory.getParameter Setting urlScheme to: null
   [junit4]   2> 3345470 T12264 oashc.HttpShardHandlerFactory.getParameter Setting connTimeout to: 0
   [junit4]   2> 3345471 T12264 oashc.HttpShardHandlerFactory.getParameter Setting maxConnectionsPerHost to: 20
   [junit4]   2> 3345471 T12264 oashc.HttpShardHandlerFactory.getParameter Setting corePoolSize to: 0
   [junit4]   2> 3345471 T12264 oashc.HttpShardHandlerFactory.getParameter Setting maximumPoolSize to: 2147483647
   [junit4]   2> 3345472 T12264 oashc.HttpShardHandlerFactory.getParameter Setting maxThreadIdleTime to: 5
   [junit4]   2> 3345472 T12264 oashc.HttpShardHandlerFactory.getParameter Setting sizeOfQueue to: -1
   [junit4]   2> 3345472 T12264 oashc.HttpShardHandlerFactory.getParameter Setting fairnessPolicy to: false
   [junit4]   2> 3345487 T12264 oasl.LogWatcher.createWatcher SLF4J impl is org.slf4j.impl.Log4jLoggerFactory
   [junit4]   2> 3345488 T12264 oasl.LogWatcher.newRegisteredLogWatcher Registering Log Listener [Log4j (org.slf4j.impl.Log4jLoggerFactory)]
   [junit4]   2> 3345488 T12264 oasc.CoreContainer.load Host Name: 
   [junit4]   2> 3345503 T12268 oasc.SolrResourceLoader.<init> new SolrResourceLoader for directory: '/Users/jenkins/workspace/Lucene-Solr-trunk-MacOSX/solr/core/src/test-files/solr/collection1/'
   [junit4]   2> 3345504 T12268 oasc.SolrResourceLoader.replaceClassLoader Adding 'file:/Users/jenkins/workspace/Lucene-Solr-trunk-MacOSX/solr/core/src/test-files/solr/collection1/lib/.svn/' to classloader
   [junit4]   2> 3345504 T12268 oasc.SolrResourceLoader.replaceClassLoader Adding 'file:/Users/jenkins/workspace/Lucene-Solr-trunk-MacOSX/solr/core/src/test-files/solr/collection1/lib/classes/' to classloader
   [junit4]   2> 3345504 T12268 oasc.SolrResourceLoader.replaceClassLoader Adding 'file:/Users/jenkins/workspace/Lucene-Solr-trunk-MacOSX/solr/core/src/test-files/solr/collection1/lib/README' to classloader
   [junit4]   2> 3345540 T12268 oasc.SolrConfig.<init> Using Lucene MatchVersion: LUCENE_50
   [junit4]   2> 3345547 T12268 oasc.SolrConfig.<init> Loaded SolrConfig: solrconfig-basic.xml
   [junit4]   2> 3345548 T12268 oass.IndexSchema.readSchema Reading Solr Schema from schema-minimal.xml
   [junit4]   2> 3345552 T12268 oass.IndexSchema.readSchema [collection1] Schema name=minimal
   [junit4]   2> 3345554 T12268 oass.IndexSchema.readSchema WARN no uniqueKey specified in schema.
   [junit4]   2> 3345556 T12268 oasc.CoreContainer.create Creating SolrCore 'collection1' using configuration from instancedir /Users/jenkins/workspace/Lucene-Solr-trunk-MacOSX/solr/core/src/test-files/solr/collection1/
   [junit4]   2> 3345556 T12268 oasc.SolrCore.initDirectoryFactory solr.StandardDirectoryFactory
   [junit4]   2> 3345557 T12268 oasc.SolrCore.<init> [collection1] Opening new SolrCore at /Users/jenkins/workspace/Lucene-Solr-trunk-MacOSX/solr/core/src/test-files/solr/collection1/, dataDir=/Users/jenkins/workspace/Lucene-Solr-trunk-MacOSX/solr/build/solr-core/test/J0/./solr.core.TestNonNRTOpen-AEEA33790E83F9B6-001/init-core-data-001/
   [junit4]   2> 3345557 T12268 oasc.SolrCore.<init> JMX monitoring not detected for core: collection1
   [junit4]   2> 3345558 T12268 oasc.CachingDirectoryFactory.get return new directory for /Users/jenkins/workspace/Lucene-Solr-trunk-MacOSX/solr/build/solr-core/test/J0/solr.core.TestNonNRTOpen-AEEA33790E83F9B6-001/init-core-data-001
   [junit4]   2> 3345559 T12268 oasc.SolrCore.getNewIndexDir New index directory detected: old=null new=/Users/jenkins/workspace/Lucene-Solr-trunk-MacOSX/solr/build/solr-core/test/J0/./solr.core.TestNonNRTOpen-AEEA33790E83F9B6-001/init-core-data-001/index/
   [junit4]   2> 3345561 T12268 oasc.SolrCore.loadUpdateProcessorChains no updateRequestProcessorChain defined as default, creating implicit default
   [junit4]   2> 3345561 T12268 oasc.RequestHandlers.initHandlersFromConfig created standard: solr.StandardRequestHandler
   [junit4]   2> 3345562 T12268 oasc.RequestHandlers.initHandlersFromConfig created /update: solr.UpdateRequestHandler
   [junit4]   2> 3345570 T12268 oashl.XMLLoader.init xsltCacheLifetimeSeconds=60
   [junit4]   2> 3345571 T12268 oasu.CommitTracker.<init> Hard AutoCommit: disabled
   [junit4]   2> 3345571 T12268 oasu.CommitTracker.<init> Soft AutoCommit: disabled
   [junit4]   2> 3345572 T12268 oasc.CachingDirectoryFactory.get return new directory for /Users/jenkins/workspace/Lucene-Solr-trunk-MacOSX/solr/build/solr-core/test/J0/solr.core.TestNonNRTOpen-AEEA33790E83F9B6-001/init-core-data-001/index
   [junit4]   2> 3345575 T12268 oass.SolrIndexSearcher.<init> Opening Searcher@6bbb88eb[collection1] main
   [junit4]   2> 3345576 T12268 oasr.ManagedResourceStorage$FileStorageIO.configure File-based storage initialized to use dir: /Users/jenkins/workspace/Lucene-Solr-trunk-MacOSX/solr/core/src/test-files/solr/collection1/conf
   [junit4]   2> 3345576 T12268 oasr.RestManager.init Initializing RestManager with initArgs: {storageDir=/Users/jenkins/workspace/Lucene-Solr-trunk-MacOSX/solr/core/src/test-files/solr/collection1/conf/}
   [junit4]   2> 3345577 T12268 oasr.ManagedResourceStorage.load Reading _rest_managed.json using file:dir=/Users/jenkins/workspace/Lucene-Solr-trunk-MacOSX/solr/core/src/test-files/solr/collection1/conf
   [junit4]   2> 3345578 T12268 oasr.ManagedResource.reloadFromStorage WARN No stored data found for /rest/managed
   [junit4]   2> 3345579 T12268 oasr.ManagedResource.notifyObserversDuringInit WARN No registered observers for /rest/managed
   [junit4]   2> 3345579 T12268 oasr.RestManager.init Initializing 0 registered ManagedResources
   [junit4]   2> 3345579 T12268 oasc.CoreContainer.registerCore registering core: collection1
   [junit4]   2> 3345580 T12269 oasc.SolrCore.registerSearcher [collection1] Registered new searcher Searcher@6bbb88eb[collection1] main{StandardDirectoryReader(segments_2:3 _0(5.0):C1)}
   [junit4]   2> 3345583 T12264 oas.SolrTestCaseJ4.initCore ####initCore end
   [junit4]   2> 3345583 T12264 oasc.TestNonNRTOpen.assertNotNRT Checking notNRT & maxDoc=1 of core=org.apache.solr.core.SolrCore@5f1ed6d6
   [junit4]   2> 3345589 T12264 oas.SolrTestCaseJ4.setUp ###Starting testSharedCores
   [junit4]   2> ASYNC  NEW_CORE C2250 name=collection1 org.apache.solr.core.SolrCore@5f1ed6d6
   [junit4]   2> 3345589 T12264 C2250 oasu.DirectUpdateHandler2.deleteAll [collection1] REMOVING ALL DOCUMENTS FROM INDEX
   [junit4]   2> 3345596 T12264 C2250 oasc.SolrDeletionPolicy.onInit SolrDeletionPolicy.onInit: commits: num=1
   [junit4]   2> 		commit{dir=/Users/jenkins/workspace/Lucene-Solr-trunk-MacOSX/solr/build/solr-core/test/J0/solr.core.TestNonNRTOpen-AEEA33790E83F9B6-001/init-core-data-001/index,segFN=segments_2,generation=2}
   [junit4]   2> 3345597 T12264 C2250 oasc.SolrDeletionPolicy.updateCommits newest commit generation = 2
   [junit4]   2> 3345597 T12264 C2250 oasup.LogUpdateProcessor.finish [collection1] webapp=null path=null params={} {deleteByQuery=*:*} 0 8
   [junit4]   2> 3345600 T12264 C2250 oasup.LogUpdateProcessor.finish [collection1] webapp=null path=null params={} {add=[(null)]} 0 2
   [junit4]   2> 3345601 T12264 C2250 oasu.DirectUpdateHandler2.commit start commit{,optimize=false,openSearcher=true,waitSearcher=true,expungeDeletes=false,softCommit=false,prepareCommit=false}
   [junit4]   2> 3345619 T12264 C2250 oasc.SolrDeletionPolicy.onCommit SolrDeletionPolicy.onCommit: commits: num=2
   [junit4]   2> 		commit{dir=/Users/jenkins/workspace/Lucene-Solr-trunk-MacOSX/solr/build/solr-core/test/J0/solr.core.TestNonNRTOpen-AEEA33790E83F9B6-001/init-core-data-001/index,segFN=segments_2,generation=2}
   [junit4]   2> 		commit{dir=/Users/jenkins/workspace/Lucene-Solr-trunk-MacOSX/solr/build/solr-core/test/J0/solr.core.TestNonNRTOpen-AEEA33790E83F9B6-001/init-core-data-001/index,segFN=segments_3,generation=3}
   [junit4]   2> 3345619 T12264 C2250 oasc.SolrDeletionPolicy.updateCommits newest commit generation = 3
   [junit4]   2> 3345633 T12264 C2250 oass.SolrIndexSearcher.<init> Opening Searcher@45f7a4dc[collection1] main
   [junit4]   2> 3345634 T12269 oasc.SolrCore.registerSearcher [collection1] Registered new searcher Searcher@45f7a4dc[collection1] main{StandardDirectoryReader(segments_3:6 _1(5.0):C1)}
   [junit4]   2> 3345634 T12264 C2250 oasu.DirectUpdateHandler2.commit end_commit_flush
   [junit4]   2> 3345636 T12264 C2250 oasup.LogUpdateProcessor.finish [collection1] webapp=null path=null params={} {commit=} 0 35
   [junit4]   2> 3345637 T12264 C2250 oasu.DirectUpdateHandler2.commit start commit{,optimize=true,openSearcher=true,waitSearcher=true,expungeDeletes=false,softCommit=false,prepareCommit=false}
   [junit4]   2> 3345638 T12264 C2250 oasu.DirectUpdateHandler2.commit No uncommitted changes. Skipping IW.commit.
   [junit4]   2> 3345640 T12264 C2250 oasc.SolrCore.openNewSearcher SolrIndexSearcher has not changed - not re-opening: org.apache.solr.search.SolrIndexSearcher
   [junit4]   2> 3345640 T12264 C2250 oasu.DirectUpdateHandler2.commit end_commit_flush
   [junit4]   2> 3345641 T12264 C2250 oasup.LogUpdateProcessor.finish [collection1] webapp=null path=null params={} {optimize=} 0 4
   [junit4]   2> 3345644 T12264 C2250 oasup.LogUpdateProcessor.finish [collection1] webapp=null path=null params={} {add=[(null)]} 0 2
   [junit4]   2> 3345645 T12264 C2250 oasu.DirectUpdateHandler2.commit start commit{,optimize=false,openSearcher=true,waitSearcher=true,expungeDeletes=false,softCommit=false,prepareCommit=false}
   [junit4]   2> 3345667 T12264 C2250 oasc.SolrDeletionPolicy.onCommit SolrDeletionPolicy.onCommit: commits: num=2
   [junit4]   2> 		commit{dir=/Users/jenkins/workspace/Lucene-Solr-trunk-MacOSX/solr/build/solr-core/test/J0/solr.core.TestNonNRTOpen-AEEA33790E83F9B6-001/init-core-data-001/index,segFN=segments_3,generation=3}
   [junit4]   2> 		commit{dir=/Users/jenkins/workspace/Lucene-Solr-trunk-MacOSX/solr/build/solr-core/test/J0/solr.core.TestNonNRTOpen-AEEA33790E83F9B6-001/init-core-data-001/index,segFN=segments_4,generation=4}
   [junit4]   2> 3345667 T12264 C2250 oasc.SolrDeletionPolicy.updateCommits newest commit generation = 4
   [junit4]   2> 3345682 T12264 C2250 oass.SolrIndexSearcher.<init> Opening Searcher@462d2dbe[collection1] main
   [junit4]   2> 3345682 T12269 oasc.SolrCore.registerSearcher [collection1] Registered new searcher Searcher@462d2dbe[collection1] main{StandardDirectoryReader(segments_4:8 _1(5.0):C1 _2(5.0):C1)}
   [junit4]   2> 3345683 T12264 C2250 oasu.DirectUpdateHandler2.commit end_commit_flush
   [junit4]   2> 3345683 T12264 C2250 oasup.LogUpdateProcessor.finish [collection1] webapp=null path=null params={} {commit=} 0 38
   [junit4]   2> 3345686 T12264 C2250 oasup.LogUpdateProcessor.finish [collection1] webapp=null path=null params={} {add=[(null)]} 0 2
   [junit4]   2> 3345688 T12264 C2250 oasup.LogUpdateProcessor.finish [collection1] webapp=null path=null params={} {add=[(null)]} 0 1
   [junit4]   2> 3345688 T12264 C2250 oasu.DirectUpdateHandler2.commit start commit{,optimize=false,openSearcher=true,waitSearcher=true,expungeDeletes=false,softCommit=false,prepareCommit=false}
   [junit4]   2> 3345718 T12264 C2250 oasc.SolrDeletionPolicy.onCommit SolrDeletionPolicy.onCommit: commits: num=2
   [junit4]   2> 		commit{dir=/Users/jenkins/workspace/Lucene-Solr-trunk-MacOSX/solr/build/solr-core/test/J0/solr.core.TestNonNRTOpen-AEEA33790E83F9B6-001/init-core-data-001/index,segFN=segments_4,generation=4}
   [junit4]   2> 		commit{dir=/Users/jenkins/workspace/Lucene-Solr-trunk-MacOSX/solr/build/solr-core/test/J0/solr.core.TestNonNRTOpen-AEEA33790E83F9B6-001/init-core-data-001/index,segFN=segments_5,generation=5}
   [junit4]   2> 3345719 T12264 C2250 oasc.SolrDeletionPolicy.updateCommits newest commit generation = 5
   [junit4]   2> 3345743 T12264 C2250 oass.SolrIndexSearcher.<init> Opening Searcher@54e0fd0[collection1] main
   [junit4]   2> 3345743 T12264 C2250 oasu.DirectUpdateHandler2.commit end_commit_flush
   [junit4]   2> 3345745 T12269 oasc.SolrCore.registerSearcher [collection1] Registered new searcher Searcher@54e0fd0[collection1] main{StandardDirectoryReader(segments_5:10 _1(5.0):C1 _2(5.0):C1 _3(5.0):C2)}
   [junit4]   2> 3345746 T12264 C2250 oasup.LogUpdateProcessor.finish [collection1] webapp=null path=null params={} {commit=} 0 58
   [junit4]   2> 3345746 T12264 C2250 oasup.LogUpdateProcessor.finish [collection1] webapp=null path=null params={} {deleteByQuery=foo2:doc} 0 0
   [junit4]   2> 3345747 T12264 C2250 oasu.DirectUpdateHandler2.commit start commit{,optimize=false,openSearcher=true,waitSearcher=true,expungeDeletes=false,softCommit=false,prepareCommit=false}
   [junit4]   2> 3345763 T12264 C2250 oasc.SolrDeletionPolicy.onCommit SolrDeletionPolicy.onCommit: commits: num=2
   [junit4]   2> 		commit{dir=/Users/jenkins/workspace/Lucene-Solr-trunk-MacOSX/solr/build/solr-core/test/J0/solr.core.TestNonNRTOpen-AEEA33790E83F9B6-001/init-core-data-001/index,segFN=segments_5,generation=5}
   [junit4]   2> 		commit{dir=/Users/jenkins/workspace/Lucene-Solr-trunk-MacOSX/solr/build/solr-core/test/J0/solr.core.TestNonNRTOpen-AEEA33790E83F9B6-001/init-core-data-001/index,segFN=segments_6,generation=6}
   [junit4]   2> 3345763 T12264 C2250 oasc.SolrDeletionPolicy.updateCommits newest commit generation = 6
   [junit4]   2> 3345779 T12264 C2250 oass.SolrIndexSearcher.<init> Opening Searcher@2101a710[collection1] main
   [junit4]   2> 3345780 T12269 oasc.SolrCore.registerSearcher [collection1] Registered new searcher Searcher@2101a710[collection1] main{StandardDirectoryReader(segments_6:11 _1(5.0):C1 _2(5.0):C1 _3(5.0):C2/1:delGen=1)}
   [junit4]   2> 3345780 T12264 C2250 oasu.DirectUpdateHandler2.commit end_commit_flush
   [junit4]   2> 3345781 T12264 C2250 oasup.LogUpdateProcessor.finish [collection1] webapp=null path=null params={} {commit=} 0 34
   [junit4]   2> 3345781 T12264 oas.SolrTestCaseJ4.tearDown ###Ending testSharedCores
   [junit4]   2> 3345788 T12264 oas.SolrTestCaseJ4.setUp ###Starting testReaderIsNotNRT
   [junit4]   2> 3345788 T12264 C2250 oasu.DirectUpdateHandler2.deleteAll [collection1] REMOVING ALL DOCUMENTS FROM INDEX
   [junit4]   2> 3345790 T12264 C2250 oasup.LogUpdateProcessor.finish [collection1] webapp=null path=null params={} {deleteByQuery=*:*} 0 2
   [junit4]   2> 3345792 T12264 C2250 oasup.LogUpdateProcessor.finish [collection1] webapp=null path=null params={} {add=[(null)]} 0 1
   [junit4]   2> 3345793 T12264 C2250 oasu.DirectUpdateHandler2.commit start commit{,optimize=false,openSearcher=true,waitSearcher=true,expungeDeletes=false,softCommit=false,prepareCommit=false}
   [junit4]   2> 3345810 T12264 C2250 oasc.SolrDeletionPolicy.onCommit SolrDeletionPolicy.onCommit: commits: num=2
   [junit4]   2> 		commit{dir=/Users/jenkins/workspace/Lucene-Solr-trunk-MacOSX/solr/build/solr-core/test/J0/solr.core.TestNonNRTOpen-AEEA33790E83F9B6-001/init-core-data-001/index,segFN=segments_6,generation=6}
   [junit4]   2> 		commit{dir=/Users/jenkins/workspace/Lucene-Solr-trunk-MacOSX/solr/build/solr-core/test/J0/solr.core.TestNonNRTOpen-AEEA33790E83F9B6-001/init-core-data-001/index,segFN=segments_7,generation=7}
   [junit4]   2> 3345811 T12264 C2250 oasc.SolrDeletionPolicy.updateCommits newest commit generation = 7
   [junit4]   2> 3345837 T12264 C2250 oass.SolrIndexSearcher.<init> Opening Searcher@7c39326[collection1] main
   [junit4]   2> 3345837 T12264 C2250 oasu.DirectUpdateHandler2.commit end_commit_flush
   [junit4]   2> 3345837 T12269 oasc.SolrCore.registerSearcher [collection1] Registered new searcher Searcher@7c39326[collection1] main{StandardDirectoryReader(segments_7:14 _4(5.0):C1)}
   [junit4]   2> 3345841 T12264 C2250 oasup.LogUpdateProcessor.finish [collection1] webapp=null path=null params={} {commit=} 0 48
   [junit4]   2> 3345842 T12264 oasc.TestNonNRTOpen.assertNotNRT Checking notNRT & maxDoc=1 of core=org.apache.solr.core.SolrCore@5f1ed6d6
   [junit4]   2> 3345842 T12264 oasc.TestNonNRTOpen.testReaderIsNotNRT Reloading core: org.apache.solr.core.SolrCore@5f1ed6d6
   [junit4]   2> 3345843 T12264 oasc.SolrResourceLoader.<init> new SolrResourceLoader for directory: '/Users/jenkins/workspace/Lucene-Solr-trunk-MacOSX/solr/core/src/test-files/solr/collection1/'
   [junit4]   2> 3345844 T12264 oasc.SolrResourceLoader.replaceClassLoader Adding 'file:/Users/jenkins/workspace/Lucene-Solr-trunk-MacOSX/solr/core/src/test-files/solr/collection1/lib/.svn/' to classloader
   [junit4]   2> 3345844 T12264 oasc.SolrResourceLoader.replaceClassLoader Adding 'file:/Users/jenkins/workspace/Lucene-Solr-trunk-MacOSX/solr/core/src/test-files/solr/collection1/lib/classes/' to classloader
   [junit4]   2> 3345845 T12264 oasc.SolrResourceLoader.replaceClassLoader Adding 'file:/Users/jenkins/workspace/Lucene-Solr-trunk-MacOSX/solr/core/src/test-files/solr/collection1/lib/README' to classloader
   [junit4]   2> 3345919 T12264 oasc.SolrConfig.<init> Using Lucene MatchVersion: LUCENE_50
   [junit4]   2> 3345927 T12264 oasc.SolrConfig.<init> Loaded SolrConfig: solrconfig-basic.xml
   [junit4]   2> 3345928 T12264 oass.IndexSchema.readSchema Reading Solr Schema from schema-minimal.xml
   [junit4]   2> 3345931 T12264 oass.IndexSchema.readSchema [collection1] Schema name=minimal
   [junit4]   2> 3345939 T12264 oass.IndexSchema.readSchema WARN no uniqueKey specified in schema.
   [junit4]   2> 3345940 T12264 oasc.CoreContainer.reload Reloading SolrCore 'collection1' using configuration from instancedir /Users/jenkins/workspace/Lucene-Solr-trunk-MacOSX/solr/core/src/test-files/solr/collection1/
   [junit4]   2> 3345941 T12264 oasc.SolrCore.<init> [collection1] Opening new SolrCore at /Users/jenkins/workspace/Lucene-Solr-trunk-MacOSX/solr/core/src/test-files/solr/collection1/, dataDir=/Users/jenkins/workspace/Lucene-Solr-trunk-MacOSX/solr/build/solr-core/test/J0/./solr.core.TestNonNRTOpen-AEEA33790E83F9B6-001/init-core-data-001/
   [junit4]   2> 3345941 T12264 oasc.SolrCore.<init> JMX monitoring not detected for core: collection1
   [junit4]   2> 3345942 T12264 oasc.SolrCore.getNewIndexDir New index directory detected: old=null new=/Users/jenkins/workspace/Lucene-Solr-trunk-MacOSX/solr/build/solr-core/test/J0/./solr.core.TestNonNRTOpen-AEEA33790E83F9B6-001/init-core-data-001/index/
   [junit4]   2> 3345945 T12264 oasc.SolrCore.loadUpdateProcessorChains no updateRequestProcessorChain defined as default, creating implicit default
   [junit4]   2> 3345947 T12264 oasc.RequestHandlers.initHandlersFromConfig created standard: solr.StandardRequestHandler
   [junit4]   2> 3345948 T12264 oasc.RequestHandlers.initHandlersFromConfig created /update: solr.UpdateRequestHandler
   [junit4]   2> 3345956 T12264 oashl.XMLLoader.init xsltCacheLifetimeSeconds=60
   [junit4]   2> 3345957 T12264 oasu.CommitTracker.<init> Hard AutoCommit: disabled
   [junit4]   2> 3345957 T12264 oasu.CommitTracker.<init> Soft AutoCommit: disabled
   [junit4]   2> 3345961 T12264 oass.SolrIndexSearcher.<init> Opening Searcher@6760d53e[collection1] main
   [junit4]   2> 3345962 T12264 oasr.ManagedResourceStorage$FileStorageIO.configure File-based storage initialized to use dir: /Users/jenkins/workspace/Lucene-Solr-trunk-MacOSX/solr/core/src/test-files/solr/collection1/conf
   [junit4]   2> 3345962 T12264 oasr.RestManager.init Initializing RestManager with initArgs: {storageDir=/Users/jenkins/workspace/Lucene-Solr-trunk-MacOSX/solr/core/src/test-files/solr/collection1/conf/}
   [junit4]   2> 3345963 T12264 oasr.ManagedResourceStorage.load Reading _rest_managed.json using file:dir=/Users/jenkins/workspace/Lucene-Solr-trunk-MacOSX/solr/core/src/test-files/solr/collection1/conf
   [junit4]   2> 3345963 T12264 oasr.ManagedResource.reloadFromStorage WARN No stored data found for /rest/managed
   [junit4]   2> 3345964 T12264 oasr.ManagedResource.notifyObserversDuringInit WARN No registered observers for /rest/managed
   [junit4]   2> 3345964 T12264 oasr.RestManager.init Initializing 0 registered ManagedResources
   [junit4]   2> 3345965 T12271 oasc.SolrCore.registerSearcher [collection1] Registered new searcher Searcher@6760d53e[collection1] main{StandardDirectoryReader(segments_7:14 _4(5.0):C1)}
   [junit4]   2> 3345966 T12264 oasu.DefaultSolrCoreState.newIndexWriter Creating new IndexWriter...
   [junit4]   2> 3345966 T12264 oasu.DefaultSolrCoreState.newIndexWriter Waiting until IndexWriter is unused... core=collection1
   [junit4]   2> 3345966 T12264 oasu.DefaultSolrCoreState.newIndexWriter Closing old IndexWriter... core=collection1
   [junit4]   2> 3345973 T12264 oasc.SolrDeletionPolicy.onInit SolrDeletionPolicy.onInit: commits: num=1
   [junit4]   2> 		commit{dir=/Users/jenkins/workspace/Lucene-Solr-trunk-MacOSX/solr/build/solr-core/test/J0/solr.core.TestNonNRTOpen-AEEA33790E83F9B6-001/init-core-data-001/index,segFN=segments_7,generation=7}
   [junit4]   2> 3345974 T12264 oasc.SolrDeletionPolicy.updateCommits newest commit generation = 7
   [junit4]   2> 3345974 T12264 oasu.DefaultSolrCoreState.newIndexWriter New IndexWriter is ready to be used.
   [junit4]   2> 3345976 T12264 oasc.SolrCore.openNewSearcher SolrIndexSearcher has not changed - not re-opening: org.apache.solr.search.SolrIndexSearcher
   [junit4]   2> 3345976 T12264 oasc.CoreContainer.registerCore replacing core: collection1
   [junit4]   2> 3345977 T12264 oasc.SolrCore.close [collection1]  CLOSING SolrCore org.apache.solr.core.SolrCore@5f1ed6d6
   [junit4]   2> 3345977 T12264 oasu.DirectUpdateHandler2.close closing DirectUpdateHandler2{commits=5,autocommits=0,soft autocommits=0,optimizes=1,rollbacks=0,expungeDeletes=0,docsPending=0,adds=0,deletesById=0,deletesByQuery=0,errors=0,cumulative_adds=5,cumulative_deletesById=0,cumulative_deletesByQuery=3,cumulative_errors=0}
   [junit4]   2> 3345978 T12264 oasc.SolrCore.closeSearcher [collection1] Closing main searcher on request.
   [junit4]   2> 3345978 T12264 oasc.TestNonNRTOpen.assertNotNRT Checking notNRT & maxDoc=1 of core=org.apache.solr.core.SolrCore@6acf0c17
   [junit4]   2> ASYNC  NEW_CORE C2251 name=collection1 org.apache.solr.core.SolrCore@6acf0c17
   [junit4]   2> 3345981 T12264 C2251 oasup.LogUpdateProcessor.finish [collection1] webapp=null path=null params={} {add=[(null)]} 0 1
   [junit4]   2> 3345982 T12264 C2251 oasu.DirectUpdateHandler2.commit start commit{,optimize=false,openSearcher=true,waitSearcher=true,expungeDeletes=false,softCommit=false,prepareCommit=false}
   [junit4]   2> 3346004 T12264 C2251 oasc.SolrDeletionPolicy.onCommit SolrDeletionPolicy.onCommit: commits: num=2
   [junit4]   2> 		commit{dir=/Users/jenkins/workspace/Lucene-Solr-trunk-MacOSX/solr/build/solr-core/test/J0/solr.core.TestNonNRTOpen-AEEA33790E83F9B6-001/init-core-data-001/index,segFN=segments_7,generation=7}
   [junit4]   2> 		commit{dir=/Users/jenkins/workspace/Lucene-Solr-trunk-MacOSX/solr/build/solr-core/test/J0/solr.core.TestNonNRTOpen-AEEA33790E83F9B6-001/init-core-data-001/index,segFN=segments_8,generation=8}
   [junit4]   2> 3346004 T12264 C2251 oasc.SolrDeletionPolicy.updateCommits newest commit generation = 8
   [junit4]   2> 3346018 T12264 C2251 oass.SolrIndexSearcher.<init> Opening Searcher@45590438[collection1] main
   [junit4]   2> 3346019 T12271 oasc.SolrCore.registerSearcher [collection1] Registered new searcher Searcher@45590438[collection1] main{StandardDirectoryReader(segments_8:16 _4(5.0):C1 _5(5.0):C1)}
   [junit4]   2> 3346019 T12264 C2251 oasu.DirectUpdateHandler2.commit end_commit_flush
   [junit4]   2> 3346019 T12264 C2251 oasup.LogUpdateProcessor.finish [collection1] webapp=null path=null params={} {commit=} 0 37
   [junit4]   2> 3346020 T12264 oasc.TestNonNRTOpen.assertNotNRT Checking notNRT & maxDoc=2 of core=org.apache.solr.core.SolrCore@6acf0c17
   [junit4]   2> 3346023 T12264 C2251 oasup.LogUpdateProcessor.finish [collection1] webapp=null path=null params={} {add=[(null)]} 0 2
   [junit4]   2> 3346023 T12264 oasc.TestNonNRTOpen.testReaderIsNotNRT Reloading core: org.apache.solr.core.SolrCore@6acf0c17
   [junit4]   2> 3346024 T12264 oasc.SolrResourceLoader.<init> new SolrResourceLoader for directory: '/Users/jenkins/workspace/Lucene-Solr-trunk-MacOSX/solr/core/src/test-files/solr/collection1/'
   [junit4]   2> 3346025 T12264 oasc.SolrResourceLoader.replaceClassLoader Adding 'file:/Users/jenkins/workspace/Lucene-Solr-trunk-MacOSX/solr/core/src/test-files/solr/collection1/lib/.svn/' to classloader
   [junit4]   2> 3346026 T12264 oasc.SolrResourceLoader.replaceClassLoader Adding 'file:/Users/jenkins/workspace/Lucene-Solr-trunk-MacOSX/solr/core/src/test-files/solr/collection1/lib/classes/' to classloader
   [junit4]   2> 3346027 T12264 oasc.SolrResourceLoader.replaceClassLoader Adding 'file:/Users/jenkins/workspace/Lucene-Solr-trunk-MacOSX/solr/core/src/test-files/solr/collection1/lib/README' to classloader
   [junit4]   2> 3346096 T12264 oasc.SolrConfig.<init> Using Lucene MatchVersion: LUCENE_50
   [junit4]   2> 3346104 T12264 oasc.SolrConfig.<init> Loaded SolrConfig: solrconfig-basic.xml
   [junit4]   2> 3346108 T12264 oass.IndexSchema.readSchema Reading Solr Schema from schema-minimal.xml
   [junit4]   2> 3346112 T12264 oass.IndexSchema.readSchema [collection1] Schema name=minimal
   [junit4]   2> 3346118 T12264 oass.IndexSchema.readSchema WARN no uniqueKey specified in schema.
   [junit4]   2> 3346120 T12264 oasc.CoreContainer.reload Reloading SolrCore 'collection1' using configuration from instancedir /Users/jenkins/workspace/Lucene-Solr-trunk-MacOSX/solr/core/src/test-files/solr/collection1/
   [junit4]   2> 3346120 T12264 oasc.SolrCore.<init> [collection1] Opening new SolrCore at /Users/jenkins/workspace/Lucene-Solr-trunk-MacOSX/solr/core/src/test-files/solr/collection1/, dataDir=/Users/jenkins/workspace/Lucene-Solr-trunk-MacOSX/solr/build/solr-core/test/J0/./solr.core.TestNonNRTOpen-AEEA33790E83F9B6-001/init-core-data-001/
   [junit4]   2> 3346121 T12264 oasc.SolrCore.<init> JMX monitoring not detected for core: collection1
   [junit4]   2> 3346122 T12264 oasc.SolrCore.getNewIndexDir New index directory detected: old=null new=/Users/jenkins/workspace/Lucene-Solr-trunk-MacOSX/solr/build/solr-core/test/J0/./solr.core.TestNonNRTOpen-AEEA33790E83F9B6-001/init-core-data-001/index/
   [junit4]   2> 3346124 T12264 oasc.SolrCore.loadUpdateProcessorChains no updateRequestProcessorChain defined as default, creating implicit default
   [junit4]   2> 3346125 T12264 oasc.RequestHandlers.initHandlersFromConfig created standard: solr.StandardRequestHandler
   [junit4]   2> 3346126 T12264 oasc.RequestHandlers.initHandlersFromConfig created /update: solr.UpdateRequestHandler
   [junit4]   2> 3346134 T12264 oashl.XMLLoader.init xsltCacheLifetimeSeconds=60
   [junit4]   2> 3346135 T12264 oasu.CommitTracker.<init> Hard AutoCommit: disabled
   [junit4]   2> 3346135 T12264 oasu.CommitTracker.<init> Soft AutoCommit: disabled
   [junit4]   2> 3346142 T12264 oass.SolrIndexSearcher.<init> Opening Searcher@57f47266[collection1] main
   [junit4]   2> 3346142 T12264 oasr.ManagedResourceStorage$FileStorageIO.configure File-based storage initialized to use dir: /Users/jenkins/workspace/Lucene-Solr-trunk-MacOSX/solr/core/src/test-files/solr/collection1/conf
   [junit4]   2> 3346143 T12264 oasr.RestManager.init Initializing RestManager with initArgs: {storageDir=/Users/jenkins/workspace/Lucene-Solr-trunk-MacOSX/solr/core/src/test-files/solr/collection1/conf/}
   [junit4]   2> 3346143 T12264 oasr.ManagedResourceStorage.load Reading _rest_managed.json using file:dir=/Users/jenkins/workspace/Lucene-Solr-trunk-MacOSX/solr/core/src/test-files/solr/collection1/conf
   [junit4]   2> 3346145 T12264 oasr.ManagedResource.reloadFromStorage WARN No stored data found for /rest/managed
   [junit4]   2> 3346145 T12264 oasr.ManagedResource.notifyObserversDuringInit WARN No registered observers for /rest/managed
   [junit4]   2> 3346145 T12264 oasr.RestManager.init Initializing 0 registered ManagedResources
   [junit4]   2> 3346146 T12272 oasc.SolrCore.registerSearcher [collection1] Registered new searcher Searcher@57f47266[collection1] main{StandardDirectoryReader(segments_8:16 _4(5.0):C1 _5(5.0):C1)}
   [junit4]   2> 3346146 T12264 oasu.DefaultSolrCoreState.newIndexWriter Creating new IndexWriter...
   [junit4]   2> 3346146 T12264 oasu.DefaultSolrCoreState.newIndexWriter Waiting until IndexWriter is unused... core=collection1
   [junit4]   2> 3346147 T12264 oasu.DefaultSolrCoreState.newIndexWriter Closing old IndexWriter... core=collection1
   [junit4]   2> 3346164 T12264 oasc.SolrDeletionPolicy.onCommit SolrDeletionPolicy.onCommit: commits: num=2
   [junit4]   2> 		commit{dir=/Users/jenkins/workspace/Lucene-Solr-trunk-MacOSX/solr/build/solr-core/test/J0/solr.core.TestNonNRTOpen-AEEA33790E83F9B6-001/init-core-data-001/index,segFN=segments_8,generation=8}
   [junit4]   2> 		commit{dir=/Users/jenkins/workspace/Lucene-Solr-trunk-MacOSX/solr/build/solr-core/test/J0/solr.core.TestNonNRTOpen-AEEA33790E83F9B6-001/init-core-data-001/index,segFN=segments_9,generation=9}
   [junit4]   2> 3346165 T12264 oasc.SolrDeletionPolicy.updateCommits newest commit generation = 9
   [junit4]   2> 3346185 T12264 oasc.SolrDeletionPolicy.onInit SolrDeletionPolicy.onInit: commits: num=1
   [junit4]   2> 		commit{dir=/Users/jenkins/workspace/Lucene-Solr-trunk-MacOSX/solr/build/solr-core/test/J0/solr.core.TestNonNRTOpen-AEEA33790E83F9B6-001/init-core-data-001/index,segFN=segments_9,generation=9}
   [junit4]   2> 3346185 T12264 oasc.SolrDeletionPolicy.updateCommits newest commit generation = 9
   [junit4]   2> 3346186 T12264 oasu.DefaultSolrCoreState.newIndexWriter New IndexWriter is ready to be used.
   [junit4]   2> 3346194 T12264 oass.SolrIndexSearcher.<init> Opening Searcher@3d99fa39[collection1] main
   [junit4]   2> 3346197 T12264 oasc.CoreContainer.registerCore replacing core: collection1
   [junit4]   2> 3346197 T12264 oasc.SolrCore.close [collection1]  CLOSING SolrCore org.apache.solr.core.SolrCore@6acf0c17
   [junit4]   2> 3346197 T12264 oasu.DirectUpdateHandler2.close closing DirectUpdateHandler2{commits=1,autocommits=0,soft autocommits=0,optimizes=0,rollbacks=0,expungeDeletes=0,docsPending=1,adds=1,deletesById=0,deletesByQuery=0,errors=0,cumulative_adds=2,cumulative_deletesById=0,cumulative_deletesByQuery=0,cumulative_errors=0}
   [junit4]   2> 3346198 T12264 oasc.SolrCore.closeSearcher [collection1] Closing main searcher on request.
   [junit4]   2> 3346198 T12264 oasc.TestNonNRTOpen.assertNotNRT Checking notNRT & maxDoc=3 of core=org.apache.solr.core.SolrCore@466bd027
   [junit4]   2> 3346199 T12264 oas.SolrTestCaseJ4.tearDown ###Ending testReaderIsNotNRT
   [junit4]   2> 3346204 T12272 oasc.SolrCore.registerSearcher [collection1] Registered new searcher Searcher@3d99fa39[collection1] main{StandardDirectoryReader(segments_9:18 _4(5.0):C1 _5(5.0):C1 _6(5.0):C1)}
   [junit4]   2> NOTE: reproduce with: ant test  -Dtestcase=TestNonNRTOpen -Dtests.method=testReaderIsNotNRT -Dtests.seed=AEEA33790E83F9B6 -Dtests.slow=true -Dtests.locale=en -Dtests.timezone=Africa/Lome -Dtests.file.encoding=UTF-8
   [junit4] FAILURE 0.43s | TestNonNRTOpen.testReaderIsNotNRT <<<
   [junit4]    > Throwable #1: java.lang.AssertionError: SOLR-5815? : wrong maxDoc: core=org.apache.solr.core.SolrCore@466bd027 searcher=Searcher@57f47266[collection1] main{StandardDirectoryReader(segments_8:16 _4(5.0):C1 _5(5.0):C1)} expected:<3> but was:<2>
   [junit4]    > 	at __randomizedtesting.SeedInfo.seed([AEEA33790E83F9B6:1B6C52FEB1424B42]:0)
   [junit4]    > 	at org.apache.solr.core.TestNonNRTOpen.assertNotNRT(TestNonNRTOpen.java:142)
   [junit4]    > 	at org.apache.solr.core.TestNonNRTOpen.testReaderIsNotNRT(TestNonNRTOpen.java:100)
   [junit4]    > 	at java.lang.Thread.run(Thread.java:744)
   [junit4]   2> 3346218 T12264 oas.SolrTestCaseJ4.deleteCore ###deleteCore
   [junit4]   2> 3346218 T12264 oasc.CoreContainer.shutdown Shutting down CoreContainer instance=907117865
   [junit4]   2> 3346219 T12264 oasc.SolrCore.close [collection1]  CLOSING SolrCore org.apache.solr.core.SolrCore@466bd027
   [junit4]   2> 3346219 T12264 oasu.DirectUpdateHandler2.close closing DirectUpdateHandler2{commits=0,autocommits=0,soft autocommits=0,optimizes=0,rollbacks=0,expungeDeletes=0,docsPending=0,adds=0,deletesById=0,deletesByQuery=0,errors=0,cumulative_adds=0,cumulative_deletesById=0,cumulative_deletesByQuery=0,cumulative_errors=0}
   [junit4]   2> 3346219 T12264 oasu.SolrCoreState.decrefSolrCoreState Closing SolrCoreState
   [junit4]   2> 3346220 T12264 oasu.DefaultSolrCoreState.closeIndexWriter SolrCoreState ref count has reached 0 - closing IndexWriter
   [junit4]   2> 3346220 T12264 oasu.DefaultSolrCoreState.closeIndexWriter closing IndexWriter with IndexWriterCloser
   [junit4]   2> 3346231 T12264 oasc.SolrCore.closeSearcher [collection1] Closing main searcher on request.
   [junit4]   2> 3346232 T12264 oasc.CachingDirectoryFactory.close Closing StandardDirectoryFactory - 2 directories currently being tracked
   [junit4]   2> 3346233 T12264 oasc.CachingDirectoryFactory.closeCacheValue looking to close /Users/jenkins/workspace/Lucene-Solr-trunk-MacOSX/solr/build/solr-core/test/J0/solr.core.TestNonNRTOpen-AEEA33790E83F9B6-001/init-core-data-001/index [CachedDir<<refCount=0;path=/Users/jenkins/workspace/Lucene-Solr-trunk-MacOSX/solr/build/solr-core/test/J0/solr.core.TestNonNRTOpen-AEEA33790E83F9B6-001/init-core-data-001/index;done=false>>]
   [junit4]   2> 3346234 T12264 oasc.CachingDirectoryFactory.close Closing directory: /Users/jenkins/workspace/Lucene-Solr-trunk-MacOSX/solr/build/solr-core/test/J0/solr.core.TestNonNRTOpen-AEEA33790E83F9B6-001/init-core-data-001/index
   [junit4]   2> 3346234 T12264 oasc.CachingDirectoryFactory.closeCacheValue looking to close /Users/jenkins/workspace/Lucene-Solr-trunk-MacOSX/solr/build/solr-core/test/J0/solr.core.TestNonNRTOpen-AEEA33790E83F9B6-001/init-core-data-001 [CachedDir<<refCount=0;path=/Users/jenkins/workspace/Lucene-Solr-trunk-MacOSX/solr/build/solr-core/test/J0/solr.core.TestNonNRTOpen-AEEA33790E83F9B6-001/init-core-data-001;done=false>>]
   [junit4]   2> 3346235 T12264 oasc.CachingDirectoryFactory.close Closing directory: /Users/jenkins/workspace/Lucene-Solr-trunk-MacOSX/solr/build/solr-core/test/J0/solr.core.TestNonNRTOpen-AEEA33790E83F9B6-001/init-core-data-001
   [junit4]   2> NOTE: leaving temporary files on disk at: /Users/jenkins/workspace/Lucene-Solr-trunk-MacOSX/solr/build/solr-core/test/J0/./solr.core.TestNonNRTOpen-AEEA33790E83F9B6-001
   [junit4]   2> NOTE: test params are: codec=Lucene41, sim=RandomSimilarityProvider(queryNorm=true,coord=yes): {}, locale=en, timezone=Africa/Lome
   [junit4]   2> NOTE: Mac OS X 10.8.5 x86_64/Oracle Corporation 1.8.0 (64-bit)/cpus=2,threads=1,free=113270848,total=536870912
   [junit4]   2> NOTE: All tests run in this JVM: [TestRequestStatusCollectionAPI, ReturnFieldsTest, UnloadDistributedZkTest, HdfsCollectionsAPIDistributedZkTest, SimpleFacetsTest, RemoteQueryErrorTest, TestAnalyzedSuggestions, TestSolrDeletionPolicy1, TestSolr4Spatial, TestSolrQueryParser, ZkCLITest, TestPartialUpdateDeduplication, TestIndexingPerformance, CurrencyFieldOpenExchangeTest, TestSolrXmlPersistence, TestDocBasedVersionConstraints, UUIDFieldTest, DateMathParserTest, TestCopyFieldCollectionResource, DistribCursorPagingTest, CacheHeaderTest, TestSurroundQueryParser, QueryResultKeyTest, FullSolrCloudDistribCmdsTest, ShardRoutingCustomTest, TestSerializedLuceneMatchVersion, DirectSolrSpellCheckerTest, TestBinaryField, TermVectorComponentTest, TestRestManager, TestLRUCache, TestAddFieldRealTimeGet, TestWriterPerf, SoftAutoCommitTest, SuggestComponentTest, DistributedTermsComponentTest, TestClassNameShortening, FieldFacetTest, DistributedExpandComponentTest, UniqFieldsUpdateProcessorFactoryTest, SearchHandlerTest, InfoHandlerTest, TestCollectionAPI, SliceStateUpdateTest, TestMultiCoreConfBootstrap, TestQueryUtils, HdfsSyncSliceTest, TestSchemaVersionResource, LeaderElectionTest, TestInfoStreamLogging, TestHighFrequencyDictionaryFactory, TestSimpleQParserPlugin, TestFastLRUCache, ZkControllerTest, SpatialFilterTest, TestFieldTypeCollectionResource, TestFileDictionaryLookup, TestBadConfig, TestSolrJ, DocValuesTest, SyncSliceTest, CursorMarkTest, CoreMergeIndexesAdminHandlerTest, TestDistributedSearch, MinimalSchemaTest, TestLFUCache, TestDynamicFieldCollectionResource, TestSolrXMLSerializer, ModifyConfFileTest, PathHierarchyTokenizerFactoryTest, PreAnalyzedUpdateProcessorTest, CurrencyFieldXmlFileTest, CopyFieldTest, RequiredFieldsTest, TestShardHandlerFactory, TestPseudoReturnFields, UpdateRequestProcessorFactoryTest, TestPhraseSuggestions, DefaultValueUpdateProcessorTest, AlternateDirectoryTest, ConvertedLegacyTest, TestSolrXmlPersistor, SpellCheckCollatorTest, DirectUpdateHandlerTest, TestSort, TestTrie, TestSolrQueryParserDefaultOperatorResource, LoggingHandlerTest, TestStressVersions, TestManagedSchema, TestSystemIdResolver, SolrRequestParserTest, DocValuesMissingTest, TestComponentsName, TestQuerySenderNoQuery, TestLMJelinekMercerSimilarityFactory, TestPHPSerializedResponseWriter, SuggesterTSTTest, RecoveryZkTest, TestSolrIndexConfig, TestNRTOpen, ScriptEngineTest, NoFacetTest, SSLMigrationTest, ChaosMonkeyNothingIsSafeTest, TestIndexSearcher, EnumFieldTest, TestManagedResourceStorage, HardAutoCommitTest, SolrIndexConfigTest, TestUniqueKeyFieldResource, TestFastOutputStream, TestDistributedMissingSort, XmlUpdateRequestHandlerTest, HdfsChaosMonkeySafeLeaderTest, TestRandomMergePolicy, TestFoldingMultitermQuery, TestSchemaResource, DocumentAnalysisRequestHandlerTest, SchemaVersionSpecificBehaviorTest, DeleteShardTest, RegexBoostProcessorTest, TestExceedMaxTermLength, PreAnalyzedFieldTest, LeaderElectionIntegrationTest, OpenCloseCoreStressTest, TestCSVLoader, TestUtils, QueryParsingTest, PrimUtilsTest, AssignTest, ClusterStateTest, SolrCoreTest, HighlighterConfigTest, SystemInfoHandlerTest, TestHighlightDedupGrouping, CSVRequestHandlerTest, TestCSVResponseWriter, CollectionsAPIDistributedZkTest, TestConfig, TestFieldSortValues, TestCloudManagedSchema, TestLuceneMatchVersion, PolyFieldTest, TestFreeTextSuggestions, TestImplicitCoreProperties, TestQuerySenderListener, DebugComponentTest, ResourceLoaderTest, TestCollationFieldDocValues, TestValueSourceCache, TestCoreContainer, ClusterStateUpdateTest, TestUpdate, BlockDirectoryTest, TestArbitraryIndexDir, ParsingFieldUpdateProcessorsTest, TestAtomicUpdateErrorCases, TestManagedSynonymFilterFactory, TestHashPartitioner, FastVectorHighlighterTest, SuggesterWFSTTest, DirectSolrConnectionTest, FieldMutatingUpdateProcessorTest, PluginInfoTest, TestCollapseQParserPlugin, SolrIndexSplitterTest, DistributedQueryComponentCustomSortTest, CoreAdminRequestStatusTest, FieldAnalysisRequestHandlerTest, TestCollationField, TestNonDefinedSimilarityFactory, WordBreakSolrSpellCheckerTest, AddSchemaFieldsUpdateProcessorFactoryTest, HdfsUnloadDistributedZkTest, TestRangeQuery, SolrInfoMBeanTest, NotRequiredUniqueKeyTest, TestSolrXml, SolrCoreCheckLockOnStartupTest, TestReplicationHandler, TestFunctionQuery, HdfsBasicDistributedZk2Test, BasicDistributedZk2Test, TestRTGBase, SignatureUpdateProcessorFactoryTest, TestWordDelimiterFilterFactory, XsltUpdateRequestHandlerTest, BlockCacheTest, ZkSolrClientTest, ConnectionManagerTest, TimeZoneUtilsTest, TestExpandComponent, TestCloudManagedSchemaAddField, BasicDistributedZkTest, ChaosMonkeySafeLeaderTest, OverseerTest, ShardRoutingTest, BasicZkTest, TestRandomFaceting, TestZkChroot, TestRandomDVFaceting, AutoCommitTest, TestDistributedGrouping, TestFaceting, TestRecovery, DistributedSpellCheckComponentTest, TermVectorComponentDistributedTest, TestRealTimeGet, TestStressReorder, TestJoin, TestReload, StatsComponentTest, SpellCheckComponentTest, TestGroupingSearch, SolrCmdDistributorTest, QueryElevationComponentTest, PeerSyncTest, BadIndexSchemaTest, TestFiltering, BasicFunctionalityTest, TestLazyCores, OverseerCollectionProcessorTest, HighlighterTest, ShowFileRequestHandlerTest, DistributedQueryElevationComponentTest, SimplePostToolTest, TestCoreDiscovery, AnalysisAfterCoreReloadTest, TestExtendedDismaxParser, SuggesterFSTTest, CoreAdminHandlerTest, SuggesterTest, TestStressLucene, NoCacheHeaderTest, QueryEqualityTest, DirectUpdateHandlerOptimizeTest, StatelessScriptUpdateProcessorFactoryTest, SortByFunctionTest, TestRemoteStreaming, DocValuesMultiTest, DistanceFunctionTest, IndexBasedSpellCheckerTest, LukeRequestHandlerTest, DisMaxRequestHandlerTest, StandardRequestHandlerTest, TestReversedWildcardFilterFactory, TestQueryTypes, PrimitiveFieldTypeTest, TestOmitPositions, FileBasedSpellCheckerTest, TermsComponentTest, RequestHandlersTest, DocumentBuilderTest, MoreLikeThisHandlerTest, IndexSchemaRuntimeFieldTest, SolrPluginUtilsTest, IndexSchemaTest, TestJmxIntegration, JSONWriterTest, MBeansHandlerTest, JsonLoaderTest, BinaryUpdateRequestHandlerTest, PingRequestHandlerTest, CoreContainerCoreInitFailuresTest, TestBinaryResponseWriter, SOLR749Test, UpdateParamsTest, ResponseLogComponentTest, BadComponentTest, TestStressRecovery, TestMergePolicyConfig, TestSolrDeletionPolicy2, MultiTermTest, SampleTest, TestDocSet, TestSearchPerf, NumericFieldsTest, TestElisionMultitermQuery, OutputWriterTest, TestFuzzyAnalyzedSuggestions, ExternalFileFieldSortTest, TestSolrCoreProperties, TestPostingsSolrHighlighter, SpellPossibilityIteratorTest, TestCharFilters, TestCodecSupport, SynonymTokenizerTest, TestXIncludeConfig, EchoParamsTest, TestSweetSpotSimilarityFactory, TestDFRSimilarityFactory, TestPerFieldSimilarity, TestLMDirichletSimilarityFactory, TestIBSimilarityFactory, TestBM25SimilarityFactory, TestDefaultSimilarityFactory, TestFastWriter, LegacyHTMLStripCharFilterTest, TestJmxMonitoredMap, OpenExchangeRatesOrgProviderTest, URLClassifyProcessorTest, TestSuggestSpellingConverter, DateFieldTest, SpellingQueryConverterTest, DOMUtilTest, RAMDirectoryFactoryTest, TestDocumentBuilder, ZkNodePropsTest, SliceStateTest, FileUtilsTest, CircularListTest, CursorPagingTest, SolrTestCaseJ4Test, TestCursorMarkWithoutUniqueKey, AbstractAnalyticsStatsTest, ExpressionTest, AbstractAnalyticsFacetTest, FieldFacetExtrasTest, QueryFacetTest, RangeFacetTest, FunctionTest, AliasIntegrationTest, AsyncMigrateRouteKeyTest, CollectionsAPIAsyncDistributedZkTest, CustomCollectionTest, DeleteInactiveReplicaTest, DeleteReplicaTest, DistribDocExpirationUpdateProcessorTest, MigrateRouteKeyTest, OverseerRolesTest, OverseerStatusTest, ShardSplitTest, SolrXmlInZkTest, TestDistribDocBasedVersion, TestMiniSolrCloudCluster, TestModifyConfFiles, TestShortCircuitedRequests, TriLevelCompositeIdRoutingTest, HdfsBasicDistributedZkTest, HdfsRecoveryZkTest, HdfsWriteToMultipleCollectionsTest, StressHdfsTest, CachingDirectoryFactoryTest, TestConfigSets, TestNonNRTOpen]
   [junit4] Completed in 1.27s, 2 tests, 1 failure <<< FAILURES!

[...truncated 120 lines...]
BUILD FAILED
/Users/jenkins/workspace/Lucene-Solr-trunk-MacOSX/build.xml:467: The following error occurred while executing this line:
/Users/jenkins/workspace/Lucene-Solr-trunk-MacOSX/build.xml:447: The following error occurred while executing this line:
/Users/jenkins/workspace/Lucene-Solr-trunk-MacOSX/build.xml:45: The following error occurred while executing this line:
/Users/jenkins/workspace/Lucene-Solr-trunk-MacOSX/extra-targets.xml:37: The following error occurred while executing this line:
/Users/jenkins/workspace/Lucene-Solr-trunk-MacOSX/solr/build.xml:189: The following error occurred while executing this line:
/Users/jenkins/workspace/Lucene-Solr-trunk-MacOSX/solr/common-build.xml:496: The following error occurred while executing this line:
/Users/jenkins/workspace/Lucene-Solr-trunk-MacOSX/lucene/common-build.xml:1281: The following error occurred while executing this line:
/Users/jenkins/workspace/Lucene-Solr-trunk-MacOSX/lucene/common-build.xml:907: There were test failures: 396 suites, 1662 tests, 1 failure, 42 ignored (15 assumptions)

Total time: 93 minutes 48 seconds
Build step 'Invoke Ant' marked build as failure
Description set: Java: 64bit/jdk1.8.0 -XX:+UseCompressedOops -XX:+UseG1GC
Archiving artifacts
Recording test results
Email was triggered for: Failure
Sending email for trigger: Failure



Mime
View raw message