lucene-dev mailing list archives

Site index · List index
Message view « Date » · « Thread »
Top « Date » · « Thread »
From Policeman Jenkins Server <jenk...@thetaphi.de>
Subject [JENKINS] Lucene-Solr-4.7-Linux (32bit/jdk1.7.0_60-ea-b13) - Build # 106 - Still Failing!
Date Sun, 13 Apr 2014 20:52:26 GMT
Build: http://jenkins.thetaphi.de/job/Lucene-Solr-4.7-Linux/106/
Java: 32bit/jdk1.7.0_60-ea-b13 -client -XX:+UseParallelGC

1 tests failed.
FAILED:  org.apache.solr.client.solrj.impl.CloudSolrServerTest.testDistribSearch

Error Message:
java.util.concurrent.TimeoutException: Could not connect to ZooKeeper 127.0.0.1:33105 within
30000 ms

Stack Trace:
org.apache.solr.common.SolrException: java.util.concurrent.TimeoutException: Could not connect
to ZooKeeper 127.0.0.1:33105 within 30000 ms
	at __randomizedtesting.SeedInfo.seed([C393C5EA46EF7A32:42754BF231B01A0E]:0)
	at org.apache.solr.common.cloud.SolrZkClient.<init>(SolrZkClient.java:148)
	at org.apache.solr.common.cloud.SolrZkClient.<init>(SolrZkClient.java:99)
	at org.apache.solr.common.cloud.SolrZkClient.<init>(SolrZkClient.java:94)
	at org.apache.solr.common.cloud.SolrZkClient.<init>(SolrZkClient.java:85)
	at org.apache.solr.cloud.AbstractZkTestCase.buildZooKeeper(AbstractZkTestCase.java:89)
	at org.apache.solr.cloud.AbstractZkTestCase.buildZooKeeper(AbstractZkTestCase.java:83)
	at org.apache.solr.cloud.AbstractDistribZkTestBase.setUp(AbstractDistribZkTestBase.java:70)
	at org.apache.solr.cloud.AbstractFullDistribZkTestBase.setUp(AbstractFullDistribZkTestBase.java:200)
	at org.apache.solr.client.solrj.impl.CloudSolrServerTest.setUp(CloudSolrServerTest.java:80)
	at sun.reflect.NativeMethodAccessorImpl.invoke0(Native Method)
	at sun.reflect.NativeMethodAccessorImpl.invoke(NativeMethodAccessorImpl.java:57)
	at sun.reflect.DelegatingMethodAccessorImpl.invoke(DelegatingMethodAccessorImpl.java:43)
	at java.lang.reflect.Method.invoke(Method.java:606)
	at com.carrotsearch.randomizedtesting.RandomizedRunner.invoke(RandomizedRunner.java:1559)
	at com.carrotsearch.randomizedtesting.RandomizedRunner.access$600(RandomizedRunner.java:79)
	at com.carrotsearch.randomizedtesting.RandomizedRunner$7.evaluate(RandomizedRunner.java:771)
	at com.carrotsearch.randomizedtesting.RandomizedRunner$8.evaluate(RandomizedRunner.java:787)
	at com.carrotsearch.randomizedtesting.rules.SystemPropertiesRestoreRule$1.evaluate(SystemPropertiesRestoreRule.java:53)
	at org.apache.lucene.util.TestRuleSetupTeardownChained$1.evaluate(TestRuleSetupTeardownChained.java:50)
	at org.apache.lucene.util.TestRuleFieldCacheSanity$1.evaluate(TestRuleFieldCacheSanity.java:51)
	at org.apache.lucene.util.AbstractBeforeAfterRule$1.evaluate(AbstractBeforeAfterRule.java:46)
	at com.carrotsearch.randomizedtesting.rules.SystemPropertiesInvariantRule$1.evaluate(SystemPropertiesInvariantRule.java:55)
	at org.apache.lucene.util.TestRuleThreadAndTestName$1.evaluate(TestRuleThreadAndTestName.java:49)
	at org.apache.lucene.util.TestRuleIgnoreAfterMaxFailures$1.evaluate(TestRuleIgnoreAfterMaxFailures.java:70)
	at org.apache.lucene.util.TestRuleMarkFailure$1.evaluate(TestRuleMarkFailure.java:48)
	at com.carrotsearch.randomizedtesting.rules.StatementAdapter.evaluate(StatementAdapter.java:36)
	at com.carrotsearch.randomizedtesting.ThreadLeakControl$StatementRunner.run(ThreadLeakControl.java:358)
	at com.carrotsearch.randomizedtesting.ThreadLeakControl.forkTimeoutingTask(ThreadLeakControl.java:782)
	at com.carrotsearch.randomizedtesting.ThreadLeakControl$3.evaluate(ThreadLeakControl.java:442)
	at com.carrotsearch.randomizedtesting.RandomizedRunner.runSingleTest(RandomizedRunner.java:746)
	at com.carrotsearch.randomizedtesting.RandomizedRunner$3.evaluate(RandomizedRunner.java:648)
	at com.carrotsearch.randomizedtesting.RandomizedRunner$4.evaluate(RandomizedRunner.java:682)
	at com.carrotsearch.randomizedtesting.RandomizedRunner$5.evaluate(RandomizedRunner.java:693)
	at com.carrotsearch.randomizedtesting.rules.StatementAdapter.evaluate(StatementAdapter.java:36)
	at com.carrotsearch.randomizedtesting.rules.SystemPropertiesRestoreRule$1.evaluate(SystemPropertiesRestoreRule.java:53)
	at org.apache.lucene.util.AbstractBeforeAfterRule$1.evaluate(AbstractBeforeAfterRule.java:46)
	at org.apache.lucene.util.TestRuleStoreClassName$1.evaluate(TestRuleStoreClassName.java:42)
	at com.carrotsearch.randomizedtesting.rules.SystemPropertiesInvariantRule$1.evaluate(SystemPropertiesInvariantRule.java:55)
	at com.carrotsearch.randomizedtesting.rules.NoShadowingOrOverridesOnMethodsRule$1.evaluate(NoShadowingOrOverridesOnMethodsRule.java:39)
	at com.carrotsearch.randomizedtesting.rules.NoShadowingOrOverridesOnMethodsRule$1.evaluate(NoShadowingOrOverridesOnMethodsRule.java:39)
	at com.carrotsearch.randomizedtesting.rules.StatementAdapter.evaluate(StatementAdapter.java:36)
	at org.apache.lucene.util.TestRuleAssertionsRequired$1.evaluate(TestRuleAssertionsRequired.java:43)
	at org.apache.lucene.util.TestRuleMarkFailure$1.evaluate(TestRuleMarkFailure.java:48)
	at org.apache.lucene.util.TestRuleIgnoreAfterMaxFailures$1.evaluate(TestRuleIgnoreAfterMaxFailures.java:70)
	at org.apache.lucene.util.TestRuleIgnoreTestSuites$1.evaluate(TestRuleIgnoreTestSuites.java:55)
	at com.carrotsearch.randomizedtesting.rules.StatementAdapter.evaluate(StatementAdapter.java:36)
	at com.carrotsearch.randomizedtesting.ThreadLeakControl$StatementRunner.run(ThreadLeakControl.java:358)
	at java.lang.Thread.run(Thread.java:744)
Caused by: java.util.concurrent.TimeoutException: Could not connect to ZooKeeper 127.0.0.1:33105
within 30000 ms
	at org.apache.solr.common.cloud.ConnectionManager.waitForConnected(ConnectionManager.java:223)
	at org.apache.solr.common.cloud.SolrZkClient.<init>(SolrZkClient.java:140)
	... 47 more




Build Log:
[...truncated 11910 lines...]
   [junit4] Suite: org.apache.solr.client.solrj.impl.CloudSolrServerTest
   [junit4]   2> log4j:WARN No such property [conversionPattern] in org.apache.solr.util.SolrLogLayout.
   [junit4]   2> 612 T9 oas.SolrTestCaseJ4.buildSSLConfig Randomized ssl (true) and clientAuth
(true)
   [junit4]   2> 641 T9 oas.BaseDistributedSearchTestCase.initHostContext Setting hostContext
system property: /nh_/r
   [junit4]   2> 645 T9 oasc.AbstractZkTestCase.<clinit> WARN TEST_HOME() does not
exist - solrj test?
   [junit4]   2> 673 T9 oas.SolrTestCaseJ4.setUp ###Starting testDistribSearch
   [junit4]   2> Creating dataDir: /mnt/ssd/jenkins/workspace/Lucene-Solr-4.7-Linux/solr/build/solr-solrj/test/J0/./solrtest-CloudSolrServerTest-1397422259097
   [junit4]   2> 677 T9 oasc.ZkTestServer.run STARTING ZK TEST SERVER
   [junit4]   2> 680 T10 oasc.ZkTestServer$ZKServerMain.runFromConfig Starting server
   [junit4]   2> 780 T9 oasc.ZkTestServer.run start zk server on port:33105
   [junit4]   2> 822 T9 oascc.ConnectionManager.waitForConnected Waiting for client to
connect to ZooKeeper
   [junit4]   2> 31234 T13 oazsp.FileTxnLog.commit WARN fsync-ing the write ahead log in
SyncThread:0 took 30394ms which will adversely effect operation latency. See the ZooKeeper
troubleshooting guide
   [junit4]   2> 31244 T11 oazs.NIOServerCnxn.doIO WARN caught end of stream exception
EndOfStreamException: Unable to read additional data from client sessionid 0x1455cdb7bd70000,
likely client has closed socket
   [junit4]   2> 	at org.apache.zookeeper.server.NIOServerCnxn.doIO(NIOServerCnxn.java:220)
   [junit4]   2> 	at org.apache.zookeeper.server.NIOServerCnxnFactory.run(NIOServerCnxnFactory.java:208)
   [junit4]   2> 	at java.lang.Thread.run(Thread.java:744)
   [junit4]   2> 
   [junit4]   2> 31248 T16 oascc.ConnectionManager.process Watcher org.apache.solr.common.cloud.ConnectionManager@58ebff
name:ZooKeeperConnection Watcher:127.0.0.1:33105 got event WatchedEvent state:SyncConnected
type:None path:null path:null type:None
   [junit4]   2> 31248 T16 oascc.ConnectionManager.process Client->ZooKeeper status
change trigger but we are already closed
   [junit4]   2> 31302 T9 oas.SolrTestCaseJ4.tearDown ###Ending testDistribSearch
   [junit4]   2> 31305 T9 oasc.ZkTestServer.send4LetterWord connecting to 127.0.0.1:33105
33105
   [junit4]   1> client port:0.0.0.0/0.0.0.0:0
   [junit4]   2> NOTE: reproduce with: ant test  -Dtestcase=CloudSolrServerTest -Dtests.method=testDistribSearch
-Dtests.seed=C393C5EA46EF7A32 -Dtests.multiplier=3 -Dtests.slow=true -Dtests.locale=sl -Dtests.timezone=America/North_Dakota/Beulah
-Dtests.file.encoding=ISO-8859-1
   [junit4] ERROR   31.0s J0 | CloudSolrServerTest.testDistribSearch <<<
   [junit4]    > Throwable #1: org.apache.solr.common.SolrException: java.util.concurrent.TimeoutException:
Could not connect to ZooKeeper 127.0.0.1:33105 within 30000 ms
   [junit4]    > 	at __randomizedtesting.SeedInfo.seed([C393C5EA46EF7A32:42754BF231B01A0E]:0)
   [junit4]    > 	at org.apache.solr.common.cloud.SolrZkClient.<init>(SolrZkClient.java:148)
   [junit4]    > 	at org.apache.solr.common.cloud.SolrZkClient.<init>(SolrZkClient.java:99)
   [junit4]    > 	at org.apache.solr.common.cloud.SolrZkClient.<init>(SolrZkClient.java:94)
   [junit4]    > 	at org.apache.solr.common.cloud.SolrZkClient.<init>(SolrZkClient.java:85)
   [junit4]    > 	at org.apache.solr.cloud.AbstractZkTestCase.buildZooKeeper(AbstractZkTestCase.java:89)
   [junit4]    > 	at org.apache.solr.cloud.AbstractZkTestCase.buildZooKeeper(AbstractZkTestCase.java:83)
   [junit4]    > 	at org.apache.solr.cloud.AbstractDistribZkTestBase.setUp(AbstractDistribZkTestBase.java:70)
   [junit4]    > 	at org.apache.solr.cloud.AbstractFullDistribZkTestBase.setUp(AbstractFullDistribZkTestBase.java:200)
   [junit4]    > 	at org.apache.solr.client.solrj.impl.CloudSolrServerTest.setUp(CloudSolrServerTest.java:80)
   [junit4]    > 	at java.lang.Thread.run(Thread.java:744)
   [junit4]    > Caused by: java.util.concurrent.TimeoutException: Could not connect to
ZooKeeper 127.0.0.1:33105 within 30000 ms
   [junit4]    > 	at org.apache.solr.common.cloud.ConnectionManager.waitForConnected(ConnectionManager.java:223)
   [junit4]    > 	at org.apache.solr.common.cloud.SolrZkClient.<init>(SolrZkClient.java:140)
   [junit4]    > 	... 47 more
   [junit4] IGNOR/A 0.01s J0 | CloudSolrServerTest.testShutdown
   [junit4]    > Assumption #1: 'badapple' test group is disabled (@BadApple)
   [junit4]   2> 31686 T9 oas.SolrTestCaseJ4.deleteCore ###deleteCore
   [junit4]   2> NOTE: test params are: codec=Lucene46: {}, docValues:{}, sim=DefaultSimilarity,
locale=sl, timezone=America/North_Dakota/Beulah
   [junit4]   2> NOTE: Linux 3.8.0-38-generic i386/Oracle Corporation 1.7.0_60-ea (32-bit)/cpus=8,threads=1,free=11083504,total=54525952
   [junit4]   2> NOTE: All tests run in this JVM: [CloudSolrServerTest]
   [junit4] Completed on J0 in 31.81s, 2 tests, 1 error, 1 skipped <<< FAILURES!

[...truncated 124 lines...]
BUILD FAILED
/mnt/ssd/jenkins/workspace/Lucene-Solr-4.7-Linux/build.xml:459: The following error occurred
while executing this line:
/mnt/ssd/jenkins/workspace/Lucene-Solr-4.7-Linux/build.xml:439: The following error occurred
while executing this line:
/mnt/ssd/jenkins/workspace/Lucene-Solr-4.7-Linux/build.xml:39: The following error occurred
while executing this line:
/mnt/ssd/jenkins/workspace/Lucene-Solr-4.7-Linux/extra-targets.xml:37: The following error
occurred while executing this line:
/mnt/ssd/jenkins/workspace/Lucene-Solr-4.7-Linux/solr/build.xml:202: The following error occurred
while executing this line:
/mnt/ssd/jenkins/workspace/Lucene-Solr-4.7-Linux/solr/common-build.xml:505: The following
error occurred while executing this line:
/mnt/ssd/jenkins/workspace/Lucene-Solr-4.7-Linux/lucene/common-build.xml:1278: The following
error occurred while executing this line:
/mnt/ssd/jenkins/workspace/Lucene-Solr-4.7-Linux/lucene/common-build.xml:911: There were test
failures: 48 suites, 281 tests, 1 error, 1 ignored (1 assumption)

Total time: 48 minutes 58 seconds
Build step 'Invoke Ant' marked build as failure
Description set: Java: 32bit/jdk1.7.0_60-ea-b13 -client -XX:+UseParallelGC
Archiving artifacts
Recording test results
Email was triggered for: Failure
Sending email for trigger: Failure



Mime
View raw message