lucene-dev mailing list archives

Site index · List index
Message view « Date » · « Thread »
Top « Date » · « Thread »
From Policeman Jenkins Server <jenk...@thetaphi.de>
Subject [JENKINS] Lucene-Solr-4.x-Linux (64bit/jdk1.8.0-fcs-b129) - Build # 9552 - Failure!
Date Mon, 03 Mar 2014 11:34:47 GMT
Build: http://jenkins.thetaphi.de/job/Lucene-Solr-4.x-Linux/9552/
Java: 64bit/jdk1.8.0-fcs-b129 -XX:-UseCompressedOops -XX:+UseParallelGC

1 tests failed.
REGRESSION:  org.apache.solr.cloud.OverseerRolesTest.testDistribSearch

Error Message:
Captured an uncaught exception in thread: Thread[id=937, name=Overseer-91347067964424204-127.0.0.1:41649_v_%2Fe-n_0000000004, state=RUNNABLE, group=Overseer collection creation process.]

Stack Trace:
com.carrotsearch.randomizedtesting.UncaughtExceptionError: Captured an uncaught exception in thread: Thread[id=937, name=Overseer-91347067964424204-127.0.0.1:41649_v_%2Fe-n_0000000004, state=RUNNABLE, group=Overseer collection creation process.]
	at __randomizedtesting.SeedInfo.seed([9FA6E2856759DDAB:1E406C9D1006BD97]:0)
Caused by: org.apache.solr.common.cloud.ZooKeeperException: 
	at __randomizedtesting.SeedInfo.seed([9FA6E2856759DDAB]:0)
	at org.apache.solr.cloud.OverseerCollectionProcessor.run(OverseerCollectionProcessor.java:216)
	at java.lang.Thread.run(Thread.java:744)
Caused by: org.apache.zookeeper.KeeperException$NoNodeException: KeeperErrorCode = NoNode for /overseer/collection-queue-work/qn-0000000004
	at org.apache.zookeeper.KeeperException.create(KeeperException.java:111)
	at org.apache.zookeeper.KeeperException.create(KeeperException.java:51)
	at org.apache.zookeeper.ZooKeeper.getData(ZooKeeper.java:1151)
	at org.apache.solr.common.cloud.SolrZkClient$7.execute(SolrZkClient.java:276)
	at org.apache.solr.common.cloud.SolrZkClient$7.execute(SolrZkClient.java:273)
	at org.apache.solr.common.cloud.ZkCmdExecutor.retryOperation(ZkCmdExecutor.java:73)
	at org.apache.solr.common.cloud.SolrZkClient.getData(SolrZkClient.java:273)
	at org.apache.solr.cloud.DistributedQueue.remove(DistributedQueue.java:192)
	at org.apache.solr.cloud.OverseerCollectionProcessor.run(OverseerCollectionProcessor.java:207)
	... 1 more




Build Log:
[...truncated 272 lines...]
ERROR: Failed to update http://svn.apache.org/repos/asf/lucene/dev/branches/branch_4x
org.tmatesoft.svn.core.SVNException: svn: E175002: OPTIONS /repos/asf/lucene/dev/branches/branch_4x failed
	at org.tmatesoft.svn.core.internal.io.dav.http.HTTPConnection.request(HTTPConnection.java:388)
	at org.tmatesoft.svn.core.internal.io.dav.http.HTTPConnection.request(HTTPConnection.java:373)
	at org.tmatesoft.svn.core.internal.io.dav.http.HTTPConnection.request(HTTPConnection.java:361)
	at org.tmatesoft.svn.core.internal.io.dav.DAVConnection.performHttpRequest(DAVConnection.java:707)
	at org.tmatesoft.svn.core.internal.io.dav.DAVConnection.exchangeCapabilities(DAVConnection.java:627)
	at org.tmatesoft.svn.core.internal.io.dav.DAVConnection.open(DAVConnection.java:102)
	at org.tmatesoft.svn.core.internal.io.dav.DAVRepository.openConnection(DAVRepository.java:1020)
	at org.tmatesoft.svn.core.internal.io.dav.DAVRepository.getRepositoryUUID(DAVRepository.java:148)
	at org.tmatesoft.svn.core.internal.wc16.SVNBasicDelegate.createRepository(SVNBasicDelegate.java:339)
	at org.tmatesoft.svn.core.internal.wc16.SVNBasicDelegate.createRepository(SVNBasicDelegate.java:328)
	at org.tmatesoft.svn.core.internal.wc16.SVNUpdateClient16.update(SVNUpdateClient16.java:482)
	at org.tmatesoft.svn.core.internal.wc16.SVNUpdateClient16.doUpdate(SVNUpdateClient16.java:364)
	at org.tmatesoft.svn.core.internal.wc16.SVNUpdateClient16.doUpdate(SVNUpdateClient16.java:274)
	at org.tmatesoft.svn.core.internal.wc2.old.SvnOldUpdate.run(SvnOldUpdate.java:27)
	at org.tmatesoft.svn.core.internal.wc2.old.SvnOldUpdate.run(SvnOldUpdate.java:11)
	at org.tmatesoft.svn.core.internal.wc2.SvnOperationRunner.run(SvnOperationRunner.java:20)
	at org.tmatesoft.svn.core.wc2.SvnOperationFactory.run(SvnOperationFactory.java:1238)
	at org.tmatesoft.svn.core.wc2.SvnOperation.run(SvnOperation.java:294)
	at org.tmatesoft.svn.core.wc.SVNUpdateClient.doUpdate(SVNUpdateClient.java:311)
	at org.tmatesoft.svn.core.wc.SVNUpdateClient.doUpdate(SVNUpdateClient.java:291)
	at org.tmatesoft.svn.core.wc.SVNUpdateClient.doUpdate(SVNUpdateClient.java:387)
	at hudson.scm.subversion.UpdateUpdater$TaskImpl.perform(UpdateUpdater.java:157)
	at hudson.scm.subversion.WorkspaceUpdater$UpdateTask.delegateTo(WorkspaceUpdater.java:161)
	at hudson.scm.SubversionSCM$CheckOutTask.perform(SubversionSCM.java:1029)
	at hudson.scm.SubversionSCM$CheckOutTask.invoke(SubversionSCM.java:1010)
	at hudson.scm.SubversionSCM$CheckOutTask.invoke(SubversionSCM.java:986)
	at hudson.FilePath.act(FilePath.java:914)
	at hudson.FilePath.act(FilePath.java:887)
	at hudson.scm.SubversionSCM.checkout(SubversionSCM.java:935)
	at hudson.scm.SubversionSCM.checkout(SubversionSCM.java:870)
	at hudson.model.AbstractProject.checkout(AbstractProject.java:1411)
	at hudson.model.AbstractBuild$AbstractBuildExecution.defaultCheckout(AbstractBuild.java:671)
	at jenkins.scm.SCMCheckoutStrategy.checkout(SCMCheckoutStrategy.java:88)
	at hudson.model.AbstractBuild$AbstractBuildExecution.run(AbstractBuild.java:580)
	at hudson.model.Run.execute(Run.java:1670)
	at hudson.model.FreeStyleBuild.run(FreeStyleBuild.java:46)
	at hudson.model.ResourceController.execute(ResourceController.java:88)
	at hudson.model.Executor.run(Executor.java:231)
Caused by: svn: E175002: OPTIONS /repos/asf/lucene/dev/branches/branch_4x failed
	at org.tmatesoft.svn.core.SVNErrorMessage.create(SVNErrorMessage.java:208)
	at org.tmatesoft.svn.core.SVNErrorMessage.create(SVNErrorMessage.java:154)
	at org.tmatesoft.svn.core.SVNErrorMessage.create(SVNErrorMessage.java:97)
	... 38 more
Caused by: org.tmatesoft.svn.core.SVNException: svn: E175002: OPTIONS request failed on '/repos/asf/lucene/dev/branches/branch_4x'
svn: E175002: unknown host
	at org.tmatesoft.svn.core.internal.wc.SVNErrorManager.error(SVNErrorManager.java:64)
	at org.tmatesoft.svn.core.internal.wc.SVNErrorManager.error(SVNErrorManager.java:51)
	at org.tmatesoft.svn.core.internal.io.dav.http.HTTPConnection._request(HTTPConnection.java:777)
	at org.tmatesoft.svn.core.internal.io.dav.http.HTTPConnection.request(HTTPConnection.java:382)
	... 37 more
Caused by: svn: E175002: OPTIONS request failed on '/repos/asf/lucene/dev/branches/branch_4x'
	at org.tmatesoft.svn.core.SVNErrorMessage.create(SVNErrorMessage.java:208)
	at org.tmatesoft.svn.core.internal.io.dav.http.HTTPConnection._request(HTTPConnection.java:775)
	... 38 more
Caused by: svn: E175002: unknown host
	at org.tmatesoft.svn.core.SVNErrorMessage.create(SVNErrorMessage.java:208)
	at org.tmatesoft.svn.core.internal.io.dav.http.HTTPConnection._request(HTTPConnection.java:517)
	... 38 more
Caused by: java.net.UnknownHostException: svn.apache.org
	at java.net.InetAddress.getAllByName0(InetAddress.java:1250)
	at java.net.InetAddress.getAllByName(InetAddress.java:1162)
	at java.net.InetAddress.getAllByName(InetAddress.java:1098)
	at java.net.InetAddress.getByName(InetAddress.java:1048)
	at org.tmatesoft.svn.core.internal.util.SVNSocketFactory.createAddres(SVNSocketFactory.java:189)
	at org.tmatesoft.svn.core.internal.util.SVNSocketFactory.createPlainSocket(SVNSocketFactory.java:66)
	at org.tmatesoft.svn.core.internal.io.dav.http.HTTPConnection.connect(HTTPConnection.java:280)
	at org.tmatesoft.svn.core.internal.io.dav.http.HTTPConnection._request(HTTPConnection.java:451)
	... 38 more
ERROR: Subversion update failed
java.io.IOException
	at hudson.scm.subversion.UpdateUpdater$TaskImpl.perform(UpdateUpdater.java:207)
	at hudson.scm.subversion.WorkspaceUpdater$UpdateTask.delegateTo(WorkspaceUpdater.java:161)
	at hudson.scm.SubversionSCM$CheckOutTask.perform(SubversionSCM.java:1029)
	at hudson.scm.SubversionSCM$CheckOutTask.invoke(SubversionSCM.java:1010)
	at hudson.scm.SubversionSCM$CheckOutTask.invoke(SubversionSCM.java:986)
	at hudson.FilePath.act(FilePath.java:914)
	at hudson.FilePath.act(FilePath.java:887)
	at hudson.scm.SubversionSCM.checkout(SubversionSCM.java:935)
	at hudson.scm.SubversionSCM.checkout(SubversionSCM.java:870)
	at hudson.model.AbstractProject.checkout(AbstractProject.java:1411)
	at hudson.model.AbstractBuild$AbstractBuildExecution.defaultCheckout(AbstractBuild.java:671)
	at jenkins.scm.SCMCheckoutStrategy.checkout(SCMCheckoutStrategy.java:88)
	at hudson.model.AbstractBuild$AbstractBuildExecution.run(AbstractBuild.java:580)
	at hudson.model.Run.execute(Run.java:1670)
	at hudson.model.FreeStyleBuild.run(FreeStyleBuild.java:46)
	at hudson.model.ResourceController.execute(ResourceController.java:88)
	at hudson.model.Executor.run(Executor.java:231)
Caused by: hudson.scm.subversion.UpdaterException: failed to perform svn update
	... 17 more
Caused by: org.tmatesoft.svn.core.SVNException: svn: E175002: OPTIONS /repos/asf/lucene/dev/branches/branch_4x failed
	at org.tmatesoft.svn.core.internal.io.dav.http.HTTPConnection.request(HTTPConnection.java:388)
	at org.tmatesoft.svn.core.internal.io.dav.http.HTTPConnection.request(HTTPConnection.java:373)
	at org.tmatesoft.svn.core.internal.io.dav.http.HTTPConnection.request(HTTPConnection.java:361)
	at org.tmatesoft.svn.core.internal.io.dav.DAVConnection.performHttpRequest(DAVConnection.java:707)
	at org.tmatesoft.svn.core.internal.io.dav.DAVConnection.exchangeCapabilities(DAVConnection.java:627)
	at org.tmatesoft.svn.core.internal.io.dav.DAVConnection.open(DAVConnection.java:102)
	at org.tmatesoft.svn.core.internal.io.dav.DAVRepository.openConnection(DAVRepository.java:1020)
	at org.tmatesoft.svn.core.internal.io.dav.DAVRepository.getRepositoryUUID(DAVRepository.java:148)
	at org.tmatesoft.svn.core.internal.wc16.SVNBasicDelegate.createRepository(SVNBasicDelegate.java:339)
	at org.tmatesoft.svn.core.internal.wc16.SVNBasicDelegate.createRepository(SVNBasicDelegate.java:328)
	at org.tmatesoft.svn.core.internal.wc16.SVNUpdateClient16.update(SVNUpdateClient16.java:482)
	at org.tmatesoft.svn.core.internal.wc16.SVNUpdateClient16.doUpdate(SVNUpdateClient16.java:364)
	at org.tmatesoft.svn.core.internal.wc16.SVNUpdateClient16.doUpdate(SVNUpdateClient16.java:274)
	at org.tmatesoft.svn.core.internal.wc2.old.SvnOldUpdate.run(SvnOldUpdate.java:27)
	at org.tmatesoft.svn.core.internal.wc2.old.SvnOldUpdate.run(SvnOldUpdate.java:11)
	at org.tmatesoft.svn.core.internal.wc2.SvnOperationRunner.run(SvnOperationRunner.java:20)
	at org.tmatesoft.svn.core.wc2.SvnOperationFactory.run(SvnOperationFactory.java:1238)
	at org.tmatesoft.svn.core.wc2.SvnOperation.run(SvnOperation.java:294)
	at org.tmatesoft.svn.core.wc.SVNUpdateClient.doUpdate(SVNUpdateClient.java:311)
	at org.tmatesoft.svn.core.wc.SVNUpdateClient.doUpdate(SVNUpdateClient.java:291)
	at org.tmatesoft.svn.core.wc.SVNUpdateClient.doUpdate(SVNUpdateClient.java:387)
	at hudson.scm.subversion.UpdateUpdater$TaskImpl.perform(UpdateUpdater.java:157)
	... 16 more
Caused by: svn: E175002: OPTIONS /repos/asf/lucene/dev/branches/branch_4x failed
	at org.tmatesoft.svn.core.SVNErrorMessage.create(SVNErrorMessage.java:208)
	at org.tmatesoft.svn.core.SVNErrorMessage.create(SVNErrorMessage.java:154)
	at org.tmatesoft.svn.core.SVNErrorMessage.create(SVNErrorMessage.java:97)
	... 38 more
Caused by: org.tmatesoft.svn.core.SVNException: svn: E175002: OPTIONS request failed on '/repos/asf/lucene/dev/branches/branch_4x'
svn: E175002: unknown host
	at org.tmatesoft.svn.core.internal.wc.SVNErrorManager.error(SVNErrorManager.java:64)
	at org.tmatesoft.svn.core.internal.wc.SVNErrorManager.error(SVNErrorManager.java:51)
	at org.tmatesoft.svn.core.internal.io.dav.http.HTTPConnection._request(HTTPConnection.java:777)
	at org.tmatesoft.svn.core.internal.io.dav.http.HTTPConnection.request(HTTPConnection.java:382)
	... 37 more
Caused by: svn: E175002: OPTIONS request failed on '/repos/asf/lucene/dev/branches/branch_4x'
	at org.tmatesoft.svn.core.SVNErrorMessage.create(SVNErrorMessage.java:208)
	at org.tmatesoft.svn.core.internal.io.dav.http.HTTPConnection._request(HTTPConnection.java:775)
	... 38 more
Caused by: svn: E175002: unknown host
	at org.tmatesoft.svn.core.SVNErrorMessage.create(SVNErrorMessage.java:208)
	at org.tmatesoft.svn.core.internal.io.dav.http.HTTPConnection._request(HTTPConnection.java:517)
	... 38 more
Caused by: java.net.UnknownHostException: svn.apache.org
	at java.net.InetAddress.getAllByName0(InetAddress.java:1250)
	at java.net.InetAddress.getAllByName(InetAddress.java:1162)
	at java.net.InetAddress.getAllByName(InetAddress.java:1098)
	at java.net.InetAddress.getByName(InetAddress.java:1048)
	at org.tmatesoft.svn.core.internal.util.SVNSocketFactory.createAddres(SVNSocketFactory.java:189)
	at org.tmatesoft.svn.core.internal.util.SVNSocketFactory.createPlainSocket(SVNSocketFactory.java:66)
	at org.tmatesoft.svn.core.internal.io.dav.http.HTTPConnection.connect(HTTPConnection.java:280)
	at org.tmatesoft.svn.core.internal.io.dav.http.HTTPConnection._request(HTTPConnection.java:451)
	... 38 more
Retrying after 10 seconds
Cleaning up /var/lib/jenkins/workspace/Lucene-Solr-4.x-Linux/.
Updating http://svn.apache.org/repos/asf/lucene/dev/branches/branch_4x at revision '2014-03-03T10:51:12.999 +0000'
ERROR: Failed to update http://svn.apache.org/repos/asf/lucene/dev/branches/branch_4x
org.tmatesoft.svn.core.SVNException: svn: E175002: OPTIONS /repos/asf/lucene/dev/branches/branch_4x failed
	at org.tmatesoft.svn.core.internal.io.dav.http.HTTPConnection.request(HTTPConnection.java:388)
	at org.tmatesoft.svn.core.internal.io.dav.http.HTTPConnection.request(HTTPConnection.java:373)
	at org.tmatesoft.svn.core.internal.io.dav.http.HTTPConnection.request(HTTPConnection.java:361)
	at org.tmatesoft.svn.core.internal.io.dav.DAVConnection.performHttpRequest(DAVConnection.java:707)
	at org.tmatesoft.svn.core.internal.io.dav.DAVConnection.exchangeCapabilities(DAVConnection.java:627)
	at org.tmatesoft.svn.core.internal.io.dav.DAVConnection.open(DAVConnection.java:102)
	at org.tmatesoft.svn.core.internal.io.dav.DAVRepository.openConnection(DAVRepository.java:1020)
	at org.tmatesoft.svn.core.internal.io.dav.DAVRepository.getRepositoryUUID(DAVRepository.java:148)
	at org.tmatesoft.svn.core.internal.wc16.SVNBasicDelegate.createRepository(SVNBasicDelegate.java:339)
	at org.tmatesoft.svn.core.internal.wc16.SVNBasicDelegate.createRepository(SVNBasicDelegate.java:328)
	at org.tmatesoft.svn.core.internal.wc16.SVNUpdateClient16.update(SVNUpdateClient16.java:482)
	at org.tmatesoft.svn.core.internal.wc16.SVNUpdateClient16.doUpdate(SVNUpdateClient16.java:364)
	at org.tmatesoft.svn.core.internal.wc16.SVNUpdateClient16.doUpdate(SVNUpdateClient16.java:274)
	at org.tmatesoft.svn.core.internal.wc2.old.SvnOldUpdate.run(SvnOldUpdate.java:27)
	at org.tmatesoft.svn.core.internal.wc2.old.SvnOldUpdate.run(SvnOldUpdate.java:11)
	at org.tmatesoft.svn.core.internal.wc2.SvnOperationRunner.run(SvnOperationRunner.java:20)
	at org.tmatesoft.svn.core.wc2.SvnOperationFactory.run(SvnOperationFactory.java:1238)
	at org.tmatesoft.svn.core.wc2.SvnOperation.run(SvnOperation.java:294)
	at org.tmatesoft.svn.core.wc.SVNUpdateClient.doUpdate(SVNUpdateClient.java:311)
	at org.tmatesoft.svn.core.wc.SVNUpdateClient.doUpdate(SVNUpdateClient.java:291)
	at org.tmatesoft.svn.core.wc.SVNUpdateClient.doUpdate(SVNUpdateClient.java:387)
	at hudson.scm.subversion.UpdateUpdater$TaskImpl.perform(UpdateUpdater.java:157)
	at hudson.scm.subversion.WorkspaceUpdater$UpdateTask.delegateTo(WorkspaceUpdater.java:161)
	at hudson.scm.SubversionSCM$CheckOutTask.perform(SubversionSCM.java:1029)
	at hudson.scm.SubversionSCM$CheckOutTask.invoke(SubversionSCM.java:1010)
	at hudson.scm.SubversionSCM$CheckOutTask.invoke(SubversionSCM.java:986)
	at hudson.FilePath.act(FilePath.java:914)
	at hudson.FilePath.act(FilePath.java:887)
	at hudson.scm.SubversionSCM.checkout(SubversionSCM.java:935)
	at hudson.scm.SubversionSCM.checkout(SubversionSCM.java:870)
	at hudson.model.AbstractProject.checkout(AbstractProject.java:1411)
	at hudson.model.AbstractBuild$AbstractBuildExecution.defaultCheckout(AbstractBuild.java:671)
	at jenkins.scm.SCMCheckoutStrategy.checkout(SCMCheckoutStrategy.java:88)
	at hudson.model.AbstractBuild$AbstractBuildExecution.run(AbstractBuild.java:580)
	at hudson.model.Run.execute(Run.java:1670)
	at hudson.model.FreeStyleBuild.run(FreeStyleBuild.java:46)
	at hudson.model.ResourceController.execute(ResourceController.java:88)
	at hudson.model.Executor.run(Executor.java:231)
Caused by: svn: E175002: OPTIONS /repos/asf/lucene/dev/branches/branch_4x failed
	at org.tmatesoft.svn.core.SVNErrorMessage.create(SVNErrorMessage.java:208)
	at org.tmatesoft.svn.core.SVNErrorMessage.create(SVNErrorMessage.java:154)
	at org.tmatesoft.svn.core.SVNErrorMessage.create(SVNErrorMessage.java:97)
	... 38 more
Caused by: org.tmatesoft.svn.core.SVNException: svn: E175002: OPTIONS request failed on '/repos/asf/lucene/dev/branches/branch_4x'
svn: E175002: unknown host
	at org.tmatesoft.svn.core.internal.wc.SVNErrorManager.error(SVNErrorManager.java:64)
	at org.tmatesoft.svn.core.internal.wc.SVNErrorManager.error(SVNErrorManager.java:51)
	at org.tmatesoft.svn.core.internal.io.dav.http.HTTPConnection._request(HTTPConnection.java:777)
	at org.tmatesoft.svn.core.internal.io.dav.http.HTTPConnection.request(HTTPConnection.java:382)
	... 37 more
Caused by: svn: E175002: OPTIONS request failed on '/repos/asf/lucene/dev/branches/branch_4x'
	at org.tmatesoft.svn.core.SVNErrorMessage.create(SVNErrorMessage.java:208)
	at org.tmatesoft.svn.core.internal.io.dav.http.HTTPConnection._request(HTTPConnection.java:775)
	... 38 more
Caused by: svn: E175002: unknown host
	at org.tmatesoft.svn.core.SVNErrorMessage.create(SVNErrorMessage.java:208)
	at org.tmatesoft.svn.core.internal.io.dav.http.HTTPConnection._request(HTTPConnection.java:517)
	... 38 more
Caused by: java.net.UnknownHostException: svn.apache.org
	at java.net.InetAddress.getAllByName0(InetAddress.java:1250)
	at java.net.InetAddress.getAllByName(InetAddress.java:1162)
	at java.net.InetAddress.getAllByName(InetAddress.java:1098)
	at java.net.InetAddress.getByName(InetAddress.java:1048)
	at org.tmatesoft.svn.core.internal.util.SVNSocketFactory.createAddres(SVNSocketFactory.java:189)
	at org.tmatesoft.svn.core.internal.util.SVNSocketFactory.createPlainSocket(SVNSocketFactory.java:66)
	at org.tmatesoft.svn.core.internal.io.dav.http.HTTPConnection.connect(HTTPConnection.java:280)
	at org.tmatesoft.svn.core.internal.io.dav.http.HTTPConnection._request(HTTPConnection.java:451)
	... 38 more
ERROR: Subversion update failed
java.io.IOException
	at hudson.scm.subversion.UpdateUpdater$TaskImpl.perform(UpdateUpdater.java:207)
	at hudson.scm.subversion.WorkspaceUpdater$UpdateTask.delegateTo(WorkspaceUpdater.java:161)
	at hudson.scm.SubversionSCM$CheckOutTask.perform(SubversionSCM.java:1029)
	at hudson.scm.SubversionSCM$CheckOutTask.invoke(SubversionSCM.java:1010)
	at hudson.scm.SubversionSCM$CheckOutTask.invoke(SubversionSCM.java:986)
	at hudson.FilePath.act(FilePath.java:914)
	at hudson.FilePath.act(FilePath.java:887)
	at hudson.scm.SubversionSCM.checkout(SubversionSCM.java:935)
	at hudson.scm.SubversionSCM.checkout(SubversionSCM.java:870)
	at hudson.model.AbstractProject.checkout(AbstractProject.java:1411)
	at hudson.model.AbstractBuild$AbstractBuildExecution.defaultCheckout(AbstractBuild.java:671)
	at jenkins.scm.SCMCheckoutStrategy.checkout(SCMCheckoutStrategy.java:88)
	at hudson.model.AbstractBuild$AbstractBuildExecution.run(AbstractBuild.java:580)
	at hudson.model.Run.execute(Run.java:1670)
	at hudson.model.FreeStyleBuild.run(FreeStyleBuild.java:46)
	at hudson.model.ResourceController.execute(ResourceController.java:88)
	at hudson.model.Executor.run(Executor.java:231)
Caused by: hudson.scm.subversion.UpdaterException: failed to perform svn update
	... 17 more
Caused by: org.tmatesoft.svn.core.SVNException: svn: E175002: OPTIONS /repos/asf/lucene/dev/branches/branch_4x failed
	at org.tmatesoft.svn.core.internal.io.dav.http.HTTPConnection.request(HTTPConnection.java:388)
	at org.tmatesoft.svn.core.internal.io.dav.http.HTTPConnection.request(HTTPConnection.java:373)
	at org.tmatesoft.svn.core.internal.io.dav.http.HTTPConnection.request(HTTPConnection.java:361)
	at org.tmatesoft.svn.core.internal.io.dav.DAVConnection.performHttpRequest(DAVConnection.java:707)
	at org.tmatesoft.svn.core.internal.io.dav.DAVConnection.exchangeCapabilities(DAVConnection.java:627)
	at org.tmatesoft.svn.core.internal.io.dav.DAVConnection.open(DAVConnection.java:102)
	at org.tmatesoft.svn.core.internal.io.dav.DAVRepository.openConnection(DAVRepository.java:1020)
	at org.tmatesoft.svn.core.internal.io.dav.DAVRepository.getRepositoryUUID(DAVRepository.java:148)
	at org.tmatesoft.svn.core.internal.wc16.SVNBasicDelegate.createRepository(SVNBasicDelegate.java:339)
	at org.tmatesoft.svn.core.internal.wc16.SVNBasicDelegate.createRepository(SVNBasicDelegate.java:328)
	at org.tmatesoft.svn.core.internal.wc16.SVNUpdateClient16.update(SVNUpdateClient16.java:482)
	at org.tmatesoft.svn.core.internal.wc16.SVNUpdateClient16.doUpdate(SVNUpdateClient16.java:364)
	at org.tmatesoft.svn.core.internal.wc16.SVNUpdateClient16.doUpdate(SVNUpdateClient16.java:274)
	at org.tmatesoft.svn.core.internal.wc2.old.SvnOldUpdate.run(SvnOldUpdate.java:27)
	at org.tmatesoft.svn.core.internal.wc2.old.SvnOldUpdate.run(SvnOldUpdate.java:11)
	at org.tmatesoft.svn.core.internal.wc2.SvnOperationRunner.run(SvnOperationRunner.java:20)
	at org.tmatesoft.svn.core.wc2.SvnOperationFactory.run(SvnOperationFactory.java:1238)
	at org.tmatesoft.svn.core.wc2.SvnOperation.run(SvnOperation.java:294)
	at org.tmatesoft.svn.core.wc.SVNUpdateClient.doUpdate(SVNUpdateClient.java:311)
	at org.tmatesoft.svn.core.wc.SVNUpdateClient.doUpdate(SVNUpdateClient.java:291)
	at org.tmatesoft.svn.core.wc.SVNUpdateClient.doUpdate(SVNUpdateClient.java:387)
	at hudson.scm.subversion.UpdateUpdater$TaskImpl.perform(UpdateUpdater.java:157)
	... 16 more
Caused by: svn: E175002: OPTIONS /repos/asf/lucene/dev/branches/branch_4x failed
	at org.tmatesoft.svn.core.SVNErrorMessage.create(SVNErrorMessage.java:208)
	at org.tmatesoft.svn.core.SVNErrorMessage.create(SVNErrorMessage.java:154)
	at org.tmatesoft.svn.core.SVNErrorMessage.create(SVNErrorMessage.java:97)
	... 38 more
Caused by: org.tmatesoft.svn.core.SVNException: svn: E175002: OPTIONS request failed on '/repos/asf/lucene/dev/branches/branch_4x'
svn: E175002: unknown host
	at org.tmatesoft.svn.core.internal.wc.SVNErrorManager.error(SVNErrorManager.java:64)
	at org.tmatesoft.svn.core.internal.wc.SVNErrorManager.error(SVNErrorManager.java:51)
	at org.tmatesoft.svn.core.internal.io.dav.http.HTTPConnection._request(HTTPConnection.java:777)
	at org.tmatesoft.svn.core.internal.io.dav.http.HTTPConnection.request(HTTPConnection.java:382)
	... 37 more
Caused by: svn: E175002: OPTIONS request failed on '/repos/asf/lucene/dev/branches/branch_4x'
	at org.tmatesoft.svn.core.SVNErrorMessage.create(SVNErrorMessage.java:208)
	at org.tmatesoft.svn.core.internal.io.dav.http.HTTPConnection._request(HTTPConnection.java:775)
	... 38 more
Caused by: svn: E175002: unknown host
	at org.tmatesoft.svn.core.SVNErrorMessage.create(SVNErrorMessage.java:208)
	at org.tmatesoft.svn.core.internal.io.dav.http.HTTPConnection._request(HTTPConnection.java:517)
	... 38 more
Caused by: java.net.UnknownHostException: svn.apache.org
	at java.net.InetAddress.getAllByName0(InetAddress.java:1250)
	at java.net.InetAddress.getAllByName(InetAddress.java:1162)
	at java.net.InetAddress.getAllByName(InetAddress.java:1098)
	at java.net.InetAddress.getByName(InetAddress.java:1048)
	at org.tmatesoft.svn.core.internal.util.SVNSocketFactory.createAddres(SVNSocketFactory.java:189)
	at org.tmatesoft.svn.core.internal.util.SVNSocketFactory.createPlainSocket(SVNSocketFactory.java:66)
	at org.tmatesoft.svn.core.internal.io.dav.http.HTTPConnection.connect(HTTPConnection.java:280)
	at org.tmatesoft.svn.core.internal.io.dav.http.HTTPConnection._request(HTTPConnection.java:451)
	... 38 more
Retrying after 10 seconds
Cleaning up /var/lib/jenkins/workspace/Lucene-Solr-4.x-Linux/.
Updating http://svn.apache.org/repos/asf/lucene/dev/branches/branch_4x at revision '2014-03-03T10:51:12.999 +0000'
At revision 1573519
no change for http://svn.apache.org/repos/asf/lucene/dev/branches/branch_4x since the previous build
No emails were triggered.
[Lucene-Solr-4.x-Linux] $ /bin/sh -xe /tmp/hudson4732320408432723544.sh
+ echo Using JDK: 64bit/jdk1.8.0-fcs-b129 -XX:-UseCompressedOops -XX:+UseParallelGC
Using JDK: 64bit/jdk1.8.0-fcs-b129 -XX:-UseCompressedOops -XX:+UseParallelGC
+ /var/lib/jenkins/tools/java/64bit/jdk1.8.0-fcs-b129/bin/java -XX:-UseCompressedOops -XX:+UseParallelGC -version
java version "1.8.0"
Java(TM) SE Runtime Environment (build 1.8.0-b129)
Java HotSpot(TM) 64-Bit Server VM (build 25.0-b69, mixed mode)
[Lucene-Solr-4.x-Linux] $ /var/lib/jenkins/tools/hudson.tasks.Ant_AntInstallation/ANT_1.8.2/bin/ant "-Dargs=-XX:-UseCompressedOops -XX:+UseParallelGC" -Dtests.disableHdfs=true -Dtests.multiplier=3 -Dtests.jvms=2 jenkins-hourly
Buildfile: /mnt/ssd/jenkins/workspace/Lucene-Solr-4.x-Linux/build.xml

jenkins-hourly:

clean:

clean:
     [echo] Building solr...

clean:

-test-with-heapdumps-enabled:
     [echo] Java HotSpot(TM) 64-Bit Server VM: Enabling heap dumps on OutOfMemoryError to dir '/mnt/ssd/jenkins/workspace/Lucene-Solr-4.x-Linux/heapdumps'.
    [mkdir] Created dir: /mnt/ssd/jenkins/workspace/Lucene-Solr-4.x-Linux/heapdumps

test:

-run-test:
    [mkdir] Created dir: /mnt/ssd/jenkins/workspace/Lucene-Solr-4.x-Linux/lucene/build

ivy-availability-check:

ivy-fail:

ivy-configure:
[ivy:configure] :: Apache Ivy 2.3.0 - 20130110142753 :: http://ant.apache.org/ivy/ ::
[ivy:configure] :: loading settings :: file = /mnt/ssd/jenkins/workspace/Lucene-Solr-4.x-Linux/lucene/ivy-settings.xml

-clover.load:

resolve-groovy:
[ivy:cachepath] :: resolving dependencies :: org.codehaus.groovy#groovy-all-caller;working
[ivy:cachepath] 	confs: [default]
[ivy:cachepath] 	found org.codehaus.groovy#groovy-all;2.2.1 in public
[ivy:cachepath] :: resolution report :: resolve 254ms :: artifacts dl 2ms
	---------------------------------------------------------------------
	|                  |            modules            ||   artifacts   |
	|       conf       | number| search|dwnlded|evicted|| number|dwnlded|
	---------------------------------------------------------------------
	|      default     |   1   |   0   |   0   |   0   ||   1   |   0   |
	---------------------------------------------------------------------

-init-totals:

test-core:

-clover.disable:

ivy-availability-check:

ivy-fail:

ivy-configure:
[ivy:configure] :: loading settings :: file = /mnt/ssd/jenkins/workspace/Lucene-Solr-4.x-Linux/lucene/ivy-settings.xml

-clover.load:

-clover.classpath:

-clover.setup:

clover:

resolve:

init:

compile-core:
    [mkdir] Created dir: /mnt/ssd/jenkins/workspace/Lucene-Solr-4.x-Linux/lucene/build/core/classes/java
    [javac] Compiling 710 source files to /mnt/ssd/jenkins/workspace/Lucene-Solr-4.x-Linux/lucene/build/core/classes/java
    [javac] Note: Some input files use or override a deprecated API.
    [javac] Note: Recompile with -Xlint:deprecation for details.
     [copy] Copying 3 files to /mnt/ssd/jenkins/workspace/Lucene-Solr-4.x-Linux/lucene/build/core/classes/java

compile-test-framework:

ivy-availability-check:

ivy-fail:

ivy-configure:
[ivy:configure] :: loading settings :: file = /mnt/ssd/jenkins/workspace/Lucene-Solr-4.x-Linux/lucene/ivy-settings.xml

resolve:

init:

compile-lucene-core:

ivy-availability-check:

ivy-fail:

ivy-configure:
[ivy:configure] :: loading settings :: file = /mnt/ssd/jenkins/workspace/Lucene-Solr-4.x-Linux/lucene/ivy-settings.xml

resolve:

init:

-clover.disable:

-clover.load:

-clover.classpath:

-clover.setup:

clover:

compile-core:

compile-codecs:
     [echo] Building codecs...

ivy-availability-check:
     [echo] Building codecs...

ivy-fail:

ivy-configure:
[ivy:configure] :: loading settings :: file = /mnt/ssd/jenkins/workspace/Lucene-Solr-4.x-Linux/lucene/ivy-settings.xml

resolve:

common.init:

compile-lucene-core:

init:

-clover.disable:

-clover.load:

-clover.classpath:

-clover.setup:

clover:

compile-core:
    [mkdir] Created dir: /mnt/ssd/jenkins/workspace/Lucene-Solr-4.x-Linux/lucene/build/codecs/classes/java
    [javac] Compiling 74 source files to /mnt/ssd/jenkins/workspace/Lucene-Solr-4.x-Linux/lucene/build/codecs/classes/java
    [javac] Note: Some input files use or override a deprecated API.
    [javac] Note: Recompile with -Xlint:deprecation for details.
     [copy] Copying 3 files to /mnt/ssd/jenkins/workspace/Lucene-Solr-4.x-Linux/lucene/build/codecs/classes/java

-clover.disable:

-clover.load:

-clover.classpath:

-clover.setup:

clover:

common.compile-core:
    [mkdir] Created dir: /mnt/ssd/jenkins/workspace/Lucene-Solr-4.x-Linux/lucene/build/test-framework/classes/java
    [javac] Compiling 145 source files to /mnt/ssd/jenkins/workspace/Lucene-Solr-4.x-Linux/lucene/build/test-framework/classes/java
    [javac] Note: Some input files use or override a deprecated API.
    [javac] Note: Recompile with -Xlint:deprecation for details.
     [copy] Copying 4 files to /mnt/ssd/jenkins/workspace/Lucene-Solr-4.x-Linux/lucene/build/test-framework/classes/java

compile-core:

compile-test:
    [mkdir] Created dir: /mnt/ssd/jenkins/workspace/Lucene-Solr-4.x-Linux/lucene/build/core/classes/test
    [javac] Compiling 401 source files to /mnt/ssd/jenkins/workspace/Lucene-Solr-4.x-Linux/lucene/build/core/classes/test
    [javac] Note: Some input files use or override a deprecated API.
    [javac] Note: Recompile with -Xlint:deprecation for details.
     [copy] Copying 42 files to /mnt/ssd/jenkins/workspace/Lucene-Solr-4.x-Linux/lucene/build/core/classes/test

install-junit4-taskdef:

validate:

resolve-groovy:

-init-totals:

-test:
    [mkdir] Created dir: /mnt/ssd/jenkins/workspace/Lucene-Solr-4.x-Linux/lucene/build/core/test
    [mkdir] Created dir: /mnt/ssd/jenkins/workspace/Lucene-Solr-4.x-Linux/lucene/build/core/test/temp
    [mkdir] Created dir: /mnt/ssd/jenkins/workspace/Lucene-Solr-4.x-Linux/.caches/test-stats/core
   [junit4] <JUnit4> says aloha! Master seed: FB340CBF6EC2745E
   [junit4] Executing 385 suites with 2 JVMs.
   [junit4] 
   [junit4] Started J0 PID(31837@serv1.sd-datasolutions.de).
   [junit4] Started J1 PID(31838@serv1.sd-datasolutions.de).
   [junit4] Suite: org.apache.lucene.index.TestAllFilesHaveCodecHeader
   [junit4] Completed on J0 in 1.26s, 1 test
   [junit4] 
   [junit4] Suite: org.apache.lucene.index.TestBackwardsCompatibility3x
   [junit4] Completed on J1 in 14.86s, 16 tests
   [junit4] 
   [junit4] Suite: org.apache.lucene.codecs.lucene3x.TestLucene3xTermVectorsFormat
   [junit4] Completed on J0 in 15.81s, 7 tests
   [junit4] 
   [junit4] Suite: org.apache.lucene.index.TestCustomNorms
   [junit4] Completed on J0 in 4.50s, 1 test
   [junit4] 
   [junit4] Suite: org.apache.lucene.analysis.tokenattributes.TestSimpleAttributeImpl
   [junit4] Completed on J0 in 0.08s, 1 test
   [junit4] 
   [junit4] Suite: org.apache.lucene.search.spans.TestBasics
   [junit4] Completed on J1 in 7.03s, 28 tests
   [junit4] 
   [junit4] Suite: org.apache.lucene.search.TestRegexpQuery
   [junit4] Completed on J0 in 0.92s, 7 tests
   [junit4] 
   [junit4] Suite: org.apache.lucene.util.junitcompat.TestFailIfDirectoryNotClosed
   [junit4] Completed on J0 in 0.14s, 1 test
   [junit4] 
   [junit4] Suite: org.apache.lucene.search.TestConstantScoreQuery
   [junit4] Completed on J0 in 0.17s, 4 tests
   [junit4] 
   [junit4] Suite: org.apache.lucene.search.spans.TestSpanExplanations
   [junit4] Completed on J1 in 1.27s, 31 tests
   [junit4] 
   [junit4] Suite: org.apache.lucene.search.TestIndexSearcher
   [junit4] Completed on J0 in 0.54s, 2 tests
   [junit4] 
   [junit4] Suite: org.apache.lucene.analysis.TestNumericTokenStream
   [junit4] Completed on J1 in 0.13s, 4 tests
   [junit4] 
   [junit4] Suite: org.apache.lucene.search.TestCustomSearcherSort
   [junit4] Completed on J0 in 3.67s, 2 tests
   [junit4] 
   [junit4] Suite: org.apache.lucene.search.payloads.TestPayloadTermQuery
   [junit4] Completed on J0 in 2.56s, 6 tests
   [junit4] 
   [junit4] Suite: org.apache.lucene.index.TestParallelAtomicReader
   [junit4] Completed on J0 in 0.38s, 7 tests
   [junit4] 
   [junit4] Suite: org.apache.lucene.index.TestIndexWriterForceMerge
   [junit4] Completed on J0 in 3.18s, 4 tests
   [junit4] 
   [junit4] Suite: org.apache.lucene.search.TestPhraseQuery
   [junit4] Completed on J0 in 2.23s, 18 tests
   [junit4] 
   [junit4] Suite: org.apache.lucene.search.TestSortRandom
   [junit4] Completed on J0 in 0.77s, 1 test
   [junit4] 
   [junit4] Suite: org.apache.lucene.util.Test2BPagedBytes
   [junit4] Completed on J0 in 0.00s, 0 tests
   [junit4] 
   [junit4] Suite: org.apache.lucene.TestMergeSchedulerExternal
   [junit4] Completed on J0 in 0.43s, 2 tests
   [junit4] 
   [junit4] Suite: org.apache.lucene.codecs.lucene3x.TestTermInfosReaderIndex
   [junit4] Completed on J0 in 0.83s, 3 tests
   [junit4] 
   [junit4] Suite: org.apache.lucene.codecs.lucene40.TestLucene40TermVectorsFormat
   [junit4] Completed on J1 in 15.28s, 7 tests
   [junit4] 
   [junit4] Suite: org.apache.lucene.codecs.lucene40.TestBitVector
   [junit4] Completed on J1 in 0.94s, 9 tests
   [junit4] 
   [junit4] Suite: org.apache.lucene.util.TestBytesRefHash
   [junit4] Completed on J0 in 2.04s, 8 tests
   [junit4] 
   [junit4] Suite: org.apache.lucene.util.TestCloseableThreadLocal
   [junit4] Completed on J0 in 0.02s, 3 tests
   [junit4] 
   [junit4] Suite: org.apache.lucene.index.TestFieldsReader
   [junit4] Completed on J0 in 0.70s, 2 tests
   [junit4] 
   [junit4] Suite: org.apache.lucene.index.Test2BTerms
   [junit4] Completed on J0 in 0.04s, 1 test, 1 skipped
   [junit4] 
   [junit4] Suite: org.apache.lucene.search.TestPhrasePrefixQuery
   [junit4] Completed on J0 in 0.04s, 1 test
   [junit4] 
   [junit4] Suite: org.apache.lucene.index.Test2BDocs
   [junit4] Completed on J1 in 1.31s, 2 tests
   [junit4] 
   [junit4] Suite: org.apache.lucene.search.TestLiveFieldValues
   [junit4] Completed on J1 in 3.06s, 1 test
   [junit4] 
   [junit4] Suite: org.apache.lucene.util.TestMergedIterator
   [junit4] Completed on J1 in 0.81s, 25 tests
   [junit4] 
   [junit4] Suite: org.apache.lucene.util.TestIntsRef
   [junit4] Completed on J1 in 0.02s, 2 tests
   [junit4] 
   [junit4] Suite: org.apache.lucene.util.TestVersion
   [junit4] Completed on J1 in 0.06s, 3 tests
   [junit4] 
   [junit4] Suite: org.apache.lucene.search.TestTermVectors
   [junit4] Completed on J1 in 0.64s, 4 tests
   [junit4] 
   [junit4] Suite: org.apache.lucene.index.TestBackwardsCompatibility
   [junit4] Completed on J1 in 13.68s, 15 tests
   [junit4] 
   [junit4] Suite: org.apache.lucene.search.TestSimpleExplanationsOfNonMatches
   [junit4] Completed on J1 in 0.70s, 69 tests
   [junit4] 
   [junit4] Suite: org.apache.lucene.codecs.lucene42.TestLucene42DocValuesFormat
   [junit4] IGNOR/A 0.08s J0 | TestLucene42DocValuesFormat.testByteMissingVsFieldCache
   [junit4]    > Assumption #1: Codec does not support getDocsWithField
   [junit4] IGNOR/A 0.01s J0 | TestLucene42DocValuesFormat.testThreads2
   [junit4]    > Assumption #1: Codec does not support getDocsWithField
   [junit4] IGNOR/A 0.02s J0 | TestLucene42DocValuesFormat.testShortMissingVsFieldCache
   [junit4]    > Assumption #1: Codec does not support getDocsWithField
   [junit4] IGNOR/A 0.01s J0 | TestLucene42DocValuesFormat.testTwoBytesOneMissingWithMerging
   [junit4]    > Assumption #1: Codec does not support getDocsWithField
   [junit4] IGNOR/A 0.01s J0 | TestLucene42DocValuesFormat.testTwoNumbersOneMissing
   [junit4]    > Assumption #1: Codec does not support getDocsWithField
   [junit4] IGNOR/A 0.00s J0 | TestLucene42DocValuesFormat.testTwoBytesOneMissing
   [junit4]    > Assumption #1: Codec does not support getDocsWithField
   [junit4] IGNOR/A 0.01s J0 | TestLucene42DocValuesFormat.testTwoNumbersOneMissingWithMerging
   [junit4]    > Assumption #1: Codec does not support getDocsWithField
   [junit4] IGNOR/A 0.01s J0 | TestLucene42DocValuesFormat.testIntMissingVsFieldCache
   [junit4]    > Assumption #1: Codec does not support getDocsWithField
   [junit4] IGNOR/A 0.01s J0 | TestLucene42DocValuesFormat.testThreeBytesOneMissingWithMerging
   [junit4]    > Assumption #1: Codec does not support getDocsWithField
   [junit4] IGNOR/A 0.01s J0 | TestLucene42DocValuesFormat.testThreeNumbersOneMissingWithMerging
   [junit4]    > Assumption #1: Codec does not support getDocsWithField
   [junit4] IGNOR/A 0.00s J0 | TestLucene42DocValuesFormat.testLongMissingVsFieldCache
   [junit4]    > Assumption #1: Codec does not support getDocsWithField
   [junit4] Completed on J0 in 29.74s, 81 tests, 11 skipped
   [junit4] 
   [junit4] Suite: org.apache.lucene.util.junitcompat.TestSameRandomnessLocalePassedOrNot
   [junit4] Completed on J0 in 0.03s, 1 test
   [junit4] 
   [junit4] Suite: org.apache.lucene.index.TestTryDelete
   [junit4] Completed on J0 in 0.02s, 3 tests
   [junit4] 
   [junit4] Suite: org.apache.lucene.index.TestNoDeletionPolicy
   [junit4] Completed on J0 in 0.14s, 4 tests
   [junit4] 
   [junit4] Suite: org.apache.lucene.util.TestSentinelIntSet
   [junit4] Completed on J0 in 0.20s, 2 tests
   [junit4] 
   [junit4] Suite: org.apache.lucene.search.spans.TestSpanExplanationsOfNonMatches
   [junit4] Completed on J0 in 0.16s, 31 tests
   [junit4] 
   [junit4] Suite: org.apache.lucene.search.TestComplexExplanationsOfNonMatches
   [junit4] Completed on J0 in 0.20s, 22 tests
   [junit4] 
   [junit4] Suite: org.apache.lucene.search.TestBooleanOr
   [junit4] Completed on J1 in 11.17s, 6 tests
   [junit4] 
   [junit4] Suite: org.apache.lucene.util.TestFieldCacheSanityChecker
   [junit4] Completed on J0 in 0.72s, 3 tests
   [junit4] 
   [junit4] Suite: org.apache.lucene.util.automaton.TestBasicOperations
   [junit4] Completed on J1 in 0.73s, 8 tests
   [junit4] 
   [junit4] Suite: org.apache.lucene.search.spans.TestSpans
   [junit4] Completed on J1 in 1.06s, 26 tests
   [junit4] 
   [junit4] Suite: org.apache.lucene.store.TestNRTCachingDirectory
   [junit4] Completed on J1 in 1.64s, 5 tests
   [junit4] 
   [junit4] Suite: org.apache.lucene.index.TestPostingsFormat
   [junit4] Completed on J0 in 3.55s, 7 tests
   [junit4] 
   [junit4] Suite: org.apache.lucene.index.TestSegmentTermDocs
   [junit4] Completed on J0 in 0.96s, 5 tests
   [junit4] 
   [junit4] Suite: org.apache.lucene.index.TestFlushByRamOrCountsPolicy
   [junit4] Completed on J0 in 2.48s, 5 tests
   [junit4] 
   [junit4] Suite: org.apache.lucene.search.TestTopScoreDocCollector
   [junit4] Completed on J0 in 0.03s, 1 test
   [junit4] 
   [junit4] Suite: org.apache.lucene.search.TestCachingCollector
   [junit4] Completed on J0 in 0.03s, 5 tests
   [junit4] 
   [junit4] Suite: org.apache.lucene.search.TestFieldCacheRangeFilter
   [junit4] Completed on J0 in 0.65s, 9 tests
   [junit4] 
   [junit4] Suite: org.apache.lucene.util.TestInPlaceMergeSorter
   [junit4] Completed on J0 in 0.16s, 9 tests
   [junit4] 
   [junit4] Suite: org.apache.lucene.util.TestArrayUtil
   [junit4] Completed on J0 in 4.61s, 11 tests
   [junit4] 
   [junit4] Suite: org.apache.lucene.store.TestMultiMMap
   [junit4] Completed on J1 in 9.93s, 11 tests
   [junit4] 
   [junit4] Suite: org.apache.lucene.search.TestRegexpRandom
   [junit4] Completed on J0 in 0.35s, 1 test
   [junit4] 
   [junit4] Suite: org.apache.lucene.search.spans.TestNearSpansOrdered
   [junit4] Completed on J1 in 0.14s, 10 tests
   [junit4] 
   [junit4] Suite: org.apache.lucene.util.automaton.TestCompiledAutomaton
   [junit4] Completed on J0 in 0.40s, 2 tests
   [junit4] 
   [junit4] Suite: org.apache.lucene.search.TestExplanations
   [junit4] Completed on J0 in 0.05s, 1 test
   [junit4] 
   [junit4] Suite: org.apache.lucene.index.TestIndexWriterMerging
   [junit4] Completed on J0 in 10.24s, 6 tests
   [junit4] 
   [junit4] Suite: org.apache.lucene.index.TestRollback
   [junit4] Completed on J0 in 0.02s, 1 test
   [junit4] 
   [junit4] Suite: org.apache.lucene.index.TestParallelTermEnum
   [junit4] Completed on J0 in 0.04s, 1 test
   [junit4] 
   [junit4] Suite: org.apache.lucene.search.FuzzyTermOnShortTermsTest
   [junit4] Completed on J0 in 0.19s, 1 test
   [junit4] 
   [junit4] Suite: org.apache.lucene.util.TestIntroSorter
   [junit4] Completed on J0 in 0.12s, 9 tests
   [junit4] 
   [junit4] Suite: org.apache.lucene.util.junitcompat.TestFailOnFieldCacheInsanity
   [junit4] Completed on J0 in 0.03s, 1 test
   [junit4] 
   [junit4] Suite: org.apache.lucene.search.TestPrefixInBooleanQuery
   [junit4] Completed on J0 in 0.49s, 4 tests
   [junit4] 
   [junit4] Suite: org.apache.lucene.index.TestPersistentSnapshotDeletionPolicy
   [junit4] Completed on J0 in 1.86s, 13 tests
   [junit4] 
   [junit4] Suite: org.apache.lucene.search.TestTopFieldCollector
   [junit4] Completed on J0 in 0.26s, 8 tests
   [junit4] 
   [junit4] Suite: org.apache.lucene.search.TestScoreCachingWrappingScorer
   [junit4] Completed on J0 in 0.01s, 1 test
   [junit4] 
   [junit4] Suite: org.apache.lucene.util.junitcompat.TestReproduceMessage
   [junit4] Completed on J0 in 0.63s, 21 tests
   [junit4] 
   [junit4] Suite: org.apache.lucene.util.packed.TestPackedInts
   [junit4] IGNOR/A 0.08s J1 | TestPackedInts.testBlockReaderOverflow
   [junit4]    > Assumption #1: 'nightly' test group is disabled (@Nightly)
   [junit4] Completed on J1 in 15.99s, 27 tests, 3 skipped
   [junit4] 
   [junit4] Suite: org.apache.lucene.search.TestPositionIncrement
   [junit4] Completed on J1 in 0.10s, 2 tests
   [junit4] 
   [junit4] Suite: org.apache.lucene.index.TestLazyProxSkipping
   [junit4] Completed on J1 in 0.87s, 2 tests
   [junit4] 
   [junit4] Suite: org.apache.lucene.search.TestNot
   [junit4] Completed on J1 in 0.03s, 1 test
   [junit4] 
   [junit4] Suite: org.apache.lucene.store.TestHugeRamFile
   [junit4] Completed on J1 in 1.45s, 1 test
   [junit4] 
   [junit4] Suite: org.apache.lucene.search.TestNGramPhraseQuery
   [junit4] Completed on J1 in 0.02s, 1 test
   [junit4] 
   [junit4] Suite: org.apache.lucene.index.TestCodecHoldsOpenFiles
   [junit4] Completed on J1 in 0.03s, 1 test
   [junit4] 
   [junit4] Suite: org.apache.lucene.index.TestNewestSegment
   [junit4] Completed on J1 in 0.04s, 1 test
   [junit4] 
   [junit4] Suite: org.apache.lucene.document.TestField
   [junit4] Completed on J1 in 0.14s, 18 tests
   [junit4] 
   [junit4] Suite: org.apache.lucene.index.TestIndexWriterWithThreads
   [junit4] Completed on J1 in 4.85s, 12 tests
   [junit4] 
   [junit4] Suite: org.apache.lucene.store.TestDirectory
   [junit4] IGNOR/A 0.00s J1 | TestDirectory.testThreadSafety
   [junit4]    > Assumption #1: 'nightly' test group is disabled (@Nightly)
   [junit4] Completed on J1 in 0.78s, 8 tests, 1 skipped
   [junit4] 
   [junit4] Suite: org.apache.lucene.search.spans.TestSpansAdvanced
   [junit4] Completed on J1 in 0.04s, 1 test
   [junit4] 
   [junit4] Suite: org.apache.lucene.search.TestMatchAllDocsQuery
   [junit4] Completed on J1 in 0.03s, 2 tests
   [junit4] 
   [junit4] Suite: org.apache.lucene.index.TestDoc
   [junit4] Completed on J1 in 0.16s, 1 test
   [junit4] 
   [junit4] Suite: org.apache.lucene.codecs.compressing.TestHighCompressionMode
   [junit4] Completed on J1 in 5.60s, 7 tests
   [junit4] 
   [junit4] Suite: org.apache.lucene.search.TestFieldValueFilter
   [junit4] Completed on J1 in 0.05s, 2 tests
   [junit4] 
   [junit4] Suite: org.apache.lucene.store.TestByteArrayDataInput
   [junit4] Completed on J1 in 0.01s, 1 test
   [junit4] 
   [junit4] Suite: org.apache.lucene.index.TestTieredMergePolicy
   [junit4] Completed on J1 in 4.03s, 5 tests
   [junit4] 
   [junit4] Suite: org.apache.lucene.codecs.perfield.TestPerFieldPostingsFormat
   [junit4] Completed on J1 in 2.28s, 7 tests
   [junit4] 
   [junit4] Suite: org.apache.lucene.search.TestTopDocsCollector
   [junit4] Completed on J1 in 0.22s, 8 tests
   [junit4] 
   [junit4] Suite: org.apache.lucene.search.spans.TestSpanSearchEquivalence
   [junit4] Completed on J1 in 1.46s, 8 tests
   [junit4] 
   [junit4] Suite: org.apache.lucene.search.TestNumericRangeQuery64
   [junit4] Completed on J0 in 26.79s, 34 tests
   [junit4] 
   [junit4] Suite: org.apache.lucene.codecs.lucene3x.TestLucene3xPostingsFormat
   [junit4] Completed on J1 in 3.56s, 7 tests
   [junit4] 
   [junit4] Suite: org.apache.lucene.analysis.tokenattributes.TestCharTermAttributeImpl
   [junit4] Completed on J0 in 0.78s, 12 tests
   [junit4] 
   [junit4] Suite: org.apache.lucene.TestSearch
   [junit4] Completed on J0 in 0.08s, 2 tests
   [junit4] 
   [junit4] Suite: org.apache.lucene.search.TestQueryWrapperFilter
   [junit4] Completed on J1 in 0.52s, 3 tests
   [junit4] 
   [junit4] Suite: org.apache.lucene.util.junitcompat.TestJUnitRuleOrder
   [junit4] Completed on J1 in 0.06s, 1 test
   [junit4] 
   [junit4] Suite: org.apache.lucene.util.TestRollingBuffer
   [junit4] Completed on J1 in 0.59s, 1 test
   [junit4] 
   [junit4] Suite: org.apache.lucene.index.TestForceMergeForever
   [junit4] Completed on J1 in 1.22s, 1 test
   [junit4] 
   [junit4] Suite: org.apache.lucene.document.TestDocument
   [junit4] Completed on J1 in 0.25s, 11 tests
   [junit4] 
   [junit4] Suite: org.apache.lucene.index.TestMultiLevelSkipList
   [junit4] Completed on J1 in 0.13s, 1 test
   [junit4] 
   [junit4] Suite: org.apache.lucene.analysis.TestCharFilter
   [junit4] Completed on J1 in 0.06s, 4 tests
   [junit4] 
   [junit4] Suite: org.apache.lucene.index.TestTermsEnum2
   [junit4] Completed on J0 in 2.82s, 4 tests
   [junit4] 
   [junit4] Suite: org.apache.lucene.util.junitcompat.TestCodecReported
   [junit4] Completed on J0 in 0.03s, 1 test
   [junit4] 
   [junit4] Suite: org.apache.lucene.TestDemo
   [junit4] Completed on J0 in 0.03s, 1 test
   [junit4] 
   [junit4] Suite: org.apache.lucene.analysis.TestMockCharFilter
   [junit4] Completed on J0 in 0.02s, 1 test
   [junit4] 
   [junit4] Suite: org.apache.lucene.index.TestCrashCausesCorruptIndex
   [junit4] Completed on J0 in 0.19s, 1 test
   [junit4] 
   [junit4] Suite: org.apache.lucene.index.TestSumDocFreq
   [junit4] Completed on J1 in 0.34s, 1 test
   [junit4] 
   [junit4] Suite: org.apache.lucene.index.TestIndexInput
   [junit4] Completed on J1 in 1.06s, 3 tests
   [junit4] 
   [junit4] Suite: org.apache.lucene.search.TestBooleanQuery
   [junit4] Completed on J1 in 0.37s, 6 tests
   [junit4] 
   [junit4] Suite: org.apache.lucene.index.TestDocCount
   [junit4] Completed on J1 in 0.05s, 1 test
   [junit4] 
   [junit4] Suite: org.apache.lucene.index.TestNoMergePolicy
   [junit4] Completed on J1 in 0.03s, 4 tests
   [junit4] 
   [junit4] Suite: org.apache.lucene.search.payloads.TestPayloadExplanations
   [junit4] Completed on J1 in 0.56s, 5 tests
   [junit4] 
   [junit4] Suite: org.apache.lucene.index.TestRollingUpdates
   [junit4] Completed on J0 in 2.74s, 2 tests
   [junit4] 
   [junit4] Suite: org.apache.lucene.search.similarities.TestSimilarity2
   [junit4] Completed on J0 in 0.35s, 7 tests
   [junit4] 
   [junit4] Suite: org.apache.lucene.util.automaton.TestSpecialOperations
   [junit4] Completed on J0 in 0.66s, 2 tests
   [junit4] 
   [junit4] Suite: org.apache.lucene.index.TestIndexWriterNRTIsCurrent
   [junit4] Completed on J1 in 6.14s, 1 test
   [junit4] 
   [junit4] Suite: org.apache.lucene.search.MultiCollectorTest
   [junit4] Completed on J1 in 0.04s, 3 tests
   [junit4] 
   [junit4] Suite: org.apache.lucene.index.TestDocsAndPositions
   [junit4] Completed on J1 in 0.59s, 6 tests
   [junit4] 
   [junit4] Suite: org.apache.lucene.store.TestFileSwitchDirectory
   [junit4] Completed on J1 in 0.11s, 4 tests
   [junit4] 
   [junit4] Suite: org.apache.lucene.codecs.perfield.TestPerFieldPostingsFormat2
   [junit4] Completed on J1 in 3.16s, 5 tests
   [junit4] 
   [junit4] Suite: org.apache.lucene.index.TestTermdocPerf
   [junit4] Completed on J1 in 0.02s, 1 test
   [junit4] 
   [junit4] Suite: org.apache.lucene.util.TestIdentityHashSet
   [junit4] Completed on J1 in 0.09s, 1 test
   [junit4] 
   [junit4] Suite: org.apache.lucene.index.TestBagOfPositions
   [junit4] Completed on J0 in 20.19s, 1 test
   [junit4] 
   [junit4] Suite: org.apache.lucene.codecs.lucene40.TestLucene40StoredFieldsFormat
   [junit4] IGNOR/A 0.01s J0 | TestLucene40StoredFieldsFormat.testBigDocuments
   [junit4]    > Assumption #1: 'nightly' test group is disabled (@Nightly)
   [junit4] Completed on J0 in 2.88s, 10 tests, 1 skipped
   [junit4] 
   [junit4] Suite: org.apache.lucene.util.TestDocIdBitSet
   [junit4] Completed on J0 in 0.25s, 4 tests
   [junit4] 
   [junit4] Suite: org.apache.lucene.codecs.compressing.TestCompressingTermVectorsFormat
   [junit4] Completed on J0 in 39.71s, 40 tests
   [junit4] 
   [junit4] HEARTBEAT J1 PID(31838@serv1.sd-datasolutions.de): 2014-03-03T10:55:53, stalled for 60.9s at: TestNumericDocValuesUpdates.testTonsOfUpdates
   [junit4] Suite: org.apache.lucene.analysis.TestMockAnalyzer
   [junit4] Completed on J0 in 20.15s, 17 tests
   [junit4] 
   [junit4] Suite: org.apache.lucene.util.automaton.TestUTF32ToUTF8
   [junit4] Completed on J0 in 3.54s, 5 tests
   [junit4] 
   [junit4] Suite: org.apache.lucene.document.TestDateTools
   [junit4] Completed on J0 in 0.04s, 5 tests
   [junit4] 
   [junit4] Suite: org.apache.lucene.index.TestIndexableField
   [junit4] Completed on J0 in 1.24s, 1 test
   [junit4] 
   [junit4] Suite: org.apache.lucene.index.TestStressNRT
   [junit4] Completed on J0 in 2.86s, 1 test
   [junit4] 
   [junit4] Suite: org.apache.lucene.util.TestBroadWord
   [junit4] Completed on J0 in 0.45s, 11 tests
   [junit4] 
   [junit4] Suite: org.apache.lucene.index.TestIndexCommit
   [junit4] Completed on J0 in 0.01s, 1 test
   [junit4] 
   [junit4] Suite: org.apache.lucene.index.TestNRTThreads
   [junit4] Completed on J0 in 7.77s, 1 test
   [junit4] 
   [junit4] Suite: org.apache.lucene.index.TestDocTermOrds
   [junit4] Completed on J0 in 0.82s, 5 tests
   [junit4] 
   [junit4] Suite: org.apache.lucene.search.TestFilteredSearch
   [junit4] Completed on J0 in 0.03s, 1 test
   [junit4] 
   [junit4] Suite: org.apache.lucene.util.TestFilterIterator
   [junit4] Completed on J0 in 0.07s, 8 tests
   [junit4] 
   [junit4] Suite: org.apache.lucene.index.TestPayloads
   [junit4] Completed on J0 in 0.59s, 7 tests
   [junit4] 
   [junit4] Suite: org.apache.lucene.search.TestSameScoresWithThreads
   [junit4] Completed on J0 in 1.04s, 1 test
   [junit4] 
   [junit4] Suite: org.apache.lucene.util.TestRecyclingByteBlockAllocator
   [junit4] Completed on J0 in 0.10s, 3 tests
   [junit4] 
   [junit4] Suite: org.apache.lucene.index.TestMultiFields
   [junit4] Completed on J0 in 2.27s, 3 tests
   [junit4] 
   [junit4] Suite: org.apache.lucene.util.automaton.TestDeterminizeLexicon
   [junit4] Completed on J0 in 2.31s, 1 test
   [junit4] 
   [junit4] Suite: org.apache.lucene.index.TestStressIndexing
   [junit4] Completed on J0 in 3.33s, 1 test
   [junit4] 
   [junit4] Suite: org.apache.lucene.index.TestIndexWriterReader
   [junit4] Completed on J0 in 8.53s, 23 tests
   [junit4] 
   [junit4] Suite: org.apache.lucene.util.automaton.TestDeterminism
   [junit4] Completed on J0 in 0.62s, 2 tests
   [junit4] 
   [junit4] Suite: org.apache.lucene.search.TestPrefixFilter
   [junit4] Completed on J0 in 0.02s, 1 test
   [junit4] 
   [junit4] Suite: org.apache.lucene.search.TestSimilarityProvider
   [junit4] Completed on J0 in 0.03s, 1 test
   [junit4] 
   [junit4] Suite: org.apache.lucene.index.TestIndexWriterOnDiskFull
   [junit4] Completed on J0 in 0.83s, 4 tests
   [junit4] 
   [junit4] Suite: org.apache.lucene.codecs.lucene40.TestLucene40PostingsReader
   [junit4] Completed on J0 in 3.19s, 1 test
   [junit4] 
   [junit4] Suite: org.apache.lucene.search.TestMultiPhraseQuery
   [junit4] Completed on J0 in 0.57s, 17 tests, 1 skipped
   [junit4] 
   [junit4] Suite: org.apache.lucene.codecs.lucene40.TestLucene40PostingsFormat
   [junit4] Completed on J0 in 3.68s, 7 tests
   [junit4] 
   [junit4] Suite: org.apache.lucene.codecs.lucene3x.TestImpersonation
   [junit4] Completed on J0 in 0.01s, 1 test
   [junit4] 
   [junit4] HEARTBEAT J1 PID(31838@serv1.sd-datasolutions.de): 2014-03-03T10:56:53, stalled for  121s at: TestNumericDocValuesUpdates.testTonsOfUpdates
   [junit4] Suite: org.apache.lucene.index.TestByteSlices
   [junit4] Completed on J0 in 5.48s, 1 test
   [junit4] 
   [junit4] Suite: org.apache.lucene.codecs.lucene41.TestBlockPostingsFormat3
   [junit4] Completed on J0 in 6.83s, 1 test
   [junit4] 
   [junit4] Suite: org.apache.lucene.index.TestConcurrentMergeScheduler
   [junit4] Completed on J0 in 3.34s, 6 tests
   [junit4] 
   [junit4] Suite: org.apache.lucene.util.fst.Test2BFST
   [junit4] Completed on J0 in 0.00s, 0 tests
   [junit4] 
   [junit4] Suite: org.apache.lucene.store.TestLock
   [junit4] Completed on J0 in 0.03s, 1 test
   [junit4] 
   [junit4] Suite: org.apache.lucene.index.TestIndexWriter
   [junit4] Completed on J0 in 28.34s, 59 tests
   [junit4] 
   [junit4] HEARTBEAT J1 PID(31838@serv1.sd-datasolutions.de): 2014-03-03T10:57:53, stalled for  181s at: TestNumericDocValuesUpdates.testTonsOfUpdates
   [junit4] Suite: org.apache.lucene.codecs.perfield.TestPerFieldDocValuesFormat
   [junit4] IGNOR/A 0.01s J0 | TestPerFieldDocValuesFormat.testHugeBinaryValueLimit
   [junit4]    > Assumption #1: test requires codec with limits on max binary field length
   [junit4] Completed on J0 in 27.96s, 79 tests, 1 skipped
   [junit4] 
   [junit4] Suite: org.apache.lucene.index.TestNumericDocValuesUpdates
   [junit4] Completed on J1 in 210.53s, 31 tests
   [junit4] 
   [junit4] Suite: org.apache.lucene.index.TestDocValuesFormat
   [junit4] IGNOR/A 0.00s J0 | TestDocValuesFormat.testHugeBinaryValueLimit
   [junit4]    > Assumption #1: test requires codec with limits on max binary field length
   [junit4] Completed on J0 in 19.90s, 78 tests, 1 skipped
   [junit4] 
   [junit4] Suite: org.apache.lucene.index.TestThreadedForceMerge
   [junit4] Completed on J1 in 0.84s, 1 test
   [junit4] 
   [junit4] Suite: org.apache.lucene.search.TestSearchWithThreads
   [junit4] Completed on J1 in 4.24s, 1 test
   [junit4] 
   [junit4] Suite: org.apache.lucene.index.TestTermVectorsFormat
   [junit4] Completed on J0 in 11.02s, 7 tests
   [junit4] 
   [junit4] Suite: org.apache.lucene.index.TestIndexWriterExceptions
   [junit4] Completed on J1 in 16.35s, 27 tests
   [junit4] 
   [junit4] Suite: org.apache.lucene.util.junitcompat.TestLeaveFilesIfTestFails
   [junit4] Completed on J1 in 0.02s, 1 test
   [junit4] 
   [junit4] Suite: org.apache.lucene.search.TestBooleanQueryVisitSubscorers
   [junit4] Completed on J1 in 0.03s, 3 tests
   [junit4] 
   [junit4] Suite: org.apache.lucene.search.similarities.TestSimilarityBase
   [junit4] Completed on J1 in 0.76s, 30 tests
   [junit4] 
   [junit4] Suite: org.apache.lucene.util.TestRecyclingIntBlockAllocator
   [junit4] Completed on J1 in 0.41s, 3 tests
   [junit4] 
   [junit4] Suite: org.apache.lucene.search.TestMinShouldMatch2
   [junit4] Completed on J1 in 2.52s, 6 tests
   [junit4] 
   [junit4] Suite: org.apache.lucene.util.TestAttributeSource
   [junit4] Completed on J1 in 0.02s, 5 tests
   [junit4] 
   [junit4] Suite: org.apache.lucene.util.TestDoubleBarrelLRUCache
   [junit4] Completed on J1 in 1.02s, 2 tests
   [junit4] 
   [junit4] Suite: org.apache.lucene.search.spans.TestPayloadSpans
   [junit4] Completed on J1 in 0.46s, 10 tests
   [junit4] 
   [junit4] Suite: org.apache.lucene.index.TestFilterAtomicReader
   [junit4] Completed on J1 in 0.05s, 2 tests
   [junit4] 
   [junit4] Suite: org.apache.lucene.TestAssertions
   [junit4] Completed on J1 in 0.03s, 1 test
   [junit4] 
   [junit4] Suite: org.apache.lucene.util.TestCollectionUtil
   [junit4] Completed on J1 in 8.16s, 4 tests
   [junit4] 
   [junit4] Suite: org.apache.lucene.search.TestBooleanScorer
   [junit4] Completed on J1 in 0.02s, 3 tests
   [junit4] 
   [junit4] Suite: org.apache.lucene.index.TestDirectoryReaderReopen
   [junit4] Completed on J1 in 1.92s, 6 tests
   [junit4] 
   [junit4] Suite: org.apache.lucene.util.fst.TestFSTs
   [junit4] IGNOR/A 0.00s J0 | TestFSTs.testBigSet
   [junit4]    > Assumption #1: 'nightly' test group is disabled (@Nightly)
   [junit4] Completed on J0 in 26.86s, 18 tests, 1 skipped
   [junit4] 
   [junit4] Suite: org.apache.lucene.index.TestLongPostings
   [junit4] Completed on J1 in 3.36s, 2 tests
   [junit4] 
   [junit4] Suite: org.apache.lucene.index.TestMultiDocValues
   [junit4] Completed on J1 in 3.08s, 7 tests
   [junit4] 
   [junit4] Suite: org.apache.lucene.store.TestWindowsMMap
   [junit4] Completed on J1 in 0.19s, 1 test
   [junit4] 
   [junit4] Suite: org.apache.lucene.util.junitcompat.TestBeforeAfterOverrides
   [junit4] Completed on J1 in 0.02s, 2 tests
   [junit4] 
   [junit4] Suite: org.apache.lucene.util.TestCharsRef
   [junit4] Completed on J1 in 0.06s, 8 tests
   [junit4] 
   [junit4] Suite: org.apache.lucene.util.fst.TestBytesStore
   [junit4] Completed on J0 in 11.65s, 1 test
   [junit4] 
   [junit4] Suite: org.apache.lucene.search.TestNumericRangeQuery32
   [junit4] Completed on J0 in 5.20s, 27 tests
   [junit4] 
   [junit4] Suite: org.apache.lucene.analysis.TestGraphTokenizers
   [junit4] Completed on J1 in 21.29s, 21 tests
   [junit4] 
   [junit4] Suite: org.apache.lucene.store.TestMockDirectoryWrapper
   [junit4] Completed on J1 in 0.08s, 3 tests
   [junit4] 
   [junit4] Suite: org.apache.lucene.index.TestParallelCompositeReader
   [junit4] Completed on J1 in 1.04s, 13 tests
   [junit4] 
   [junit4] Suite: org.apache.lucene.util.TestSloppyMath
   [junit4] Completed on J1 in 0.21s, 3 tests
   [junit4] 
   [junit4] Suite: org.apache.lucene.analysis.TestLookaheadTokenFilter
   [junit4] Completed on J0 in 10.57s, 3 tests
   [junit4] 
   [junit4] Suite: org.apache.lucene.search.TestSimpleSearchEquivalence
   [junit4] Completed on J1 in 0.74s, 12 tests
   [junit4] 
   [junit4] Suite: org.apache.lucene.search.TestTermScorer
   [junit4] Completed on J1 in 0.10s, 3 tests
   [junit4] 
   [junit4] Suite: org.apache.lucene.util.TestIOUtils
   [junit4] Completed on J1 in 0.05s, 1 test
   [junit4] 
   [junit4] Suite: org.apache.lucene.store.TestFilterDirectory
   [junit4] Completed on J1 in 0.01s, 1 test
   [junit4] 
   [junit4] Suite: org.apache.lucene.index.TestTransactions
   [junit4] Completed on J1 in 1.68s, 1 test
   [junit4] 
   [junit4] Suite: org.apache.lucene.index.TestAddIndexes
   [junit4] Completed on J0 in 5.07s, 23 tests
   [junit4] 
   [junit4] Suite: org.apache.lucene.search.TestShardSearching
   [junit4] Completed on J0 in 13.46s, 1 test
   [junit4] 
   [junit4] Suite: org.apache.lucene.codecs.compressing.TestCompressingStoredFieldsFormat
   [junit4] IGNOR/A 0.00s J1 | TestCompressingStoredFieldsFormat.testBigDocuments {#0 seed=[FB340CBF6EC2745E:A1E56E0DDEEDA79]}
   [junit4]    > Assumption #1: 'nightly' test group is disabled (@Nightly)
   [junit4] IGNOR/A 0.02s J1 | TestCompressingStoredFieldsFormat.testBigDocuments {#1 seed=[FB340CBF6EC2745E:BE48EA1CE92C1155]}
   [junit4]    > Assumption #1: 'nightly' test group is disabled (@Nightly)
   [junit4] IGNOR/A 0.00s J1 | TestCompressingStoredFieldsFormat.testBigDocuments {#2 seed=[FB340CBF6EC2745E:30A17CC0B8E8599E]}
   [junit4]    > Assumption #1: 'nightly' test group is disabled (@Nightly)
   [junit4] IGNOR/A 0.00s J1 | TestCompressingStoredFieldsFormat.testBigDocuments {#3 seed=[FB340CBF6EC2745E:14FD725D41602B7]}
   [junit4]    > Assumption #1: 'nightly' test group is disabled (@Nightly)
   [junit4] IGNOR/A 0.00s J1 | TestCompressingStoredFieldsFormat.testBigDocuments {#4 seed=[FB340CBF6EC2745E:4D8E5288751EC20C]}
   [junit4]    > Assumption #1: 'nightly' test group is disabled (@Nightly)
   [junit4] Completed on J1 in 20.23s, 55 tests, 5 skipped
   [junit4] 
   [junit4] Suite: org.apache.lucene.util.TestByteBlockPool
   [junit4] Completed on J1 in 0.05s, 1 test
   [junit4] 
   [junit4] Suite: org.apache.lucene.search.TestSearcherManager
   [junit4] Completed on J0 in 7.29s, 8 tests
   [junit4] 
   [junit4] Suite: org.apache.lucene.index.TestDeletionPolicy
   [junit4] Completed on J1 in 4.49s, 6 tests
   [junit4] 
   [junit4] Suite: org.apache.lucene.search.TestSloppyPhraseQuery
   [junit4] Completed on J0 in 3.73s, 9 tests
   [junit4] 
   [junit4] Suite: org.apache.lucene.index.TestIndexWriterDelete
   [junit4] IGNOR/A 0.00s J1 | TestIndexWriterDelete.testApplyDeletesOnFlush
   [junit4]    > Assumption #1: 'nightly' test group is disabled (@Nightly)
   [junit4] Completed on J1 in 9.36s, 22 tests, 1 skipped
   [junit4] 
   [junit4] Suite: org.apache.lucene.codecs.lucene40.TestLucene40DocValuesFormat
   [junit4] IGNOR/A 0.00s J0 | TestLucene40DocValuesFormat.testSortedSetTwoFields
   [junit4]    > Assumption #1: Codec does not support SORTED_SET
   [junit4] IGNOR/A 0.00s J0 | TestLucene40DocValuesFormat.testSortedSetFixedLengthVsStoredFields
   [junit4]    > Assumption #1: Codec does not support SORTED_SET
   [junit4] IGNOR/A 0.00s J0 | TestLucene40DocValuesFormat.testSortedSetFixedLengthSingleValuedVsStoredFields
   [junit4]    > Assumption #1: Codec does not support SORTED_SET
   [junit4] IGNOR/A 0.00s J0 | TestLucene40DocValuesFormat.testByteMissingVsFieldCache
   [junit4]    > Assumption #1: Codec does not support getDocsWithField
   [junit4] IGNOR/A 0.00s J0 | TestLucene40DocValuesFormat.testSortedSetTwoValuesUnordered
   [junit4]    > Assumption #1: Codec does not support SORTED_SET
   [junit4] IGNOR/A 0.00s J0 | TestLucene40DocValuesFormat.testSortedSetVariableLengthVsUninvertedField
   [junit4]    > Assumption #1: Codec does not support SORTED_SET
   [junit4] IGNOR/A 0.00s J0 | TestLucene40DocValuesFormat.testTwoNumbersOneMissing
   [junit4]    > Assumption #1: Codec does not support getDocsWithField
   [junit4] IGNOR/A 0.00s J0 | TestLucene40DocValuesFormat.testTwoNumbersOneMissingWithMerging
   [junit4]    > Assumption #1: Codec does not support getDocsWithField
   [junit4] IGNOR/A 0.01s J0 | TestLucene40DocValuesFormat.testSortedSetTwoDocumentsLastMissingMerge
   [junit4]    > Assumption #1: Codec does not support SORTED_SET
   [junit4] IGNOR/A 0.00s J0 | TestLucene40DocValuesFormat.testTwoBytesOneMissing
   [junit4]    > Assumption #1: Codec does not support getDocsWithField
   [junit4] IGNOR/A 0.00s J0 | TestLucene40DocValuesFormat.testShortMissingVsFieldCache
   [junit4]    > Assumption #1: Codec does not support getDocsWithField
   [junit4] IGNOR/A 0.01s J0 | TestLucene40DocValuesFormat.testSortedSetMergeAwayAllValues
   [junit4]    > Assumption #1: Codec does not support SORTED_SET
   [junit4] IGNOR/A 0.00s J0 | TestLucene40DocValuesFormat.testSortedSetTwoDocumentsMerged
   [junit4]    > Assumption #1: Codec does not support SORTED_SET
   [junit4] IGNOR/A 0.00s J0 | TestLucene40DocValuesFormat.testSortedSetTwoDocumentsFirstMissing
   [junit4]    > Assumption #1: Codec does not support SORTED_SET
   [junit4] IGNOR/A 0.00s J0 | TestLucene40DocValuesFormat.testThreads2
   [junit4]    > Assumption #1: Codec does not support getDocsWithField
   [junit4] IGNOR/A 0.00s J0 | TestLucene40DocValuesFormat.testThreeNumbersOneMissingWithMerging
   [junit4]    > Assumption #1: Codec does not support getDocsWithField
   [junit4] IGNOR/A 0.00s J0 | TestLucene40DocValuesFormat.testSortedSetTermsEnum
   [junit4]    > Assumption #1: Codec does not support SORTED_SET
   [junit4] IGNOR/A 0.00s J0 | TestLucene40DocValuesFormat.testSortedSetVariableLengthSingleValuedVsStoredFields
   [junit4]    > Assumption #1: Codec does not support SORTED_SET
   [junit4] IGNOR/A 0.00s J0 | TestLucene40DocValuesFormat.testSortedSetOneValue
   [junit4]    > Assumption #1: Codec does not support SORTED_SET
   [junit4] IGNOR/A 0.00s J0 | TestLucene40DocValuesFormat.testIntMissingVsFieldCache
   [junit4]    > Assumption #1: Codec does not support getDocsWithField
   [junit4] IGNOR/A 0.00s J0 | TestLucene40DocValuesFormat.testSortedSetThreeValuesTwoDocs
   [junit4]    > Assumption #1: Codec does not support SORTED_SET
   [junit4] IGNOR/A 0.00s J0 | TestLucene40DocValuesFormat.testSortedSetTwoDocumentsLastMissing
   [junit4]    > Assumption #1: Codec does not support SORTED_SET
   [junit4] IGNOR/A 0.00s J0 | TestLucene40DocValuesFormat.testTwoBytesOneMissingWithMerging
   [junit4]    > Assumption #1: Codec does not support getDocsWithField
   [junit4] IGNOR/A 0.00s J0 | TestLucene40DocValuesFormat.testSortedSetTwoValues
   [junit4]    > Assumption #1: Codec does not support SORTED_SET
   [junit4] IGNOR/A 0.00s J0 | TestLucene40DocValuesFormat.testSortedSetTwoDocumentsFirstMissingMerge
   [junit4]    > Assumption #1: Codec does not support SORTED_SET
   [junit4] IGNOR/A 0.00s J0 | TestLucene40DocValuesFormat.testThreeBytesOneMissingWithMerging
   [junit4]    > Assumption #1: Codec does not support getDocsWithField
   [junit4] IGNOR/A 0.00s J0 | TestLucene40DocValuesFormat.testSortedSetVariableLengthVsStoredFields
   [junit4]    > Assumption #1: Codec does not support SORTED_SET
   [junit4] IGNOR/A 0.00s J0 | TestLucene40DocValuesFormat.testLongMissingVsFieldCache
   [junit4]    > Assumption #1: Codec does not support getDocsWithField
   [junit4] IGNOR/A 0.00s J0 | TestLucene40DocValuesFormat.testSortedSetFixedLengthVsUninvertedField
   [junit4]    > Assumption #1: Codec does not support SORTED_SET
   [junit4] Completed on J0 in 9.08s, 78 tests, 29 skipped
   [junit4] 
   [junit4] Suite: org.apache.lucene.index.TestIndexWriterMergePolicy
   [junit4] Completed on J1 in 3.19s, 7 tests
   [junit4] 
   [junit4] Suite: org.apache.lucene.search.TestBoolean2
   [junit4] Completed on J1 in 6.91s, 11 tests
   [junit4] 
   [junit4] Suite: org.apache.lucene.index.TestDuelingCodecs
   [junit4] Completed on J0 in 7.36s, 1 test
   [junit4] 
   [junit4] Suite: org.apache.lucene.index.TestStressAdvance
   [junit4] Completed on J0 in 1.43s, 1 test
   [junit4] 
   [junit4] Suite: org.apache.lucene.index.TestNorms
   [junit4] Completed on J0 in 0.72s, 2 tests
   [junit4] 
   [junit4] Suite: org.apache.lucene.index.TestIndexWriterCommit
   [junit4] Completed on J0 in 2.37s, 12 tests
   [junit4] 
   [junit4] Suite: org.apache.lucene.index.TestAtomicUpdate
   [junit4] Completed on J1 in 5.10s, 1 test
   [junit4] 
   [junit4] Suite: org.apache.lucene.search.TestTimeLimitingCollector
   [junit4] Completed on J0 in 3.86s, 6 tests
   [junit4] 
   [junit4] Suite: org.apache.lucene.util.TestOpenBitSet
   [junit4] Completed on J0 in 25.14s, 9 tests
   [junit4] 
   [junit4] Suite: org.apache.lucene.index.TestDocumentsWriterStallControl
   [junit4] Completed on J0 in 16.89s, 3 tests
   [junit4] 
   [junit4] Suite: org.apache.lucene.index.TestNeverDelete
   [junit4] Completed on J0 in 5.91s, 1 test
   [junit4] 
   [junit4] Suite: org.apache.lucene.search.TestTopDocsMerge
   [junit4] Completed on J0 in 10.96s, 1 test
   [junit4] 
   [junit4] Suite: org.apache.lucene.index.TestCompoundFile
   [junit4] Completed on J0 in 1.15s, 18 tests
   [junit4] 
   [junit4] Suite: org.apache.lucene.util.automaton.TestMinimize
   [junit4] Completed on J0 in 2.14s, 3 tests
   [junit4] 
   [junit4] HEARTBEAT J1 PID(31838@serv1.sd-datasolutions.de): 2014-03-03T11:01:29, stalled for 67.4s at: TestSearchAfter.testQueries
   [junit4] Suite: org.apache.lucene.codecs.lucene41.TestBlockPostingsFormat2
   [junit4] Completed on J0 in 1.62s, 4 tests
   [junit4] 
   [junit4] Suite: org.apache.lucene.search.TestSearchAfter
   [junit4] Completed on J1 in 71.69s, 1 test
   [junit4] 
   [junit4] Suite: org.apache.lucene.index.TestSnapshotDeletionPolicy
   [junit4] Completed on J1 in 1.54s, 7 tests
   [junit4] 
   [junit4] Suite: org.apache.lucene.index.TestIndexWriterUnicode
   [junit4] Completed on J1 in 4.33s, 5 tests
   [junit4] 
   [junit4] Suite: org.apache.lucene.search.TestDocTermOrdsRewriteMethod
   [junit4] Completed on J0 in 11.39s, 2 tests
   [junit4] 
   [junit4] Suite: org.apache.lucene.index.TestNRTReaderWithThreads
   [junit4] Completed on J1 in 1.70s, 1 test
   [junit4] 
   [junit4] Suite: org.apache.lucene.store.TestBufferedIndexInput
   [junit4] Completed on J1 in 0.26s, 4 tests
   [junit4] 
   [junit4] Suite: org.apache.lucene.util.automaton.TestLevenshteinAutomata
   [junit4] Completed on J0 in 0.90s, 4 tests
   [junit4] 
   [junit4] Suite: org.apache.lucene.index.TestConsistentFieldNumbers
   [junit4] Completed on J0 in 3.20s, 4 tests
   [junit4] 
   [junit4] Suite: org.apache.lucene.index.TestTermsEnum
   [junit4] Completed on J1 in 8.30s, 9 tests
   [junit4] 
   [junit4] Suite: org.apache.lucene.search.TestSimpleExplanations
   [junit4] Completed on J1 in 2.04s, 69 tests
   [junit4] 
   [junit4] Suite: org.apache.lucene.index.TestDirectoryReader
   [junit4] Completed on J1 in 1.62s, 27 tests
   [junit4] 
   [junit4] Suite: org.apache.lucene.search.TestDocTermOrdsRangeFilter
   [junit4] Completed on J1 in 1.31s, 1 test
   [junit4] 
   [junit4] Suite: org.apache.lucene.util.TestWeakIdentityMap
   [junit4] Completed on J0 in 11.22s, 2 tests
   [junit4] 
   [junit4] Suite: org.apache.lucene.store.TestLockFactory
   [junit4] IGNOR/A 0.00s J1 | TestLockFactory.testStressLocksNativeFSLockFactory
   [junit4]    > Assumption #1: 'nightly' test group is disabled (@Nightly)
   [junit4] IGNOR/A 0.00s J1 | TestLockFactory.testStressLocks
   [junit4]    > Assumption #1: 'nightly' test group is disabled (@Nightly)
   [junit4] Completed on J1 in 1.03s, 11 tests, 2 skipped
   [junit4] 
   [junit4] Suite: org.apache.lucene.index.TestSegmentMerger
   [junit4] Completed on J0 in 0.50s, 3 tests
   [junit4] 
   [junit4] Suite: org.apache.lucene.index.TestOmitNorms
   [junit4] Completed on J1 in 0.70s, 5 tests
   [junit4] 
   [junit4] Suite: org.apache.lucene.search.TestComplexExplanations
   [junit4] Completed on J1 in 0.77s, 22 tests
   [junit4] 
   [junit4] Suite: org.apache.lucene.search.TestRegexpRandom2
   [junit4] Completed on J1 in 3.40s, 1 test
   [junit4] 
   [junit4] Suite: org.apache.lucene.index.TestSegmentReader
   [junit4] Completed on J1 in 0.57s, 7 tests
   [junit4] 
   [junit4] Suite: org.apache.lucene.codecs.compressing.TestFastDecompressionMode
   [junit4] Completed on J1 in 2.25s, 11 tests
   [junit4] 
   [junit4] Suite: org.apache.lucene.search.TestFieldCacheRewriteMethod
   [junit4] Completed on J1 in 1.46s, 2 tests
   [junit4] 
   [junit4] Suite: org.apache.lucene.util.TestFixedBitSet
   [junit4] Completed on J0 in 14.45s, 11 tests
   [junit4] 
   [junit4] Suite: org.apache.lucene.index.TestCrash
   [junit4] Completed on J0 in 0.83s, 5 tests
   [junit4] 
   [junit4] Suite: org.apache.lucene.search.TestMultiThreadTermVectors
   [junit4] Completed on J0 in 0.50s, 1 test
   [junit4] 
   [junit4] Suite: org.apache.lucene.codecs.lucene41.TestBlockPostingsFormat
   [junit4] Completed on J0 in 0.58s, 7 tests
   [junit4] 
   [junit4] Suite: org.apache.lucene.search.TestSort
   [junit4] Completed on J0 in 0.68s, 53 tests
   [junit4] 
   [junit4] Suite: org.apache.lucene.codecs.lucene40.TestReuseDocsEnum
   [junit4] Completed on J0 in 1.11s, 3 tests
   [junit4] 
   [junit4] Suite: org.apache.lucene.analysis.TestToken
   [junit4] Completed on J0 in 0.83s, 10 tests
   [junit4] 
   [junit4] Suite: org.apache.lucene.index.TestDocValuesIndexing
   [junit4] Completed on J0 in 0.62s, 30 tests
   [junit4] 
   [junit4] Suite: org.apache.lucene.search.TestBooleanMinShouldMatch
   [junit4] Completed on J0 in 1.64s, 17 tests
   [junit4] 
   [junit4] Suite: org.apache.lucene.util.TestNumericUtils
   [junit4] Completed on J0 in 2.58s, 12 tests
   [junit4] 
   [junit4] Suite: org.apache.lucene.util.TestPagedBytes
   [junit4] Completed on J1 in 18.91s, 3 tests, 1 skipped
   [junit4] 
   [junit4] Suite: org.apache.lucene.search.TestFieldCache
   [junit4] Completed on J0 in 3.91s, 10 tests
   [junit4] 
   [junit4] Suite: org.apache.lucene.index.TestPostingsOffsets
   [junit4] Completed on J1 in 1.62s, 11 tests
   [junit4] 
   [junit4] Suite: org.apache.lucene.index.TestTransactionRollback
   [junit4] Completed on J1 in 0.29s, 2 tests
   [junit4] 
   [junit4] Suite: org.apache.lucene.index.TestFlex
   [junit4] Completed on J1 in 0.11s, 2 tests
   [junit4] 
   [junit4] Suite: org.apache.lucene.index.TestMixedCodecs
   [junit4] Completed on J0 in 2.44s, 1 test
   [junit4] 
   [junit4] Suite: org.apache.lucene.search.TestSortDocValues
   [junit4] Completed on J1 in 0.42s, 27 tests
   [junit4] 
   [junit4] Suite: org.apache.lucene.util.TestMaxFailuresRule
   [junit4] Completed on J1 in 0.57s, 1 test
   [junit4] 
   [junit4] Suite: org.apache.lucene.codecs.compressing.TestFastCompressionMode
   [junit4] Completed on J0 in 1.40s, 11 tests
   [junit4] 
   [junit4] Suite: org.apache.lucene.index.TestStressIndexing2
   [junit4] Completed on J1 in 0.54s, 3 tests
   [junit4] 
   [junit4] Suite: org.apache.lucene.store.TestRAMDirectory
   [junit4] Completed on J0 in 0.26s, 4 tests
   [junit4] 
   [junit4] Suite: org.apache.lucene.util.TestRamUsageEstimatorOnWildAnimals
   [junit4] Completed on J1 in 0.63s, 1 test
   [junit4] 
   [junit4] Suite: org.apache.lucene.index.TestTermVectorsWriter
   [junit4] Completed on J1 in 0.28s, 13 tests
   [junit4] 
   [junit4] Suite: org.apache.lucene.index.TestBagOfPostings
   [junit4] Completed on J0 in 0.94s, 1 test
   [junit4] 
   [junit4] Suite: org.apache.lucene.index.TestOmitPositions
   [junit4] Completed on J0 in 0.21s, 4 tests
   [junit4] 
   [junit4] Suite: org.apache.lucene.index.TestCodecs
   [junit4] Completed on J1 in 0.36s, 5 tests
   [junit4] 
   [junit4] Suite: org.apache.lucene.search.TestFilteredQuery
   [junit4] Completed on J1 in 0.38s, 12 tests
   [junit4] 
   [junit4] Suite: org.apache.lucene.store.TestCopyBytes
   [junit4] Completed on J0 in 0.52s, 2 tests
   [junit4] 
   [junit4] Suite: org.apache.lucene.search.TestDisjunctionMaxQuery
   [junit4] Completed on J0 in 0.41s, 11 tests
   [junit4] 
   [junit4] Suite: org.apache.lucene.index.TestOmitTf
   [junit4] Completed on J0 in 0.56s, 6 tests
   [junit4] 
   [junit4] Suite: org.apache.lucene.search.TestTermRangeQuery
   [junit4] Completed on J0 in 0.16s, 7 tests
   [junit4] 
   [junit4] Suite: org.apache.lucene.index.TestDocumentsWriterDeleteQueue
   [junit4] Completed on J0 in 0.36s, 5 tests
   [junit4] 
   [junit4] Suite: org.apache.lucene.search.payloads.TestPayloadNearQuery
   [junit4] Completed on J0 in 0.47s, 7 tests
   [junit4] 
   [junit4] Suite: org.apache.lucene.index.TestDocumentWriter
   [junit4] Completed on J0 in 0.22s, 7 tests
   [junit4] 
   [junit4] Suite: org.apache.lucene.search.TestSloppyPhraseQuery2
   [junit4] Completed on J1 in 3.47s, 9 tests
   [junit4] 
   [junit4] Suite: org.apache.lucene.search.TestMultiTermConstantScore
   [junit4] Completed on J1 in 0.47s, 8 tests
   [junit4] 
   [junit4] Suite: org.apache.lucene.index.TestForTooMuchCloning
   [junit4] Completed on J1 in 0.11s, 1 test
   [junit4] 
   [junit4] Suite: org.apache.lucene.search.TestFuzzyQuery
   [junit4] Completed on J1 in 0.20s, 6 tests
   [junit4] 
   [junit4] Suite: org.apache.lucene.search.TestWildcard
   [junit4] Completed on J1 in 0.15s, 8 tests
   [junit4] 
   [junit4] Suite: org.apache.lucene.search.TestTermRangeFilter
   [junit4] Completed on J1 in 0.26s, 3 tests
   [junit4] 
   [junit4] Suite: org.apache.lucene.search.spans.TestFieldMaskingSpanQuery
   [junit4] Completed on J1 in 0.30s, 11 tests
   [junit4] 
   [junit4] Suite: org.apache.lucene.TestExternalCodecs
   [junit4] Completed on J1 in 0.27s, 1 test
   [junit4] 
   [junit4] Suite: org.apache.lucene.index.TestTermVectorsReader
   [junit4] Completed on J1 in 0.16s, 6 tests
   [junit4] 
   [junit4] Suite: org.apache.lucene.search.spans.TestSpansAdvanced2
   [junit4] Completed on J1 in 0.17s, 4 tests
   [junit4] 
   [junit4] Suite: org.apache.lucene.index.TestPerSegmentDeletes
   [junit4] Completed on J1 in 0.07s, 1 test
   [junit4] 
   [junit4] Suite: org.apache.lucene.search.TestMultiValuedNumericRangeQuery
   [junit4] Completed on J1 in 0.72s, 1 test
   [junit4] 
   [junit4] Suite: org.apache.lucene.index.TestIntBlockPool
   [junit4] Completed on J1 in 0.47s, 2 tests
   [junit4] 
   [junit4] Suite: org.apache.lucene.index.TestSegmentTermEnum
   [junit4] Completed on J1 in 0.03s, 2 tests
   [junit4] 
   [junit4] Suite: org.apache.lucene.index.TestUniqueTermCount
   [junit4] Completed on J1 in 0.03s, 1 test
   [junit4] 
   [junit4] Suite: org.apache.lucene.util.TestUnicodeUtil
   [junit4] Completed on J1 in 0.50s, 4 tests
   [junit4] 
   [junit4] Suite: org.apache.lucene.index.TestPrefixCodedTerms
   [junit4] Completed on J1 in 0.24s, 5 tests
   [junit4] 
   [junit4] Suite: org.apache.lucene.search.TestAutomatonQuery
   [junit4] Completed on J1 in 0.05s, 6 tests
   [junit4] 
   [junit4] Suite: org.apache.lucene.index.TestParallelReaderEmptyIndex
   [junit4] Completed on J1 in 0.03s, 2 tests
   [junit4] 
   [junit4] Suite: org.apache.lucene.codecs.lucene41.TestForUtil
   [junit4] Completed on J1 in 0.08s, 1 test
   [junit4] 
   [junit4] Suite: org.apache.lucene.index.TestMaxTermFrequency
   [junit4] Completed on J1 in 0.15s, 1 test
   [junit4] 
   [junit4] Suite: org.apache.lucene.search.TestDocValuesScoring
   [junit4] Completed on J1 in 0.10s, 1 test
   [junit4] 
   [junit4] Suite: org.apache.lucene.search.TestWildcardRandom
   [junit4] Completed on J1 in 0.09s, 1 test
   [junit4] 
   [junit4] Suite: org.apache.lucene.search.TestPrefixRandom
   [junit4] Completed on J1 in 1.44s, 1 test
   [junit4] 
   [junit4] Suite: org.apache.lucene.index.TestCheckIndex
   [junit4] Completed on J1 in 0.09s, 3 tests
   [junit4] 
   [junit4] Suite: org.apache.lucene.index.TestPayloadsOnVectors
   [junit4] Completed on J1 in 0.08s, 3 tests
   [junit4] 
   [junit4] Suite: org.apache.lucene.search.TestCachingWrapperFilter
   [junit4] Completed on J1 in 0.29s, 11 tests
   [junit4] 
   [junit4] Suite: org.apache.lucene.util.junitcompat.TestExceptionInBeforeClassHooks
   [junit4] Completed on J1 in 0.16s, 3 tests
   [junit4] 
   [junit4] Suite: org.apache.lucene.search.spans.TestSpanMultiTermQueryWrapper
   [junit4] Completed on J1 in 0.13s, 8 tests
   [junit4] 
   [junit4] Suite: org.apache.lucene.TestSearchForDuplicates
   [junit4] Completed on J1 in 0.09s, 1 test
   [junit4] 
   [junit4] Suite: org.apache.lucene.util.junitcompat.TestSystemPropertiesInvariantRule
   [junit4] Completed on J1 in 0.10s, 5 tests
   [junit4] 
   [junit4] Suite: org.apache.lucene.index.TestSizeBoundedForceMerge
   [junit4] Completed on J1 in 0.06s, 11 tests
   [junit4] 
   [junit4] Suite: org.apache.lucene.index.TestIndexFileDeleter
   [junit4] Completed on J1 in 0.03s, 1 test
   [junit4] 
   [junit4] Suite: org.apache.lucene.search.TestPrefixQuery
   [junit4] Completed on J1 in 0.06s, 1 test
   [junit4] 
   [junit4] Suite: org.apache.lucene.index.TestDocValuesWithThreads
   [junit4] Completed on J1 in 0.10s, 2 tests
   [junit4] 
   [junit4] Suite: org.apache.lucene.search.TestDocIdSet
   [junit4] Completed on J1 in 0.02s, 3 tests
   [junit4] 
   [junit4] Suite: org.apache.lucene.search.TestElevationComparator
   [junit4] Completed on J1 in 0.07s, 1 test
   [junit4] 
   [junit4] Suite: org.apache.lucene.index.TestBinaryTerms
   [junit4] Completed on J1 in 0.14s, 2 tests
   [junit4] 
   [junit4] Suite: org.apache.lucene.search.TestSubScorerFreqs
   [junit4] Completed on J1 in 0.02s, 3 tests
   [junit4] 
   [junit4] Suite: org.apache.lucene.index.TestIndexWriterConfig
   [junit4] Completed on J1 in 0.04s, 9 tests
   [junit4] 
   [junit4] Suite: org.apache.lucene.search.TestConjunctions
   [junit4] Completed on J1 in 0.01s, 1 test
   [junit4] 
   [junit4] Suite: org.apache.lucene.search.TestMultiTermQueryRewrites
   [junit4] Completed on J1 in 0.13s, 3 tests
   [junit4] 
   [junit4] Suite: org.apache.lucene.search.TestDateSort
   [junit4] Completed on J1 in 0.02s, 1 test
   [junit4] 
   [junit4] Suite: org.apache.lucene.search.TestSimilarity
   [junit4] Completed on J1 in 0.01s, 1 test
   [junit4] 
   [junit4] Suite: org.apache.lucene.util.TestVirtualMethod
   [junit4] Completed on J1 in 0.02s, 2 tests
   [junit4] 
   [junit4] Suite: org.apache.lucene.util.TestSmallFloat
   [junit4] Completed on J1 in 0.16s, 2 tests
   [junit4] 
   [junit4] Suite: org.apache.lucene.util.TestSetOnce
   [junit4] Completed on J1 in 0.03s, 4 tests
   [junit4] 
   [junit4] Suite: org.apache.lucene.analysis.TestCachingTokenFilter
   [junit4] Completed on J1 in 0.07s, 1 test
   [junit4] 
   [junit4] Suite: org.apache.lucene.util.junitcompat.TestSeedFromUncaught
   [junit4] Completed on J1 in 0.02s, 1 test
   [junit4] 
   [junit4] Suite: org.apache.lucene.search.TestDateFilter
   [junit4] Completed on J1 in 0.04s, 2 tests
   [junit4] 
   [junit4] Suite: org.apache.lucene.util.TestPriorityQueue
   [junit4] Completed on J1 in 0.07s, 4 tests
   [junit4] 
   [junit4] Suite: org.apache.lucene.index.Test2BPostings
   [junit4] IGNOR/A 0.00s J1 | Test2BPostings.test
   [junit4]    > Assumption #1: 'nightly' test group is disabled (@Nightly)
   [junit4] Completed on J1 in 0.01s, 1 test, 1 skipped
   [junit4] 
   [junit4] Suite: org.apache.lucene.index.TestSameTokenSamePosition
   [junit4] Completed on J1 in 0.09s, 2 tests
   [junit4] 
   [junit4] Suite: org.apache.lucene.search.TestScorerPerf
   [junit4] Completed on J0 in 17.27s, 1 test
   [junit4] 
   [junit4] Suite: org.apache.lucene.document.TestBinaryDocument
   [junit4] Completed on J1 in 0.02s, 2 tests
   [junit4] 
   [junit4] Suite: org.apache.lucene.search.TestAutomatonQueryUnicode
   [junit4] Completed on J0 in 0.01s, 1 test
   [junit4] 
   [junit4] Suite: org.apache.lucene.util.junitcompat.TestSetupTeardownChaining
   [junit4] Completed on J1 in 0.02s, 2 tests
   [junit4] 
   [junit4] Suite: org.apache.lucene.search.TestFieldCacheTermsFilter
   [junit4] Completed on J0 in 0.01s, 1 test
   [junit4] 
   [junit4] Suite: org.apache.lucene.search.TestTotalHitCountCollector
   [junit4] Completed on J1 in 0.01s, 1 test
   [junit4] 
   [junit4] Suite: org.apache.lucene.util.TestRamUsageEstimator
   [junit4] Completed on J0 in 0.01s, 3 tests
   [junit4] 
   [junit4] Suite: org.apache.lucene.util.junitcompat.TestFailIfUnreferencedFiles
   [junit4] Completed on J1 in 0.01s, 1 test
   [junit4] 
   [junit4] Suite: org.apache.lucene.search.spans.TestSpanFirstQuery
   [junit4] Completed on J0 in 0.01s, 1 test
   [junit4] 
   [junit4] Suite: org.apache.lucene.index.TestIsCurrent
   [junit4] Completed on J1 in 0.06s, 2 tests
   [junit4] 
   [junit4] Suite: org.apache.lucene.index.TestNoMergeScheduler
   [junit4] Completed on J0 in 0.01s, 3 tests
   [junit4] 
   [junit4] Suite: org.apache.lucene.util.TestNamedSPILoader
   [junit4] Completed on J1 in 0.01s, 3 tests
   [junit4] 
   [junit4] Suite: org.apache.lucene.index.TestIndexWriterLockRelease
   [junit4] Completed on J0 in 0.01s, 1 test
   [junit4] 
   [junit4] Suite: org.apache.lucene.util.TestBytesRef
   [junit4] Completed on J1 in 0.02s, 5 tests
   [junit4] 
   [junit4] Suite: org.apache.lucene.index.TestFieldInfos
   [junit4] Completed on J0 in 0.01s, 2 tests
   [junit4] 
   [junit4] Suite: org.apache.lucene.index.TestTwoPhaseCommitTool
   [junit4] Completed on J1 in 0.01s, 3 tests
   [junit4] 
   [junit4] Suite: org.apache.lucene.util.TestVersionComparator
   [junit4] Completed on J0 in 0.01s, 1 test
   [junit4] 
   [junit4] Suite: org.apache.lucene.index.TestIndexWriterOnJRECrash
   [junit4] IGNOR/A 0.00s J1 | TestIndexWriterOnJRECrash.testNRTThreads
   [junit4]    > Assumption #1: 'nightly' test group is disabled (@Nightly)
   [junit4] Completed on J1 in 0.01s, 1 test, 1 skipped
   [junit4] 
   [junit4] Suite: org.apache.lucene.index.Test4GBStoredFields
   [junit4] IGNOR/A 0.00s J0 | Test4GBStoredFields.test
   [junit4]    > Assumption #1: 'nightly' test group is disabled (@Nightly)
   [junit4] Completed on J0 in 0.01s, 1 test, 1 skipped
   [junit4] 
   [junit4] Suite: org.apache.lucene.index.TestReaderClosed
   [junit4] Completed on J1 in 0.01s, 2 tests
   [junit4] 
   [junit4] Suite: org.apache.lucene.search.TestDocBoost
   [junit4] Completed on J0 in 0.01s, 1 test
   [junit4] 
   [junit4] Suite: org.apache.lucene.TestWorstCaseTestBehavior
   [junit4] Completed on J1 in 0.01s, 6 tests, 6 skipped
   [junit4] 
   [junit4] Suite: org.apache.lucene.index.Test2BPositions
   [junit4] Completed on J0 in 0.01s, 1 test, 1 skipped
   [junit4] 
   [junit4] Suite: org.apache.lucene.index.TestTerm
   [junit4] Completed on J1 in 0.01s, 1 test
   [junit4] 
   [junit4] Suite: org.apache.lucene.index.Test2BPostingsBytes
   [junit4] Completed on J0 in 0.01s, 1 test, 1 skipped
   [junit4] 
   [junit4] Suite: org.apache.lucene.search.TestPositiveScoresOnlyCollector
   [junit4] Completed on J1 in 0.01s, 1 test
   [junit4] 
   [junit4] Suite: org.apache.lucene.index.Test2BNumericDocValues
   [junit4] Completed on J0 in 0.00s, 0 tests
   [junit4] 
   [junit4] Suite: org.apache.lucene.index.Test2BBinaryDocValues
   [junit4] Completed on J1 in 0.00s, 0 tests
   [junit4] 
   [junit4] Suite: org.apache.lucene.index.Test2BSortedDocValues
   [junit4] Completed on J0 in 0.00s, 0 tests
   [junit4] 
   [junit4] Suite: org.apache.lucene.analysis.TestPosition
   [junit4] Completed on J1 in 0.00s, 0 tests
   [junit4] 
   [junit4] Suite: org.apache.lucene.analysis.TestReusableStringReader
   [junit4] Completed on J0 in 0.01s, 1 test
   [junit4] 
   [junit4] Suite: org.apache.lucene.codecs.lucene3x.TestSurrogates
   [junit4] Completed on J0 in 0.61s, 1 test
   [junit4] 
   [junit4] Suite: org.apache.lucene.codecs.lucene41.TestLucene41StoredFieldsFormat
   [junit4] IGNOR/A 0.00s J0 | TestLucene41StoredFieldsFormat.testBigDocuments
   [junit4]    > Assumption #1: 'nightly' test group is disabled (@Nightly)
   [junit4] Completed on J0 in 2.07s, 10 tests, 1 skipped
   [junit4] 
   [junit4] Suite: org.apache.lucene.codecs.lucene3x.TestLucene3xStoredFieldsFormat
   [junit4] IGNOR/A 0.00s J1 | TestLucene3xStoredFieldsFormat.testWriteReadMerge
   [junit4]    > Assumption #1: impersonation isnt good enough
   [junit4] IGNOR/A 0.00s J1 | TestLucene3xStoredFieldsFormat.testBigDocuments
   [junit4]    > Assumption #1: 'nightly' test group is disabled (@Nightly)
   [junit4] Completed on J1 in 9.63s, 10 tests, 2 skipped
   [junit4] 
   [junit4] Suite: org.apache.lucene.index.TestDocInverterPerFieldErrorInfo
   [junit4] Completed on J1 in 0.03s, 2 tests
   [junit4] 
   [junit4] Suite: org.apache.lucene.index.TestIndexWriterOutOfFileDescriptors
   [junit4] Completed on J1 in 5.67s, 1 test
   [junit4] 
   [junit4] Suite: org.apache.lucene.index.TestLogMergePolicy
   [junit4] Completed on J1 in 0.02s, 1 test
   [junit4] 
   [junit4] Suite: org.apache.lucene.index.TestStoredFieldsFormat
   [junit4] IGNOR/A 0.00s J1 | TestStoredFieldsFormat.testBigDocuments
   [junit4]    > Assumption #1: 'nightly' test group is disabled (@Nightly)
   [junit4] Completed on J1 in 2.11s, 10 tests, 1 skipped
   [junit4] 
   [junit4] Suite: org.apache.lucene.codecs.lucene45.TestLucene45DocValuesFormat
   [junit4] IGNOR/A 0.00s J0 | TestLucene45DocValuesFormat.testHugeBinaryValueLimit
   [junit4]    > Assumption #1: test requires codec with limits on max binary field length
   [junit4] Completed on J0 in 17.08s, 81 tests, 1 skipped
   [junit4] 
   [junit4] Suite: org.apache.lucene.search.TestEarlyTermination
   [junit4] Completed on J0 in 0.08s, 1 test
   [junit4] 
   [junit4] Suite: org.apache.lucene.store.TestRateLimiter
   [junit4] Completed on J0 in 1.21s, 1 test
   [junit4] 
   [junit4] Suite: org.apache.lucene.util.TestBytesRefArray
   [junit4] Completed on J0 in 0.04s, 2 tests
   [junit4] 
   [junit4] Suite: org.apache.lucene.util.TestIndexableBinaryStringTools
   [junit4] Completed on J0 in 0.85s, 5 tests
   [junit4] 
   [junit4] Suite: org.apache.lucene.search.TestControlledRealTimeReopenThread
   [junit4] Completed on J1 in 6.93s, 5 tests
   [junit4] 
   [junit4] Suite: org.apache.lucene.util.TestMathUtil
   [junit4] Completed on J1 in 0.02s, 5 tests
   [junit4] 
   [junit4] Suite: org.apache.lucene.util.TestOfflineSorter
   [junit4] IGNOR/A 0.00s J1 | TestOfflineSorter.testLargerRandom
   [junit4]    > Assumption #1: 'nightly' test group is disabled (@Nightly)
   [junit4] Completed on J1 in 5.27s, 6 tests, 1 skipped
   [junit4] 
   [junit4] Suite: org.apache.lucene.util.TestPForDeltaDocIdSet
   [junit4] Completed on J1 in 0.28s, 4 tests
   [junit4] 
   [junit4] Suite: org.apache.lucene.util.TestLongBitSet
   [junit4] Completed on J0 in 8.36s, 7 tests
   [junit4] 
   [junit4] Suite: org.apache.lucene.util.TestQueryBuilder
   [junit4] Completed on J1 in 0.05s, 19 tests
   [junit4] 
   [junit4] Suite: org.apache.lucene.util.TestTimSorter
   [junit4] Completed on J0 in 0.08s, 9 tests
   [junit4] 
   [junit4] Suite: org.apache.lucene.util.junitcompat.TestReproduceMessageWithRepeated
   [junit4] Completed on J0 in 0.03s, 1 test
   [junit4] 
   [junit4] Suite: org.apache.lucene.util.packed.TestEliasFanoDocIdSet
   [junit4] Completed on J0 in 0.24s, 4 tests
   [junit4] 
   [junit4] Suite: org.apache.lucene.util.TestWAH8DocIdSet
   [junit4] Completed on J1 in 0.79s, 6 tests
   [junit4] 
   [junit4] Suite: org.apache.lucene.util.packed.TestEliasFanoSequence
   [junit4] Completed on J0 in 2.54s, 24 tests
   [junit4] 
   [junit4] JVM J0:     1.07 ..   663.94 =   662.87s
   [junit4] JVM J1:     1.07 ..   661.55 =   660.48s
   [junit4] Execution time total: 11 minutes 3 seconds
   [junit4] Tests summary: 385 suites, 2793 tests, 76 ignored (63 assumptions)
     [echo] 5 slowest tests:
[junit4:tophints] 210.53s | org.apache.lucene.index.TestNumericDocValuesUpdates
[junit4:tophints]  71.69s | org.apache.lucene.search.TestSearchAfter
[junit4:tophints]  39.71s | org.apache.lucene.codecs.compressing.TestCompressingTermVectorsFormat
[junit4:tophints]  29.74s | org.apache.lucene.codecs.lucene42.TestLucene42DocValuesFormat
[junit4:tophints]  28.34s | org.apache.lucene.index.TestIndexWriter

-check-totals:

test:

compile-test:

ivy-availability-check:

ivy-fail:

ivy-configure:
[ivy:configure] :: loading settings :: f

[...truncated too long message...]

ests
   [junit4] 
   [junit4] Suite: org.apache.solr.search.TestLRUCache
   [junit4] Completed on J0 in 0.03s, 3 tests
   [junit4] 
   [junit4] Suite: org.apache.solr.util.FileUtilsTest
   [junit4] Completed on J0 in 0.01s, 1 test
   [junit4] 
   [junit4] Suite: org.apache.solr.internal.csv.writer.CSVFieldTest
   [junit4] Completed on J0 in 0.00s, 2 tests
   [junit4] 
   [junit4] Suite: org.apache.solr.internal.csv.CSVStrategyTest
   [junit4] Completed on J0 in 0.00s, 5 tests
   [junit4] 
   [junit4] Suite: org.apache.solr.handler.component.DistributedMLTComponentTest
   [junit4] Completed on J0 in 0.01s, 0 tests
   [junit4] 
   [junit4] Suite: org.apache.solr.schema.AbstractCurrencyFieldTest
   [junit4] Completed on J0 in 0.00s, 0 tests
   [junit4] 
   [junit4] Suite: org.apache.solr.search.TestRTGBase
   [junit4] Completed on J0 in 0.00s, 0 tests
   [junit4] 
   [junit4] Suite: org.apache.solr.CursorPagingTest
   [junit4] Completed on J0 in 6.14s, 5 tests
   [junit4] 
   [junit4] Suite: org.apache.solr.SolrTestCaseJ4Test
   [junit4] Completed on J0 in 0.11s, 1 test
   [junit4] 
   [junit4] Suite: org.apache.solr.TestDistributedMissingSort
   [junit4] Completed on J0 in 6.08s, 1 test
   [junit4] 
   [junit4] Suite: org.apache.solr.cloud.AssignTest
   [junit4] Completed on J0 in 0.03s, 1 test
   [junit4] 
   [junit4] Suite: org.apache.solr.cloud.ChaosMonkeyShardSplitTest
   [junit4] Completed on J0 in 0.00s, 0 tests
   [junit4] 
   [junit4] Suite: org.apache.solr.cloud.ChaosMonkeyNothingIsSafeTest
   [junit4] Completed on J1 in 60.91s, 1 test
   [junit4] 
   [junit4] Suite: org.apache.solr.cloud.CustomCollectionTest
   [junit4] Completed on J0 in 43.06s, 1 test
   [junit4] 
   [junit4] Suite: org.apache.solr.cloud.DeleteInactiveReplicaTest
   [junit4] Completed on J1 in 30.23s, 1 test
   [junit4] 
   [junit4] Suite: org.apache.solr.cloud.TestDistribDocBasedVersion
   [junit4] Completed on J1 in 24.61s, 1 test
   [junit4] 
   [junit4] Suite: org.apache.solr.cloud.DistribCursorPagingTest
   [junit4] Completed on J0 in 43.94s, 1 test
   [junit4] 
   [junit4] Suite: org.apache.solr.cloud.hdfs.HdfsBasicDistributedZk2Test
   [junit4] Completed on J0 in 0.05s, 1 test, 1 skipped
   [junit4] 
   [junit4] Suite: org.apache.solr.cloud.hdfs.HdfsChaosMonkeySafeLeaderTest
   [junit4] Completed on J0 in 0.02s, 1 test, 1 skipped
   [junit4] 
   [junit4] Suite: org.apache.solr.cloud.hdfs.HdfsCollectionsAPIDistributedZkTest
   [junit4] Completed on J0 in 0.03s, 1 test, 1 skipped
   [junit4] 
   [junit4] Suite: org.apache.solr.cloud.hdfs.StressHdfsTest
   [junit4] Completed on J0 in 0.02s, 1 test, 1 skipped
   [junit4] 
   [junit4] Suite: org.apache.solr.core.CachingDirectoryFactoryTest
   [junit4] Completed on J0 in 8.24s, 1 test
   [junit4] 
   [junit4] Suite: org.apache.solr.core.QueryResultKeyTest
   [junit4] Completed on J0 in 1.16s, 4 tests
   [junit4] 
   [junit4] Suite: org.apache.solr.core.TestImplicitCoreProperties
   [junit4] Completed on J0 in 0.55s, 1 test
   [junit4] 
   [junit4] Suite: org.apache.solr.core.TestInfoStreamLogging
   [junit4] Completed on J0 in 0.40s, 1 test
   [junit4] 
   [junit4] Suite: org.apache.solr.core.TestNRTOpen
   [junit4] Completed on J0 in 0.73s, 2 tests
   [junit4] 
   [junit4] Suite: org.apache.solr.core.TestShardHandlerFactory
   [junit4] Completed on J0 in 0.14s, 2 tests
   [junit4] 
   [junit4] Suite: org.apache.solr.core.TestSolrXmlPersistence
   [junit4] Completed on J0 in 1.54s, 8 tests
   [junit4] 
   [junit4] Suite: org.apache.solr.core.TestSolrXmlPersistor
   [junit4] Completed on J0 in 0.05s, 7 tests
   [junit4] 
   [junit4] Suite: org.apache.solr.handler.admin.CoreAdminCreateDiscoverTest
   [junit4] Completed on J0 in 0.25s, 3 tests
   [junit4] 
   [junit4] Suite: org.apache.solr.handler.component.DistributedQueryComponentOptimizationTest
   [junit4] Completed on J0 in 1.46s, 1 test
   [junit4] 
   [junit4] Suite: org.apache.solr.handler.component.DistributedSuggestComponentTest
   [junit4] Completed on J0 in 5.83s, 1 test
   [junit4] 
   [junit4] Suite: org.apache.solr.handler.component.SuggestComponentTest
   [junit4] Completed on J0 in 0.97s, 6 tests
   [junit4] 
   [junit4] Suite: org.apache.solr.logging.TestLogWatcher
   [junit4] Completed on J0 in 0.01s, 1 test
   [junit4] 
   [junit4] Suite: org.apache.solr.rest.schema.TestDynamicFieldResource
   [junit4] Completed on J0 in 0.47s, 3 tests
   [junit4] 
   [junit4] Suite: org.apache.solr.rest.schema.TestFieldResource
   [junit4] Completed on J0 in 0.55s, 7 tests
   [junit4] 
   [junit4] Suite: org.apache.solr.rest.schema.TestFieldTypeResource
   [junit4] Completed on J0 in 0.58s, 4 tests
   [junit4] 
   [junit4] Suite: org.apache.solr.rest.schema.TestManagedSchemaFieldResource
   [junit4] Completed on J0 in 6.36s, 10 tests
   [junit4] 
   [junit4] Suite: org.apache.solr.rest.schema.TestSchemaNameResource
   [junit4] Completed on J0 in 0.35s, 1 test
   [junit4] 
   [junit4] Suite: org.apache.solr.rest.schema.TestSchemaSimilarityResource
   [junit4] Completed on J0 in 0.47s, 1 test
   [junit4] 
   [junit4] Suite: org.apache.solr.rest.schema.TestSerializedLuceneMatchVersion
   [junit4] Completed on J0 in 0.25s, 2 tests
   [junit4] 
   [junit4] Suite: org.apache.solr.rest.schema.TestSolrQueryParserDefaultOperatorResource
   [junit4] Completed on J0 in 0.42s, 1 test
   [junit4] 
   [junit4] Suite: org.apache.solr.rest.schema.TestSolrQueryParserResource
   [junit4] Completed on J0 in 0.34s, 1 test
   [junit4] 
   [junit4] Suite: org.apache.solr.rest.schema.TestUniqueKeyFieldResource
   [junit4] Completed on J0 in 0.45s, 1 test
   [junit4] 
   [junit4] Suite: org.apache.solr.schema.BadCopyFieldTest
   [junit4] Completed on J0 in 0.18s, 5 tests
   [junit4] 
   [junit4] Suite: org.apache.solr.schema.ChangedSchemaMergeTest
   [junit4] Completed on J0 in 0.12s, 1 test
   [junit4] 
   [junit4] Suite: org.apache.solr.schema.DocValuesMissingTest
   [junit4] Completed on J0 in 1.00s, 58 tests
   [junit4] 
   [junit4] HEARTBEAT J1 PID(11682@serv1.sd-datasolutions.de): 2014-03-03T11:34:23, stalled for 63.3s at: TriLevelCompositeIdRoutingTest.testDistribSearch
   [junit4] Suite: org.apache.solr.schema.TestCloudManagedSchemaAddField
   [junit4] Completed on J0 in 28.05s, 1 test
   [junit4] 
   [junit4] Suite: org.apache.solr.schema.TestCollationFieldDocValues
   [junit4] Completed on J0 in 0.21s, 8 tests
   [junit4] 
   [junit4] Suite: org.apache.solr.schema.TestManagedSchema
   [junit4] Completed on J0 in 4.38s, 14 tests
   [junit4] 
   [junit4] Suite: org.apache.solr.search.TestCollapseQParserPlugin
   [junit4] Completed on J0 in 0.47s, 1 test
   [junit4] 
   [junit4] Suite: org.apache.solr.search.TestNoOpRegenerator
   [junit4] Completed on J0 in 0.11s, 1 test
   [junit4] 
   [junit4] Suite: org.apache.solr.search.TestOverriddenPrefixQueryForCustomFieldType
   [junit4] Completed on J0 in 0.19s, 2 tests
   [junit4] 
   [junit4] Suite: org.apache.solr.search.TestStressUserVersions
   [junit4] Completed on J0 in 3.84s, 1 test
   [junit4] 
   [junit4] Suite: org.apache.solr.spelling.suggest.TestBlendedInfixSuggestions
   [junit4] Completed on J0 in 0.37s, 3 tests
   [junit4] 
   [junit4] Suite: org.apache.solr.spelling.suggest.TestFileDictionaryLookup
   [junit4] Completed on J0 in 0.18s, 1 test
   [junit4] 
   [junit4] Suite: org.apache.solr.cloud.TriLevelCompositeIdRoutingTest
   [junit4] Completed on J1 in 80.20s, 1 test
   [junit4] 
   [junit4] Suite: org.apache.solr.spelling.suggest.TestHighFrequencyDictionaryFactory
   [junit4] Completed on J1 in 0.23s, 1 test
   [junit4] 
   [junit4] Suite: org.apache.solr.store.hdfs.HdfsDirectoryTest
   [junit4] Completed on J1 in 0.05s, 3 tests, 3 skipped
   [junit4] 
   [junit4] Suite: org.apache.solr.spelling.suggest.TestFreeTextSuggestions
   [junit4] Completed on J0 in 0.96s, 1 test
   [junit4] 
   [junit4] Suite: org.apache.solr.store.hdfs.HdfsLockFactoryTest
   [junit4] Completed on J1 in 0.03s, 1 test, 1 skipped
   [junit4] 
   [junit4] Suite: org.apache.solr.update.AnalysisErrorHandlingTest
   [junit4] Completed on J0 in 0.13s, 1 test
   [junit4] 
   [junit4] Suite: org.apache.solr.update.processor.PreAnalyzedUpdateProcessorTest
   [junit4] Completed on J1 in 0.44s, 2 tests
   [junit4] 
   [junit4] 
   [junit4] Tests with failures:
   [junit4]   - org.apache.solr.cloud.OverseerRolesTest.testDistribSearch
   [junit4] 
   [junit4] 
   [junit4] JVM J0:     0.64 ..  1122.01 =  1121.36s
   [junit4] JVM J1:     0.64 ..  1122.43 =  1121.79s
   [junit4] Execution time total: 18 minutes 42 seconds
   [junit4] Tests summary: 363 suites, 1570 tests, 1 error, 36 ignored (8 assumptions)

BUILD FAILED
/mnt/ssd/jenkins/workspace/Lucene-Solr-4.x-Linux/build.xml:471: The following error occurred while executing this line:
/mnt/ssd/jenkins/workspace/Lucene-Solr-4.x-Linux/build.xml:451: The following error occurred while executing this line:
/mnt/ssd/jenkins/workspace/Lucene-Solr-4.x-Linux/build.xml:39: The following error occurred while executing this line:
/mnt/ssd/jenkins/workspace/Lucene-Solr-4.x-Linux/extra-targets.xml:37: The following error occurred while executing this line:
/mnt/ssd/jenkins/workspace/Lucene-Solr-4.x-Linux/solr/build.xml:189: The following error occurred while executing this line:
/mnt/ssd/jenkins/workspace/Lucene-Solr-4.x-Linux/solr/common-build.xml:490: The following error occurred while executing this line:
/mnt/ssd/jenkins/workspace/Lucene-Solr-4.x-Linux/lucene/common-build.xml:1278: The following error occurred while executing this line:
/mnt/ssd/jenkins/workspace/Lucene-Solr-4.x-Linux/lucene/common-build.xml:911: There were test failures: 363 suites, 1570 tests, 1 error, 36 ignored (8 assumptions)

Total time: 42 minutes 33 seconds
Build step 'Invoke Ant' marked build as failure
Description set: Java: 64bit/jdk1.8.0-fcs-b129 -XX:-UseCompressedOops -XX:+UseParallelGC
Archiving artifacts
Recording test results
Email was triggered for: Failure
Sending email for trigger: Failure



Mime
View raw message