lucene-dev mailing list archives

Site index · List index
Message view « Date » · « Thread »
Top « Date » · « Thread »
From buil...@flonkings.com
Subject [JENKINS] Lucene-trunk-Linux-Java7-64-test-only - Build # 80351 - Failure!
Date Sun, 23 Mar 2014 20:48:09 GMT
Build: builds.flonkings.com/job/Lucene-trunk-Linux-Java7-64-test-only/80351/

1 tests failed.
REGRESSION:  org.apache.lucene.index.TestIndexWriterDelete.testUpdatesOnDiskFull

Error Message:
file _0.fdx does not exist; files=[_1_dv.cfe, _0.fdx, _0_Lucene41_0.doc, _0_1.del, _0.fdt,
_1_dv.cfs, _0.fnm, _1.tvf, _1.si, _1.fnm, segments_1, _0.tvd, _1_Lucene41_0.tip, _1.fdx, _0_nrm.cfs,
_1.tvx, _1_Lucene41_0.doc, _1_nrm.cfs, _1.tvd, _0.tvf, _1_Lucene41_0.tim, _0_Lucene41_0.tip,
_1_Lucene41_0.pos, _0_dv.cfe, _0_Lucene41_0.pos, _0_nrm.cfe, _0.tvx, _0_dv.cfs, _1.fdt, segments.gen,
_0.si, _1_nrm.cfe, _0_Lucene41_0.tim]

Stack Trace:
java.lang.AssertionError: file _0.fdx does not exist; files=[_1_dv.cfe, _0.fdx, _0_Lucene41_0.doc,
_0_1.del, _0.fdt, _1_dv.cfs, _0.fnm, _1.tvf, _1.si, _1.fnm, segments_1, _0.tvd, _1_Lucene41_0.tip,
_1.fdx, _0_nrm.cfs, _1.tvx, _1_Lucene41_0.doc, _1_nrm.cfs, _1.tvd, _0.tvf, _1_Lucene41_0.tim,
_0_Lucene41_0.tip, _1_Lucene41_0.pos, _0_dv.cfe, _0_Lucene41_0.pos, _0_nrm.cfe, _0.tvx, _0_dv.cfs,
_1.fdt, segments.gen, _0.si, _1_nrm.cfe, _0_Lucene41_0.tim]
	at __randomizedtesting.SeedInfo.seed([E9E9A203C4B6C93E:8D0F643060BC6698]:0)
	at org.apache.lucene.index.IndexWriter.filesExist(IndexWriter.java:4316)
	at org.apache.lucene.index.IndexWriter.startCommit(IndexWriter.java:4382)
	at org.apache.lucene.index.IndexWriter.prepareCommitInternal(IndexWriter.java:2930)
	at org.apache.lucene.index.IndexWriter.commitInternal(IndexWriter.java:3037)
	at org.apache.lucene.index.IndexWriter.closeInternal(IndexWriter.java:1043)
	at org.apache.lucene.index.IndexWriter.close(IndexWriter.java:934)
	at org.apache.lucene.index.IndexWriter.close(IndexWriter.java:896)
	at org.apache.lucene.index.TestIndexWriterDelete.doTestOperationsOnDiskFull(TestIndexWriterDelete.java:598)
	at org.apache.lucene.index.TestIndexWriterDelete.testUpdatesOnDiskFull(TestIndexWriterDelete.java:486)
	at sun.reflect.NativeMethodAccessorImpl.invoke0(Native Method)
	at sun.reflect.NativeMethodAccessorImpl.invoke(NativeMethodAccessorImpl.java:57)
	at sun.reflect.DelegatingMethodAccessorImpl.invoke(DelegatingMethodAccessorImpl.java:43)
	at java.lang.reflect.Method.invoke(Method.java:606)
	at com.carrotsearch.randomizedtesting.RandomizedRunner.invoke(RandomizedRunner.java:1617)
	at com.carrotsearch.randomizedtesting.RandomizedRunner$6.evaluate(RandomizedRunner.java:826)
	at com.carrotsearch.randomizedtesting.RandomizedRunner$7.evaluate(RandomizedRunner.java:862)
	at com.carrotsearch.randomizedtesting.RandomizedRunner$8.evaluate(RandomizedRunner.java:876)
	at org.apache.lucene.util.TestRuleSetupTeardownChained$1.evaluate(TestRuleSetupTeardownChained.java:50)
	at org.apache.lucene.util.TestRuleFieldCacheSanity$1.evaluate(TestRuleFieldCacheSanity.java:51)
	at org.apache.lucene.util.AbstractBeforeAfterRule$1.evaluate(AbstractBeforeAfterRule.java:46)
	at com.carrotsearch.randomizedtesting.rules.SystemPropertiesInvariantRule$1.evaluate(SystemPropertiesInvariantRule.java:55)
	at org.apache.lucene.util.TestRuleThreadAndTestName$1.evaluate(TestRuleThreadAndTestName.java:49)
	at org.apache.lucene.util.TestRuleIgnoreAfterMaxFailures$1.evaluate(TestRuleIgnoreAfterMaxFailures.java:70)
	at org.apache.lucene.util.TestRuleMarkFailure$1.evaluate(TestRuleMarkFailure.java:48)
	at com.carrotsearch.randomizedtesting.rules.StatementAdapter.evaluate(StatementAdapter.java:36)
	at com.carrotsearch.randomizedtesting.ThreadLeakControl$StatementRunner.run(ThreadLeakControl.java:359)
	at com.carrotsearch.randomizedtesting.ThreadLeakControl.forkTimeoutingTask(ThreadLeakControl.java:783)
	at com.carrotsearch.randomizedtesting.ThreadLeakControl$3.evaluate(ThreadLeakControl.java:443)
	at com.carrotsearch.randomizedtesting.RandomizedRunner.runSingleTest(RandomizedRunner.java:835)
	at com.carrotsearch.randomizedtesting.RandomizedRunner$3.evaluate(RandomizedRunner.java:737)
	at com.carrotsearch.randomizedtesting.RandomizedRunner$4.evaluate(RandomizedRunner.java:771)
	at com.carrotsearch.randomizedtesting.RandomizedRunner$5.evaluate(RandomizedRunner.java:782)
	at org.apache.lucene.util.AbstractBeforeAfterRule$1.evaluate(AbstractBeforeAfterRule.java:46)
	at org.apache.lucene.util.TestRuleStoreClassName$1.evaluate(TestRuleStoreClassName.java:42)
	at com.carrotsearch.randomizedtesting.rules.SystemPropertiesInvariantRule$1.evaluate(SystemPropertiesInvariantRule.java:55)
	at com.carrotsearch.randomizedtesting.rules.NoShadowingOrOverridesOnMethodsRule$1.evaluate(NoShadowingOrOverridesOnMethodsRule.java:39)
	at com.carrotsearch.randomizedtesting.rules.NoShadowingOrOverridesOnMethodsRule$1.evaluate(NoShadowingOrOverridesOnMethodsRule.java:39)
	at com.carrotsearch.randomizedtesting.rules.StatementAdapter.evaluate(StatementAdapter.java:36)
	at org.apache.lucene.util.TestRuleAssertionsRequired$1.evaluate(TestRuleAssertionsRequired.java:43)
	at org.apache.lucene.util.TestRuleMarkFailure$1.evaluate(TestRuleMarkFailure.java:48)
	at org.apache.lucene.util.TestRuleIgnoreAfterMaxFailures$1.evaluate(TestRuleIgnoreAfterMaxFailures.java:70)
	at org.apache.lucene.util.TestRuleIgnoreTestSuites$1.evaluate(TestRuleIgnoreTestSuites.java:55)
	at com.carrotsearch.randomizedtesting.rules.StatementAdapter.evaluate(StatementAdapter.java:36)
	at com.carrotsearch.randomizedtesting.ThreadLeakControl$StatementRunner.run(ThreadLeakControl.java:359)
	at java.lang.Thread.run(Thread.java:724)




Build Log:
[...truncated 757 lines...]
   [junit4] Suite: org.apache.lucene.index.TestIndexWriterDelete
   [junit4] IGNOR/A 0.03s J7 | TestIndexWriterDelete.testApplyDeletesOnFlush
   [junit4]    > Assumption #1: 'nightly' test group is disabled (@Nightly())
   [junit4]   2> NOTE: reproduce with: ant test  -Dtestcase=TestIndexWriterDelete -Dtests.method=testUpdatesOnDiskFull
-Dtests.seed=E9E9A203C4B6C93E -Dtests.slow=true -Dtests.locale=ko -Dtests.timezone=America/Buenos_Aires
-Dtests.file.encoding=UTF-8
   [junit4] FAILURE 0.44s J7 | TestIndexWriterDelete.testUpdatesOnDiskFull <<<
   [junit4]    > Throwable #1: java.lang.AssertionError: file _0.fdx does not exist; files=[_1_dv.cfe,
_0.fdx, _0_Lucene41_0.doc, _0_1.del, _0.fdt, _1_dv.cfs, _0.fnm, _1.tvf, _1.si, _1.fnm, segments_1,
_0.tvd, _1_Lucene41_0.tip, _1.fdx, _0_nrm.cfs, _1.tvx, _1_Lucene41_0.doc, _1_nrm.cfs, _1.tvd,
_0.tvf, _1_Lucene41_0.tim, _0_Lucene41_0.tip, _1_Lucene41_0.pos, _0_dv.cfe, _0_Lucene41_0.pos,
_0_nrm.cfe, _0.tvx, _0_dv.cfs, _1.fdt, segments.gen, _0.si, _1_nrm.cfe, _0_Lucene41_0.tim]
   [junit4]    > 	at __randomizedtesting.SeedInfo.seed([E9E9A203C4B6C93E:8D0F643060BC6698]:0)
   [junit4]    > 	at org.apache.lucene.index.IndexWriter.filesExist(IndexWriter.java:4316)
   [junit4]    > 	at org.apache.lucene.index.IndexWriter.startCommit(IndexWriter.java:4382)
   [junit4]    > 	at org.apache.lucene.index.IndexWriter.prepareCommitInternal(IndexWriter.java:2930)
   [junit4]    > 	at org.apache.lucene.index.IndexWriter.commitInternal(IndexWriter.java:3037)
   [junit4]    > 	at org.apache.lucene.index.IndexWriter.closeInternal(IndexWriter.java:1043)
   [junit4]    > 	at org.apache.lucene.index.IndexWriter.close(IndexWriter.java:934)
   [junit4]    > 	at org.apache.lucene.index.IndexWriter.close(IndexWriter.java:896)
   [junit4]    > 	at org.apache.lucene.index.TestIndexWriterDelete.doTestOperationsOnDiskFull(TestIndexWriterDelete.java:598)
   [junit4]    > 	at org.apache.lucene.index.TestIndexWriterDelete.testUpdatesOnDiskFull(TestIndexWriterDelete.java:486)
   [junit4]    > 	at java.lang.Thread.run(Thread.java:724)
   [junit4]   2> NOTE: test params are: codec=Lucene41, sim=RandomSimilarityProvider(queryNorm=true,coord=crazy):
{content=IB SPL-DZ(0.3), city=DFR I(F)LZ(0.3), id=DFR I(F)2, contents=DFR I(F)BZ(0.3)}, locale=ko,
timezone=America/Buenos_Aires
   [junit4]   2> NOTE: Linux 3.2.0-26-generic amd64/Oracle Corporation 1.7.0_25 (64-bit)/cpus=8,threads=1,free=108455232,total=263651328
   [junit4]   2> NOTE: All tests run in this JVM: [TestTerm, TestTermVectorsWriter, TestBlockPostingsFormat3,
TestSimpleSearchEquivalence, TestSmallFloat, TestWorstCaseTestBehavior, TestFSTs, TestTwoPhaseCommitTool,
TestInPlaceMergeSorter, TestDeletionPolicy, TestSpansAdvanced2, TestAllFilesHaveCodecHeader,
TestControlledRealTimeReopenThread, TestTopDocsCollector, TestForceMergeForever, TestOmitTf,
TestRAMDirectory, TestRamUsageEstimator, TestConjunctions, TestField, TestScorerPerf, TestLogMergePolicy,
TestMockAnalyzer, TestDirectoryReaderReopen, TestIndexWriterDelete]
   [junit4] Completed on J7 in 11.67s, 22 tests, 1 failure, 1 skipped <<< FAILURES!

[...truncated 717 lines...]
BUILD FAILED
/var/lib/jenkins/workspace/Lucene-trunk-Linux-Java7-64-test-only/checkout/lucene/build.xml:49:
The following error occurred while executing this line:
/var/lib/jenkins/workspace/Lucene-trunk-Linux-Java7-64-test-only/checkout/lucene/common-build.xml:1275:
The following error occurred while executing this line:
/var/lib/jenkins/workspace/Lucene-trunk-Linux-Java7-64-test-only/checkout/lucene/common-build.xml:907:
There were test failures: 384 suites, 2795 tests, 1 failure, 112 ignored (99 assumptions)

Total time: 5 minutes 23 seconds
Build step 'Invoke Ant' marked build as failure
Archiving artifacts
Recording test results
Email was triggered for: Failure
Sending email for trigger: Failure



Mime
View raw message