lucene-dev mailing list archives

Site index · List index
Message view « Date » · « Thread »
Top « Date » · « Thread »
From Policeman Jenkins Server <jenk...@thetaphi.de>
Subject [JENKINS] Lucene-Solr-trunk-Linux (32bit/jdk1.7.0_60-ea-b07) - Build # 9773 - Failure!
Date Wed, 12 Mar 2014 23:11:59 GMT
Build: http://jenkins.thetaphi.de/job/Lucene-Solr-trunk-Linux/9773/
Java: 32bit/jdk1.7.0_60-ea-b07 -client -XX:+UseParallelGC

All tests passed

Build Log:
[...truncated 28333 lines...]
check-licenses:
     [echo] License check under: /mnt/ssd/jenkins/workspace/Lucene-Solr-trunk-Linux/solr
 [licenses] CHECKSUM FAILED for /mnt/ssd/jenkins/workspace/Lucene-Solr-trunk-Linux/solr/contrib/map-reduce/lib/kite-morphlines-hadoop-sequencefile-0.11.0.jar
(expected: "d3ce8181bdda849a8a0892239929743d97bf17a8" was: "16d6b1b848e7f3de2f4de79bbe12ef02ca29ad7c")
 [licenses] CHECKSUM FAILED for /mnt/ssd/jenkins/workspace/Lucene-Solr-trunk-Linux/solr/contrib/map-reduce/lib/kite-morphlines-saxon-0.11.0.jar
(expected: "397b4ed00992789cd77838fa665b57215aa13ec3" was: "296ffafea1f5160e1db56e6daa6dc86be7a9d8b4")
 [licenses] CHECKSUM FAILED for /mnt/ssd/jenkins/workspace/Lucene-Solr-trunk-Linux/solr/contrib/morphlines-cell/lib/kite-morphlines-json-0.11.0.jar
(expected: "f1838cea0caa193729fd3c64d037d0a17665de70" was: "c9ebdc525368e809f705495aff50ad1a21725a07")
 [licenses] CHECKSUM FAILED for /mnt/ssd/jenkins/workspace/Lucene-Solr-trunk-Linux/solr/contrib/morphlines-cell/lib/kite-morphlines-tika-core-0.11.0.jar
(expected: "a19aa842e26516fd6ed4da1c69dc37b6583525e0" was: "9861e7400a27214ece16cb94cb6637eef3284a21")
 [licenses] CHECKSUM FAILED for /mnt/ssd/jenkins/workspace/Lucene-Solr-trunk-Linux/solr/contrib/morphlines-cell/lib/kite-morphlines-tika-decompress-0.11.0.jar
(expected: "296d727fe095b1c6d250adc7aaf1e5045a3dc31d" was: "d21a33105ce6df0fd519c8fb1882549dbafff21e")
 [licenses] CHECKSUM FAILED for /mnt/ssd/jenkins/workspace/Lucene-Solr-trunk-Linux/solr/contrib/morphlines-cell/lib/kite-morphlines-twitter-0.11.0.jar
(expected: "9a7777ee8492c59681dca150047172324a1c7cec" was: "299e78d3fbb8e61c950d0a589fd31689753997c4")
 [licenses] CHECKSUM FAILED for /mnt/ssd/jenkins/workspace/Lucene-Solr-trunk-Linux/solr/contrib/morphlines-core/lib/kite-morphlines-avro-0.11.0.jar
(expected: "6e230764086ebdf7076810cee1220a5fe7451e34" was: "ac24f3b61248bd7527ba5d0ac55ab4a6c1e99dec")
 [licenses] CHECKSUM FAILED for /mnt/ssd/jenkins/workspace/Lucene-Solr-trunk-Linux/solr/contrib/morphlines-core/lib/kite-morphlines-core-0.11.0.jar
(expected: "d937428805e0e1e4e074769d732ea61293cbe5e8" was: "6dfd4325dcd202e24104ff1eb604fcf4322b917c")
 [licenses] CHECKSUM FAILED for /mnt/ssd/jenkins/workspace/Lucene-Solr-trunk-Linux/solr/contrib/morphlines-core/test-lib/kite-morphlines-core-0.11.0-tests.jar
(expected: "438af5d85b105ffc1148564d0a70dd147d35b0a0" was: "13a473a5f3fc4b9c0cb6348313c9595219a5593b")
 [licenses] CHECKSUM FAILED for /mnt/ssd/jenkins/workspace/Lucene-Solr-trunk-Linux/solr/contrib/morphlines-core/test-lib/kite-morphlines-core-0.11.0.jar
(expected: "d937428805e0e1e4e074769d732ea61293cbe5e8" was: "6dfd4325dcd202e24104ff1eb604fcf4322b917c")
 [licenses] Scanned 193 JAR file(s) for licenses (in 1.48s.), 10 error(s).

BUILD FAILED
/mnt/ssd/jenkins/workspace/Lucene-Solr-trunk-Linux/build.xml:467: The following error occurred
while executing this line:
/mnt/ssd/jenkins/workspace/Lucene-Solr-trunk-Linux/build.xml:70: The following error occurred
while executing this line:
/mnt/ssd/jenkins/workspace/Lucene-Solr-trunk-Linux/solr/build.xml:254: The following error
occurred while executing this line:
/mnt/ssd/jenkins/workspace/Lucene-Solr-trunk-Linux/lucene/tools/custom-tasks.xml:62: License
check failed. Check the logs.

Total time: 51 minutes 23 seconds
Build step 'Invoke Ant' marked build as failure
Description set: Java: 32bit/jdk1.7.0_60-ea-b07 -client -XX:+UseParallelGC
Archiving artifacts
Recording test results
Email was triggered for: Failure
Sending email for trigger: Failure



Mime
View raw message