lucene-dev mailing list archives

Site index · List index
Message view « Date » · « Thread »
Top « Date » · « Thread »
From Policeman Jenkins Server <jenk...@thetaphi.de>
Subject [JENKINS] Lucene-Solr-trunk-Linux (32bit/jdk1.8.0) - Build # 9907 - Still Failing!
Date Wed, 26 Mar 2014 00:23:00 GMT
Build: http://jenkins.thetaphi.de/job/Lucene-Solr-trunk-Linux/9907/
Java: 32bit/jdk1.8.0 -server -XX:+UseParallelGC

1 tests failed.
FAILED:  org.apache.solr.client.solrj.impl.CloudSolrServerTest.testDistribSearch

Error Message:
java.util.concurrent.TimeoutException: Could not connect to ZooKeeper 127.0.0.1:59004 within
45000 ms

Stack Trace:
org.apache.solr.common.SolrException: java.util.concurrent.TimeoutException: Could not connect
to ZooKeeper 127.0.0.1:59004 within 45000 ms
	at __randomizedtesting.SeedInfo.seed([10D89F0D312B7E32:913E111546741E0E]:0)
	at org.apache.solr.common.cloud.SolrZkClient.<init>(SolrZkClient.java:150)
	at org.apache.solr.common.cloud.SolrZkClient.<init>(SolrZkClient.java:101)
	at org.apache.solr.common.cloud.SolrZkClient.<init>(SolrZkClient.java:91)
	at org.apache.solr.cloud.AbstractZkTestCase.buildZooKeeper(AbstractZkTestCase.java:91)
	at org.apache.solr.cloud.AbstractZkTestCase.buildZooKeeper(AbstractZkTestCase.java:85)
	at org.apache.solr.cloud.AbstractDistribZkTestBase.setUp(AbstractDistribZkTestBase.java:77)
	at org.apache.solr.cloud.AbstractFullDistribZkTestBase.setUp(AbstractFullDistribZkTestBase.java:201)
	at org.apache.solr.client.solrj.impl.CloudSolrServerTest.setUp(CloudSolrServerTest.java:95)
	at sun.reflect.NativeMethodAccessorImpl.invoke0(Native Method)
	at sun.reflect.NativeMethodAccessorImpl.invoke(NativeMethodAccessorImpl.java:62)
	at sun.reflect.DelegatingMethodAccessorImpl.invoke(DelegatingMethodAccessorImpl.java:43)
	at java.lang.reflect.Method.invoke(Method.java:483)
	at com.carrotsearch.randomizedtesting.RandomizedRunner.invoke(RandomizedRunner.java:1617)
	at com.carrotsearch.randomizedtesting.RandomizedRunner$7.evaluate(RandomizedRunner.java:860)
	at com.carrotsearch.randomizedtesting.RandomizedRunner$8.evaluate(RandomizedRunner.java:876)
	at com.carrotsearch.randomizedtesting.rules.SystemPropertiesRestoreRule$1.evaluate(SystemPropertiesRestoreRule.java:53)
	at org.apache.lucene.util.TestRuleSetupTeardownChained$1.evaluate(TestRuleSetupTeardownChained.java:50)
	at org.apache.lucene.util.TestRuleFieldCacheSanity$1.evaluate(TestRuleFieldCacheSanity.java:51)
	at org.apache.lucene.util.AbstractBeforeAfterRule$1.evaluate(AbstractBeforeAfterRule.java:46)
	at com.carrotsearch.randomizedtesting.rules.SystemPropertiesInvariantRule$1.evaluate(SystemPropertiesInvariantRule.java:55)
	at org.apache.lucene.util.TestRuleThreadAndTestName$1.evaluate(TestRuleThreadAndTestName.java:49)
	at org.apache.lucene.util.TestRuleIgnoreAfterMaxFailures$1.evaluate(TestRuleIgnoreAfterMaxFailures.java:70)
	at org.apache.lucene.util.TestRuleMarkFailure$1.evaluate(TestRuleMarkFailure.java:48)
	at com.carrotsearch.randomizedtesting.rules.StatementAdapter.evaluate(StatementAdapter.java:36)
	at com.carrotsearch.randomizedtesting.ThreadLeakControl$StatementRunner.run(ThreadLeakControl.java:359)
	at com.carrotsearch.randomizedtesting.ThreadLeakControl.forkTimeoutingTask(ThreadLeakControl.java:783)
	at com.carrotsearch.randomizedtesting.ThreadLeakControl$3.evaluate(ThreadLeakControl.java:443)
	at com.carrotsearch.randomizedtesting.RandomizedRunner.runSingleTest(RandomizedRunner.java:835)
	at com.carrotsearch.randomizedtesting.RandomizedRunner$3.evaluate(RandomizedRunner.java:737)
	at com.carrotsearch.randomizedtesting.RandomizedRunner$4.evaluate(RandomizedRunner.java:771)
	at com.carrotsearch.randomizedtesting.RandomizedRunner$5.evaluate(RandomizedRunner.java:782)
	at com.carrotsearch.randomizedtesting.rules.StatementAdapter.evaluate(StatementAdapter.java:36)
	at com.carrotsearch.randomizedtesting.rules.SystemPropertiesRestoreRule$1.evaluate(SystemPropertiesRestoreRule.java:53)
	at org.apache.lucene.util.AbstractBeforeAfterRule$1.evaluate(AbstractBeforeAfterRule.java:46)
	at org.apache.lucene.util.TestRuleStoreClassName$1.evaluate(TestRuleStoreClassName.java:42)
	at com.carrotsearch.randomizedtesting.rules.SystemPropertiesInvariantRule$1.evaluate(SystemPropertiesInvariantRule.java:55)
	at com.carrotsearch.randomizedtesting.rules.NoShadowingOrOverridesOnMethodsRule$1.evaluate(NoShadowingOrOverridesOnMethodsRule.java:39)
	at com.carrotsearch.randomizedtesting.rules.NoShadowingOrOverridesOnMethodsRule$1.evaluate(NoShadowingOrOverridesOnMethodsRule.java:39)
	at com.carrotsearch.randomizedtesting.rules.StatementAdapter.evaluate(StatementAdapter.java:36)
	at org.apache.lucene.util.TestRuleAssertionsRequired$1.evaluate(TestRuleAssertionsRequired.java:43)
	at org.apache.lucene.util.TestRuleMarkFailure$1.evaluate(TestRuleMarkFailure.java:48)
	at org.apache.lucene.util.TestRuleIgnoreAfterMaxFailures$1.evaluate(TestRuleIgnoreAfterMaxFailures.java:70)
	at org.apache.lucene.util.TestRuleIgnoreTestSuites$1.evaluate(TestRuleIgnoreTestSuites.java:55)
	at com.carrotsearch.randomizedtesting.rules.StatementAdapter.evaluate(StatementAdapter.java:36)
	at com.carrotsearch.randomizedtesting.ThreadLeakControl$StatementRunner.run(ThreadLeakControl.java:359)
	at java.lang.Thread.run(Thread.java:744)
Caused by: java.util.concurrent.TimeoutException: Could not connect to ZooKeeper 127.0.0.1:59004
within 45000 ms
	at org.apache.solr.common.cloud.ConnectionManager.waitForConnected(ConnectionManager.java:223)
	at org.apache.solr.common.cloud.SolrZkClient.<init>(SolrZkClient.java:142)
	... 45 more




Build Log:
[...truncated 11648 lines...]
   [junit4] Suite: org.apache.solr.client.solrj.impl.CloudSolrServerTest
   [junit4]   2> 28231 T130 oas.SolrTestCaseJ4.buildSSLConfig Randomized ssl (false) and
clientAuth (true)
   [junit4]   2> 28231 T130 oas.BaseDistributedSearchTestCase.initHostContext Setting hostContext
system property: /rea/
   [junit4]   2> 28233 T130 oasc.AbstractZkTestCase.<clinit> WARN TEST_HOME() does
not exist - solrj test?
   [junit4]   2> 28237 T130 oas.SolrTestCaseJ4.setUp ###Starting testDistribSearch
   [junit4]   2> Creating dataDir: /mnt/ssd/jenkins/workspace/Lucene-Solr-trunk-Linux/solr/build/solr-solrj/test/J0/./solrtest-CloudSolrServerTest-1395793252856
   [junit4]   2> 28239 T130 oasc.ZkTestServer.run STARTING ZK TEST SERVER
   [junit4]   2> 28241 T131 oasc.ZkTestServer$ZKServerMain.runFromConfig Starting server
   [junit4]   2> 28341 T130 oasc.ZkTestServer.run start zk server on port:59004
   [junit4]   2> 28377 T130 oascc.ConnectionManager.waitForConnected Waiting for client
to connect to ZooKeeper
   [junit4]   2> 87896 T134 oazsp.FileTxnLog.commit WARN fsync-ing the write ahead log
in SyncThread:0 took 59499ms which will adversely effect operation latency. See the ZooKeeper
troubleshooting guide
   [junit4]   2> 87897 T130 oas.SolrTestCaseJ4.tearDown ###Ending testDistribSearch
   [junit4]   2> 87915 T132 oazs.NIOServerCnxn.doIO WARN caught end of stream exception
EndOfStreamException: Unable to read additional data from client sessionid 0x144fbc2d23b0000,
likely client has closed socket
   [junit4]   2> 	at org.apache.zookeeper.server.NIOServerCnxn.doIO(NIOServerCnxn.java:228)
   [junit4]   2> 	at org.apache.zookeeper.server.NIOServerCnxnFactory.run(NIOServerCnxnFactory.java:208)
   [junit4]   2> 	at java.lang.Thread.run(Thread.java:744)
   [junit4]   2> 
   [junit4]   2> 87926 T130 oasc.ZkTestServer.send4LetterWord connecting to 127.0.0.1:59004
59004
   [junit4]   1> client port:0.0.0.0/0.0.0.0:0
   [junit4]   2> NOTE: reproduce with: ant test  -Dtestcase=CloudSolrServerTest -Dtests.method=testDistribSearch
-Dtests.seed=10D89F0D312B7E32 -Dtests.multiplier=3 -Dtests.slow=true -Dtests.locale=es_CR
-Dtests.timezone=Asia/Dubai -Dtests.file.encoding=UTF-8
   [junit4] ERROR   59.8s J0 | CloudSolrServerTest.testDistribSearch <<<
   [junit4]    > Throwable #1: org.apache.solr.common.SolrException: java.util.concurrent.TimeoutException:
Could not connect to ZooKeeper 127.0.0.1:59004 within 45000 ms
   [junit4]    > 	at __randomizedtesting.SeedInfo.seed([10D89F0D312B7E32:913E111546741E0E]:0)
   [junit4]    > 	at org.apache.solr.common.cloud.SolrZkClient.<init>(SolrZkClient.java:150)
   [junit4]    > 	at org.apache.solr.common.cloud.SolrZkClient.<init>(SolrZkClient.java:101)
   [junit4]    > 	at org.apache.solr.common.cloud.SolrZkClient.<init>(SolrZkClient.java:91)
   [junit4]    > 	at org.apache.solr.cloud.AbstractZkTestCase.buildZooKeeper(AbstractZkTestCase.java:91)
   [junit4]    > 	at org.apache.solr.cloud.AbstractZkTestCase.buildZooKeeper(AbstractZkTestCase.java:85)
   [junit4]    > 	at org.apache.solr.cloud.AbstractDistribZkTestBase.setUp(AbstractDistribZkTestBase.java:77)
   [junit4]    > 	at org.apache.solr.cloud.AbstractFullDistribZkTestBase.setUp(AbstractFullDistribZkTestBase.java:201)
   [junit4]    > 	at org.apache.solr.client.solrj.impl.CloudSolrServerTest.setUp(CloudSolrServerTest.java:95)
   [junit4]    > 	at java.lang.Thread.run(Thread.java:744)
   [junit4]    > Caused by: java.util.concurrent.TimeoutException: Could not connect to
ZooKeeper 127.0.0.1:59004 within 45000 ms
   [junit4]    > 	at org.apache.solr.common.cloud.ConnectionManager.waitForConnected(ConnectionManager.java:223)
   [junit4]    > 	at org.apache.solr.common.cloud.SolrZkClient.<init>(SolrZkClient.java:142)
   [junit4]    > 	... 45 more
   [junit4]   2> 88062 T130 oas.SolrTestCaseJ4.setUp ###Starting testShutdown
   [junit4]   2> Creating dataDir: /mnt/ssd/jenkins/workspace/Lucene-Solr-trunk-Linux/solr/build/solr-solrj/test/J0/./solrtest-CloudSolrServerTest-1395793312681
   [junit4]   2> 88062 T130 oasc.ZkTestServer.run STARTING ZK TEST SERVER
   [junit4]   2> 88063 T138 oasc.ZkTestServer$ZKServerMain.runFromConfig Starting server
   [junit4]   2> 88163 T130 oasc.ZkTestServer.run start zk server on port:54733
   [junit4]   2> 88164 T130 oascc.ConnectionManager.waitForConnected Waiting for client
to connect to ZooKeeper
   [junit4]   2> 88219 T144 oascc.ConnectionManager.process Watcher org.apache.solr.common.cloud.ConnectionManager@1bd603f
name:ZooKeeperConnection Watcher:127.0.0.1:54733 got event WatchedEvent state:SyncConnected
type:None path:null path:null type:None
   [junit4]   2> 88219 T130 oascc.ConnectionManager.waitForConnected Client is connected
to ZooKeeper
   [junit4]   2> 88221 T130 oascc.SolrZkClient.makePath makePath: /solr
   [junit4]   2> 88245 T130 oascc.ConnectionManager.waitForConnected Waiting for client
to connect to ZooKeeper
   [junit4]   2> 88247 T146 oascc.ConnectionManager.process Watcher org.apache.solr.common.cloud.ConnectionManager@e946f0
name:ZooKeeperConnection Watcher:127.0.0.1:54733/solr got event WatchedEvent state:SyncConnected
type:None path:null path:null type:None
   [junit4]   2> 88247 T130 oascc.ConnectionManager.waitForConnected Client is connected
to ZooKeeper
   [junit4]   2> 88251 T130 oascc.SolrZkClient.makePath makePath: /collections/collection1
   [junit4]   2> 88255 T130 oascc.SolrZkClient.makePath makePath: /collections/collection1/shards
   [junit4]   2> 88258 T130 oascc.SolrZkClient.makePath makePath: /collections/control_collection
   [junit4]   2> 88263 T130 oascc.SolrZkClient.makePath makePath: /collections/control_collection/shards
   [junit4]   2> 88269 T130 oasc.AbstractZkTestCase.putConfig put /mnt/ssd/jenkins/workspace/Lucene-Solr-trunk-Linux/solr/solrj/src/test-files/solrj/solr/collection1/conf/solrconfig.xml
to /configs/conf1/solrconfig.xml
   [junit4]   2> 88270 T130 oascc.SolrZkClient.makePath makePath: /configs/conf1/solrconfig.xml
   [junit4]   2> 88277 T130 oasc.AbstractZkTestCase.putConfig put /mnt/ssd/jenkins/workspace/Lucene-Solr-trunk-Linux/solr/solrj/src/test-files/solrj/solr/collection1/conf/schema.xml
to /configs/conf1/schema.xml
   [junit4]   2> 88278 T130 oascc.SolrZkClient.makePath makePath: /configs/conf1/schema.xml
   [junit4]   2> 88281 T130 oasc.AbstractZkTestCase.putConfig skipping /mnt/ssd/jenkins/workspace/Lucene-Solr-trunk-Linux/solr/solrj/src/test-files/solrj/solr/collection1/conf/solrconfig.snippet.randomindexconfig.xml
because it doesn't exist
   [junit4]   2> 88282 T130 oasc.AbstractZkTestCase.putConfig skipping /mnt/ssd/jenkins/workspace/Lucene-Solr-trunk-Linux/solr/solrj/src/test-files/solrj/solr/collection1/conf/stopwords.txt
because it doesn't exist
   [junit4]   2> 88282 T130 oasc.AbstractZkTestCase.putConfig skipping /mnt/ssd/jenkins/workspace/Lucene-Solr-trunk-Linux/solr/solrj/src/test-files/solrj/solr/collection1/conf/protwords.txt
because it doesn't exist
   [junit4]   2> 88283 T130 oasc.AbstractZkTestCase.putConfig skipping /mnt/ssd/jenkins/workspace/Lucene-Solr-trunk-Linux/solr/solrj/src/test-files/solrj/solr/collection1/conf/currency.xml
because it doesn't exist
   [junit4]   2> 88283 T130 oasc.AbstractZkTestCase.putConfig skipping /mnt/ssd/jenkins/workspace/Lucene-Solr-trunk-Linux/solr/solrj/src/test-files/solrj/solr/collection1/conf/enumsConfig.xml
because it doesn't exist
   [junit4]   2> 88284 T130 oasc.AbstractZkTestCase.putConfig skipping /mnt/ssd/jenkins/workspace/Lucene-Solr-trunk-Linux/solr/solrj/src/test-files/solrj/solr/collection1/conf/open-exchange-rates.json
because it doesn't exist
   [junit4]   2> 88284 T130 oasc.AbstractZkTestCase.putConfig skipping /mnt/ssd/jenkins/workspace/Lucene-Solr-trunk-Linux/solr/solrj/src/test-files/solrj/solr/collection1/conf/mapping-ISOLatin1Accent.txt
because it doesn't exist
   [junit4]   2> 88284 T130 oasc.AbstractZkTestCase.putConfig skipping /mnt/ssd/jenkins/workspace/Lucene-Solr-trunk-Linux/solr/solrj/src/test-files/solrj/solr/collection1/conf/old_synonyms.txt
because it doesn't exist
   [junit4]   2> 88285 T130 oasc.AbstractZkTestCase.putConfig skipping /mnt/ssd/jenkins/workspace/Lucene-Solr-trunk-Linux/solr/solrj/src/test-files/solrj/solr/collection1/conf/synonyms.txt
because it doesn't exist
   [junit4]   2> 88294 T130 oascc.ConnectionManager.waitForConnected Waiting for client
to connect to ZooKeeper
   [junit4]   2> 88298 T147 oaz.ClientCnxnSocketNIO.connect ERROR Unable to open socket
to ff01::114/ff01:0:0:0:0:0:0:114:33332
   [junit4]   2> 88299 T147 oaz.ClientCnxn$SendThread.run WARN Session 0x0 for server null,
unexpected error, closing socket connection and attempting reconnect java.net.SocketException:
Network is unreachable
   [junit4]   2> 	at sun.nio.ch.Net.connect0(Native Method)
   [junit4]   2> 	at sun.nio.ch.Net.connect(Net.java:435)
   [junit4]   2> 	at sun.nio.ch.Net.connect(Net.java:427)
   [junit4]   2> 	at sun.nio.ch.SocketChannelImpl.connect(SocketChannelImpl.java:643)
   [junit4]   2> 	at org.apache.zookeeper.ClientCnxnSocketNIO.registerAndConnect(ClientCnxnSocketNIO.java:277)
   [junit4]   2> 	at org.apache.zookeeper.ClientCnxnSocketNIO.connect(ClientCnxnSocketNIO.java:287)
   [junit4]   2> 	at org.apache.zookeeper.ClientCnxn$SendThread.startConnect(ClientCnxn.java:967)
   [junit4]   2> 	at org.apache.zookeeper.ClientCnxn$SendThread.run(ClientCnxn.java:1003)
   [junit4]   2> 
   [junit4]   2> 89401 T147 oaz.ClientCnxnSocketNIO.connect ERROR Unable to open socket
to ff01::114/ff01:0:0:0:0:0:0:114:33332
   [junit4]   2> 89504 T130 oas.SolrTestCaseJ4.tearDown ###Ending testShutdown
   [junit4]   2> 89506 T130 oasc.ZkTestServer.send4LetterWord connecting to 127.0.0.1:54733
54733
   [junit4]   1> client port:0.0.0.0/0.0.0.0:0
   [junit4]   2> 89592 T130 oas.SolrTestCaseJ4.deleteCore ###deleteCore
   [junit4]   2> 61367 T129 ccr.ThreadLeakControl.checkThreadLeaks WARNING Will linger
awaiting termination of 1 leaked thread(s).
   [junit4]   2> NOTE: test params are: codec=Lucene40, sim=DefaultSimilarity, locale=es_CR,
timezone=Asia/Dubai
   [junit4]   2> NOTE: Linux 3.8.0-37-generic i386/Oracle Corporation 1.8.0 (32-bit)/cpus=8,threads=1,free=166895408,total=214958080
   [junit4]   2> NOTE: All tests run in this JVM: [DocumentAnalysisResponseTest, SolrExampleStreamingBinaryTest,
TestXMLEscaping, TestCoreAdmin, TestDocumentObjectBinder, NoOpResponseParserTest, TestUpdateRequestCodec,
SolrExceptionTest, TestJavaBinCodec, LargeVolumeEmbeddedTest, JettyWebappTest, AnlysisResponseBaseTest,
CloudSolrServerTest]
   [junit4] Completed on J0 in 62.40s, 2 tests, 1 error <<< FAILURES!

[...truncated 94 lines...]
BUILD FAILED
/mnt/ssd/jenkins/workspace/Lucene-Solr-trunk-Linux/build.xml:467: The following error occurred
while executing this line:
/mnt/ssd/jenkins/workspace/Lucene-Solr-trunk-Linux/build.xml:447: The following error occurred
while executing this line:
/mnt/ssd/jenkins/workspace/Lucene-Solr-trunk-Linux/build.xml:45: The following error occurred
while executing this line:
/mnt/ssd/jenkins/workspace/Lucene-Solr-trunk-Linux/extra-targets.xml:37: The following error
occurred while executing this line:
/mnt/ssd/jenkins/workspace/Lucene-Solr-trunk-Linux/solr/build.xml:202: The following error
occurred while executing this line:
/mnt/ssd/jenkins/workspace/Lucene-Solr-trunk-Linux/solr/common-build.xml:490: The following
error occurred while executing this line:
/mnt/ssd/jenkins/workspace/Lucene-Solr-trunk-Linux/lucene/common-build.xml:1275: The following
error occurred while executing this line:
/mnt/ssd/jenkins/workspace/Lucene-Solr-trunk-Linux/lucene/common-build.xml:907: There were
test failures: 49 suites, 284 tests, 1 error

Total time: 56 minutes 11 seconds
Build step 'Invoke Ant' marked build as failure
Description set: Java: 32bit/jdk1.8.0 -server -XX:+UseParallelGC
Archiving artifacts
Recording test results
Email was triggered for: Failure
Sending email for trigger: Failure



Mime
View raw message