lucene-dev mailing list archives

Site index · List index
Message view « Date » · « Thread »
Top « Date » · « Thread »
From Policeman Jenkins Server <jenk...@thetaphi.de>
Subject [JENKINS] Lucene-Solr-4.x-Linux (64bit/jdk1.7.0_51) - Build # 9755 - Failure!
Date Fri, 21 Mar 2014 04:45:33 GMT
Build: http://jenkins.thetaphi.de/job/Lucene-Solr-4.x-Linux/9755/
Java: 64bit/jdk1.7.0_51 -XX:-UseCompressedOops -XX:+UseConcMarkSweepGC -XX:-UseSuperWord

1 tests failed.
FAILED:  junit.framework.TestSuite.org.apache.solr.rest.schema.TestDynamicFieldCollectionResource

Error Message:
ERROR: SolrIndexSearcher opens=1 closes=3

Stack Trace:
java.lang.AssertionError: ERROR: SolrIndexSearcher opens=1 closes=3
	at __randomizedtesting.SeedInfo.seed([AF66F1D89DBCEAEB]:0)
	at org.junit.Assert.fail(Assert.java:93)
	at org.apache.solr.SolrTestCaseJ4.endTrackingSearchers(SolrTestCaseJ4.java:405)
	at org.apache.solr.SolrTestCaseJ4.afterClass(SolrTestCaseJ4.java:176)
	at sun.reflect.GeneratedMethodAccessor29.invoke(Unknown Source)
	at sun.reflect.DelegatingMethodAccessorImpl.invoke(DelegatingMethodAccessorImpl.java:43)
	at java.lang.reflect.Method.invoke(Method.java:606)
	at com.carrotsearch.randomizedtesting.RandomizedRunner.invoke(RandomizedRunner.java:1617)
	at com.carrotsearch.randomizedtesting.RandomizedRunner$5.evaluate(RandomizedRunner.java:789)
	at com.carrotsearch.randomizedtesting.rules.StatementAdapter.evaluate(StatementAdapter.java:36)
	at com.carrotsearch.randomizedtesting.rules.SystemPropertiesRestoreRule$1.evaluate(SystemPropertiesRestoreRule.java:53)
	at org.apache.lucene.util.AbstractBeforeAfterRule$1.evaluate(AbstractBeforeAfterRule.java:46)
	at org.apache.lucene.util.TestRuleStoreClassName$1.evaluate(TestRuleStoreClassName.java:42)
	at com.carrotsearch.randomizedtesting.rules.SystemPropertiesInvariantRule$1.evaluate(SystemPropertiesInvariantRule.java:55)
	at com.carrotsearch.randomizedtesting.rules.NoShadowingOrOverridesOnMethodsRule$1.evaluate(NoShadowingOrOverridesOnMethodsRule.java:39)
	at com.carrotsearch.randomizedtesting.rules.NoShadowingOrOverridesOnMethodsRule$1.evaluate(NoShadowingOrOverridesOnMethodsRule.java:39)
	at com.carrotsearch.randomizedtesting.rules.StatementAdapter.evaluate(StatementAdapter.java:36)
	at org.apache.lucene.util.TestRuleAssertionsRequired$1.evaluate(TestRuleAssertionsRequired.java:43)
	at org.apache.lucene.util.TestRuleMarkFailure$1.evaluate(TestRuleMarkFailure.java:48)
	at org.apache.lucene.util.TestRuleIgnoreAfterMaxFailures$1.evaluate(TestRuleIgnoreAfterMaxFailures.java:70)
	at org.apache.lucene.util.TestRuleIgnoreTestSuites$1.evaluate(TestRuleIgnoreTestSuites.java:55)
	at com.carrotsearch.randomizedtesting.rules.StatementAdapter.evaluate(StatementAdapter.java:36)
	at com.carrotsearch.randomizedtesting.ThreadLeakControl$StatementRunner.run(ThreadLeakControl.java:359)
	at java.lang.Thread.run(Thread.java:744)




Build Log:
[...truncated 10443 lines...]
   [junit4] Suite: org.apache.solr.rest.schema.TestDynamicFieldCollectionResource
   [junit4]   2> 287789 T1125 oas.SolrTestCaseJ4.buildSSLConfig Randomized ssl (true) and
clientAuth (true)
   [junit4]   2> 287790 T1125 oas.SolrTestCaseJ4.initCore ####initCore
   [junit4]   2> Creating dataDir: /mnt/ssd/jenkins/workspace/Lucene-Solr-4.x-Linux/solr/build/solr-core/test/J1/./solrtest-TestDynamicFieldCollectionResource-1395375921711
   [junit4]   2> 287790 T1125 oas.SolrTestCaseJ4.initCore ####initCore end
   [junit4]   2> 287791 T1125 oejs.Server.doStart jetty-8.1.10.v20130312
   [junit4]   2> 287794 T1125 oejus.SslContextFactory.doStart Enabled Protocols [SSLv2Hello,
SSLv3, TLSv1, TLSv1.1, TLSv1.2] of [SSLv2Hello, SSLv3, TLSv1, TLSv1.1, TLSv1.2]
   [junit4]   2> 287797 T1125 oejs.AbstractConnector.doStart Started SslSelectChannelConnector@127.0.0.1:47178
   [junit4]   2> 287798 T1125 oass.SolrDispatchFilter.init SolrDispatchFilter.init()
   [junit4]   2> 287799 T1125 oasc.SolrResourceLoader.locateSolrHome JNDI not configured
for solr (NoInitialContextEx)
   [junit4]   2> 287799 T1125 oasc.SolrResourceLoader.locateSolrHome using system property
solr.solr.home: /mnt/ssd/jenkins/workspace/Lucene-Solr-4.x-Linux/solr/core/src/test-files/solr
   [junit4]   2> 287799 T1125 oasc.SolrResourceLoader.<init> new SolrResourceLoader
for directory: '/mnt/ssd/jenkins/workspace/Lucene-Solr-4.x-Linux/solr/core/src/test-files/solr/'
   [junit4]   2> 287813 T1125 oasc.ConfigSolr.fromFile Loading container configuration
from /mnt/ssd/jenkins/workspace/Lucene-Solr-4.x-Linux/solr/core/src/test-files/solr/solr.xml
   [junit4]   2> 287857 T1125 oasc.CoreContainer.<init> New CoreContainer 811381485
   [junit4]   2> 287857 T1125 oasc.CoreContainer.load Loading cores into CoreContainer
[instanceDir=/mnt/ssd/jenkins/workspace/Lucene-Solr-4.x-Linux/solr/core/src/test-files/solr/]
   [junit4]   2> 287858 T1125 oashc.HttpShardHandlerFactory.getParameter Setting socketTimeout
to: 90000
   [junit4]   2> 287859 T1125 oashc.HttpShardHandlerFactory.getParameter Setting urlScheme
to: https
   [junit4]   2> 287859 T1125 oashc.HttpShardHandlerFactory.getParameter Setting connTimeout
to: 15000
   [junit4]   2> 287859 T1125 oashc.HttpShardHandlerFactory.getParameter Setting maxConnectionsPerHost
to: 20
   [junit4]   2> 287859 T1125 oashc.HttpShardHandlerFactory.getParameter Setting corePoolSize
to: 0
   [junit4]   2> 287859 T1125 oashc.HttpShardHandlerFactory.getParameter Setting maximumPoolSize
to: 2147483647
   [junit4]   2> 287860 T1125 oashc.HttpShardHandlerFactory.getParameter Setting maxThreadIdleTime
to: 5
   [junit4]   2> 287860 T1125 oashc.HttpShardHandlerFactory.getParameter Setting sizeOfQueue
to: -1
   [junit4]   2> 287860 T1125 oashc.HttpShardHandlerFactory.getParameter Setting fairnessPolicy
to: false
   [junit4]   2> 287862 T1125 oasl.LogWatcher.createWatcher SLF4J impl is org.slf4j.impl.Log4jLoggerFactory
   [junit4]   2> 287862 T1125 oasl.LogWatcher.newRegisteredLogWatcher Registering Log Listener
[Log4j (org.slf4j.impl.Log4jLoggerFactory)]
   [junit4]   2> 287863 T1125 oasc.CoreContainer.load Host Name: 127.0.0.1
   [junit4]   2> 287867 T1135 oasc.CoreContainer.create Creating SolrCore 'collection1'
using instanceDir: /mnt/ssd/jenkins/workspace/Lucene-Solr-4.x-Linux/solr/core/src/test-files/solr/collection1
   [junit4]   2> 287867 T1135 oasc.SolrResourceLoader.<init> new SolrResourceLoader
for directory: '/mnt/ssd/jenkins/workspace/Lucene-Solr-4.x-Linux/solr/core/src/test-files/solr/collection1/'
   [junit4]   2> 287868 T1135 oasc.SolrResourceLoader.replaceClassLoader Adding 'file:/mnt/ssd/jenkins/workspace/Lucene-Solr-4.x-Linux/solr/core/src/test-files/solr/collection1/lib/.svn/'
to classloader
   [junit4]   2> 287868 T1135 oasc.SolrResourceLoader.replaceClassLoader Adding 'file:/mnt/ssd/jenkins/workspace/Lucene-Solr-4.x-Linux/solr/core/src/test-files/solr/collection1/lib/classes/'
to classloader
   [junit4]   2> 287868 T1135 oasc.SolrResourceLoader.replaceClassLoader Adding 'file:/mnt/ssd/jenkins/workspace/Lucene-Solr-4.x-Linux/solr/core/src/test-files/solr/collection1/lib/README'
to classloader
   [junit4]   2> 287913 T1135 oasc.SolrConfig.<init> Using Lucene MatchVersion: LUCENE_48
   [junit4]   2> 287966 T1135 oasc.SolrConfig.<init> Loaded SolrConfig: solrconfig.xml
   [junit4]   2> 287966 T1135 oass.IndexSchema.readSchema Reading Solr Schema from schema-rest.xml
   [junit4]   2> 287972 T1135 oass.IndexSchema.readSchema [collection1] Schema name=test-rest
   [junit4]   2> 288305 T1135 oass.IndexSchema.readSchema default search field in schema
is text
   [junit4]   2> 288306 T1135 oass.IndexSchema.readSchema query parser default operator
is OR
   [junit4]   2> 288307 T1135 oass.IndexSchema.readSchema unique key field: id
   [junit4]   2> 288309 T1135 oass.IndexSchema.readSchema WARN Field title is not multivalued
and destination for multiple copyFields (3)
   [junit4]   2> 288320 T1135 oasc.SolrCore.initDirectoryFactory org.apache.solr.core.MockDirectoryFactory
   [junit4]   2> 288321 T1135 oasc.SolrCore.<init> [collection1] Opening new SolrCore
at /mnt/ssd/jenkins/workspace/Lucene-Solr-4.x-Linux/solr/core/src/test-files/solr/collection1/,
dataDir=/mnt/ssd/jenkins/workspace/Lucene-Solr-4.x-Linux/solr/build/solr-core/test/J1/solrtest-TestDynamicFieldCollectionResource-1395375921711/
   [junit4]   2> 288321 T1135 oasc.JmxMonitoredMap.<init> JMX monitoring is enabled.
Adding Solr mbeans to JMX Server: com.sun.jmx.mbeanserver.JmxMBeanServer@3d55c7a8
   [junit4]   2> 288321 T1135 oasc.CachingDirectoryFactory.get return new directory for
/mnt/ssd/jenkins/workspace/Lucene-Solr-4.x-Linux/solr/build/solr-core/test/J1/solrtest-TestDynamicFieldCollectionResource-1395375921711
   [junit4]   2> 288322 T1135 oasc.SolrCore.getNewIndexDir New index directory detected:
old=null new=/mnt/ssd/jenkins/workspace/Lucene-Solr-4.x-Linux/solr/build/solr-core/test/J1/solrtest-TestDynamicFieldCollectionResource-1395375921711/index/
   [junit4]   2> 288322 T1135 oasc.SolrCore.initIndex WARN [collection1] Solr index directory
'/mnt/ssd/jenkins/workspace/Lucene-Solr-4.x-Linux/solr/build/solr-core/test/J1/solrtest-TestDynamicFieldCollectionResource-1395375921711/index'
doesn't exist. Creating new index...
   [junit4]   2> 288322 T1135 oasc.CachingDirectoryFactory.get return new directory for
/mnt/ssd/jenkins/workspace/Lucene-Solr-4.x-Linux/solr/build/solr-core/test/J1/solrtest-TestDynamicFieldCollectionResource-1395375921711/index
   [junit4]   2> 288322 T1135 oasu.RandomMergePolicy.<init> RandomMergePolicy wrapping
class org.apache.lucene.index.TieredMergePolicy: [TieredMergePolicy: maxMergeAtOnce=24, maxMergeAtOnceExplicit=15,
maxMergedSegmentMB=55.8134765625, floorSegmentMB=0.642578125, forceMergeDeletesPctAllowed=27.462701562914983,
segmentsPerTier=33.0, maxCFSSegmentSizeMB=8.796093022207999E12, noCFSRatio=0.1369201664393449
   [junit4]   2> 288323 T1135 oasc.SolrDeletionPolicy.onCommit SolrDeletionPolicy.onCommit:
commits: num=1
   [junit4]   2> 		commit{dir=RateLimitedDirectoryWrapper(MockDirectoryWrapper(RAMDirectory@5f85599b
lockFactory=org.apache.lucene.store.SingleInstanceLockFactory@6372d3b)),segFN=segments_1,generation=1}
   [junit4]   2> 288323 T1135 oasc.SolrDeletionPolicy.updateCommits newest commit generation
= 1
   [junit4]   2> 288323 T1135 oasc.SolrCore.initWriters created xml: solr.XMLResponseWriter
   [junit4]   2> 288326 T1135 oasup.UpdateRequestProcessorChain.init creating updateRequestProcessorChain
"dedupe"
   [junit4]   2> 288327 T1135 oasup.UpdateRequestProcessorChain.init inserting DistributedUpdateProcessorFactory
into updateRequestProcessorChain "dedupe"
   [junit4]   2> 288327 T1135 oasup.UpdateRequestProcessorChain.init creating updateRequestProcessorChain
"dedupe-allfields"
   [junit4]   2> 288327 T1135 oasup.UpdateRequestProcessorChain.init inserting DistributedUpdateProcessorFactory
into updateRequestProcessorChain "dedupe-allfields"
   [junit4]   2> 288327 T1135 oasup.UpdateRequestProcessorChain.init creating updateRequestProcessorChain
"stored_sig"
   [junit4]   2> 288327 T1135 oasup.UpdateRequestProcessorChain.init inserting DistributedUpdateProcessorFactory
into updateRequestProcessorChain "stored_sig"
   [junit4]   2> 288327 T1135 oasup.UpdateRequestProcessorChain.init creating updateRequestProcessorChain
"uniq-fields"
   [junit4]   2> 288328 T1135 oasup.UniqFieldsUpdateProcessorFactory.init WARN Use of the
'fields' init param in UniqFieldsUpdateProcessorFactory is deprecated, please use 'fieldName'
(or another FieldMutatingUpdateProcessorFactory selector option) instead
   [junit4]   2> 288328 T1135 oasup.UniqFieldsUpdateProcessorFactory.init Replacing 'fields'
init param with (individual) 'fieldName' params
   [junit4]   2> 288328 T1135 oasup.UpdateRequestProcessorChain.init inserting DistributedUpdateProcessorFactory
into updateRequestProcessorChain "uniq-fields"
   [junit4]   2> 288328 T1135 oasup.UpdateRequestProcessorChain.init creating updateRequestProcessorChain
"distrib-dup-test-chain-explicit"
   [junit4]   2> 288328 T1135 oasup.UpdateRequestProcessorChain.init creating updateRequestProcessorChain
"distrib-dup-test-chain-implicit"
   [junit4]   2> 288329 T1135 oasup.UpdateRequestProcessorChain.init inserting DistributedUpdateProcessorFactory
into updateRequestProcessorChain "distrib-dup-test-chain-implicit"
   [junit4]   2> 288329 T1135 oasc.SolrCore.loadUpdateProcessorChains no updateRequestProcessorChain
defined as default, creating implicit default
   [junit4]   2> 288329 T1135 oasc.RequestHandlers.initHandlersFromConfig adding lazy requestHandler:
solr.ReplicationHandler
   [junit4]   2> 288329 T1135 oasc.RequestHandlers.initHandlersFromConfig created /replication:
solr.ReplicationHandler
   [junit4]   2> 288330 T1135 oasc.RequestHandlers.initHandlersFromConfig created standard:
solr.StandardRequestHandler
   [junit4]   2> 288330 T1135 oasc.RequestHandlers.initHandlersFromConfig created /get:
solr.RealTimeGetHandler
   [junit4]   2> 288330 T1135 oasc.RequestHandlers.initHandlersFromConfig created dismax:
solr.SearchHandler
   [junit4]   2> 288331 T1135 oasc.RequestHandlers.initHandlersFromConfig created mock:
org.apache.solr.core.MockQuerySenderListenerReqHandler
   [junit4]   2> 288331 T1135 oasc.RequestHandlers.initHandlersFromConfig created /admin/:
org.apache.solr.handler.admin.AdminHandlers
   [junit4]   2> 288331 T1135 oasc.RequestHandlers.initHandlersFromConfig created /admin/file:
solr.admin.ShowFileRequestHandler
   [junit4]   2> 288332 T1135 oasc.RequestHandlers.initHandlersFromConfig created defaults:
solr.StandardRequestHandler
   [junit4]   2> 288332 T1135 oasc.RequestHandlers.initHandlersFromConfig adding lazy requestHandler:
solr.StandardRequestHandler
   [junit4]   2> 288332 T1135 oasc.RequestHandlers.initHandlersFromConfig created lazy:
solr.StandardRequestHandler
   [junit4]   2> 288332 T1135 oasc.RequestHandlers.initHandlersFromConfig created /update:
solr.UpdateRequestHandler
   [junit4]   2> 288333 T1135 oasc.RequestHandlers.initHandlersFromConfig created /terms:
org.apache.solr.handler.component.SearchHandler
   [junit4]   2> 288333 T1135 oasc.RequestHandlers.initHandlersFromConfig created spellCheckCompRH:
org.apache.solr.handler.component.SearchHandler
   [junit4]   2> 288334 T1135 oasc.RequestHandlers.initHandlersFromConfig created spellCheckCompRH_Direct:
org.apache.solr.handler.component.SearchHandler
   [junit4]   2> 288334 T1135 oasc.RequestHandlers.initHandlersFromConfig created spellCheckWithWordbreak:
org.apache.solr.handler.component.SearchHandler
   [junit4]   2> 288334 T1135 oasc.RequestHandlers.initHandlersFromConfig created spellCheckWithWordbreak_Direct:
org.apache.solr.handler.component.SearchHandler
   [junit4]   2> 288335 T1135 oasc.RequestHandlers.initHandlersFromConfig created spellCheckCompRH1:
org.apache.solr.handler.component.SearchHandler
   [junit4]   2> 288335 T1135 oasc.RequestHandlers.initHandlersFromConfig created mltrh:
org.apache.solr.handler.component.SearchHandler
   [junit4]   2> 288335 T1135 oasc.RequestHandlers.initHandlersFromConfig created tvrh:
org.apache.solr.handler.component.SearchHandler
   [junit4]   2> 288336 T1135 oasc.RequestHandlers.initHandlersFromConfig created /mlt:
solr.MoreLikeThisHandler
   [junit4]   2> 288336 T1135 oasc.RequestHandlers.initHandlersFromConfig created /debug/dump:
solr.DumpRequestHandler
   [junit4]   2> 288338 T1135 oashl.XMLLoader.init xsltCacheLifetimeSeconds=60
   [junit4]   2> 288343 T1135 oasc.SolrCore.initDeprecatedSupport WARN solrconfig.xml uses
deprecated <admin/gettableFiles>, Please update your config to use the ShowFileRequestHandler.
   [junit4]   2> 288344 T1135 oasu.CommitTracker.<init> Hard AutoCommit: disabled
   [junit4]   2> 288345 T1135 oasu.CommitTracker.<init> Soft AutoCommit: disabled
   [junit4]   2> 288345 T1135 oasu.RandomMergePolicy.<init> RandomMergePolicy wrapping
class org.apache.lucene.index.TieredMergePolicy: [TieredMergePolicy: maxMergeAtOnce=30, maxMergeAtOnceExplicit=50,
maxMergedSegmentMB=13.4208984375, floorSegmentMB=2.1416015625, forceMergeDeletesPctAllowed=0.43612390233696896,
segmentsPerTier=46.0, maxCFSSegmentSizeMB=8.796093022207999E12, noCFSRatio=1.0
   [junit4]   2> 288346 T1135 oasc.SolrDeletionPolicy.onInit SolrDeletionPolicy.onInit:
commits: num=1
   [junit4]   2> 		commit{dir=RateLimitedDirectoryWrapper(MockDirectoryWrapper(RAMDirectory@5f85599b
lockFactory=org.apache.lucene.store.SingleInstanceLockFactory@6372d3b)),segFN=segments_1,generation=1}
   [junit4]   2> 288346 T1135 oasc.SolrDeletionPolicy.updateCommits newest commit generation
= 1
   [junit4]   2> 288346 T1135 oass.SolrIndexSearcher.<init> Opening Searcher@136c6716[collection1]
main
   [junit4]   2> 288346 T1135 oashc.SpellCheckComponent.inform Initializing spell checkers
   [junit4]   2> 288357 T1135 oass.DirectSolrSpellChecker.init init: {name=direct,classname=DirectSolrSpellChecker,field=lowerfilt,minQueryLength=3}
   [junit4]   2> 288375 T1136 oasc.SolrCore.registerSearcher [collection1] Registered new
searcher Searcher@136c6716[collection1] main{StandardDirectoryReader(segments_1:1:nrt)}
   [junit4]   2> 288379 T1135 oasc.CoreContainer.registerCore registering core: collection1
   [junit4]   2> 288380 T1125 oass.SolrDispatchFilter.init user.dir=/mnt/ssd/jenkins/workspace/Lucene-Solr-4.x-Linux/solr/build/solr-core/test/J1
   [junit4]   2> 288380 T1125 oass.SolrDispatchFilter.init SolrDispatchFilter.init() done
   [junit4]   2> 288380 T1125 oas.SolrJettyTestBase.createJetty Jetty Assigned Port#47178
   [junit4]   2> 288387 T1125 oas.SolrTestCaseJ4.setUp ###Starting testGetAllDynamicFields
   [junit4]   2> ASYNC  NEW_CORE C814 name=collection1 org.apache.solr.core.SolrCore@3cd23716
   [junit4]   2> 288447 T1131 C814 oejsh.ContextHandler$Context.log SolrRestApi: [Restlet]
Attaching application: org.apache.solr.rest.SolrRestApi@256527b5 to URI: /solr/schema
   [junit4]   2> 288449 T1131 C814 oasr.SolrRestApi.createInboundRoot createInboundRoot
started
   [junit4]   2> 288450 T1131 C814 oasr.SolrRestApi.createInboundRoot createInboundRoot
complete
   [junit4]   2> 288451 T1131 C814 oasrs.BaseSchemaResource.handlePostExecution [collection1]
webapp=/solr path=/schema/dynamicfields params={wt=xml&indent=on} status=0 QTime=6 
   [junit4]   2> ASYNC  NEW_CORE C11 name=collection1 org.apache.solr.core.SolrCore@3cd23716
   [junit4]   2> 662 T1131 C11 orel.LogFilter.afterHandle 2014-03-21	10:25:22	127.0.0.1
-	127.0.0.1	47178	GET	/solr/schema/dynamicfields	indent=on&wt=xml	200	-	0	3	https://127.0.0.1:47178
Apache-HttpClient/4.3.1 (java 1.5)	-
   [junit4]   2> 288475 T1125 oas.SolrTestCaseJ4.tearDown ###Ending testGetAllDynamicFields
   [junit4]   2> 288484 T1125 oas.SolrTestCaseJ4.setUp ###Starting testJsonGetAllDynamicFields
   [junit4]   2> 288490 T1133 C814 oasrs.BaseSchemaResource.handlePostExecution [collection1]
webapp=/solr path=/schema/dynamicfields params={wt=json&indent=on} status=0 QTime=2 
   [junit4]   2> 701 T1133 C11 orel.LogFilter.afterHandle 2014-03-21	10:25:22	127.0.0.1
-	127.0.0.1	47178	GET	/solr/schema/dynamicfields	indent=on&wt=json	200	-	0	1	https://127.0.0.1:47178
Apache-HttpClient/4.3.1 (java 1.5)	-
   [junit4]   2> 288494 T1125 oas.SolrTestCaseJ4.tearDown ###Ending testJsonGetAllDynamicFields
   [junit4]   2> 288500 T1125 oas.SolrTestCaseJ4.setUp ###Starting testNotFoundDynamicFields
   [junit4]   2> 288504 T1131 C814 oasrs.DynamicFieldCollectionResource.get Requested dynamic
field '*_not_in_there' not found.
   [junit4]   2> 288505 T1131 C814 oasrs.DynamicFieldCollectionResource.get Requested dynamic
field 'this_one_isnt_either_*' not found.
   [junit4]   2> 288505 T1131 C814 oasrs.BaseSchemaResource.handlePostExecution [collection1]
webapp=/solr path=/schema/dynamicfields params={wt=xml&indent=on&fl=*_not_in_there,this_one_isnt_either_*}
status=0 QTime=2 
   [junit4]   2> 717 T1131 C11 orel.LogFilter.afterHandle 2014-03-21	10:25:22	127.0.0.1
-	127.0.0.1	47178	GET	/solr/schema/dynamicfields	indent=on&wt=xml&fl=*_not_in_there,this_one_isnt_either_*
200	-	0	1	https://127.0.0.1:47178	Apache-HttpClient/4.3.1 (java 1.5)	-
   [junit4]   2> 288508 T1125 oas.SolrTestCaseJ4.tearDown ###Ending testNotFoundDynamicFields
   [junit4]   2> 288516 T1125 oas.SolrTestCaseJ4.setUp ###Starting testJsonGetTwoDynamicFields
   [junit4]   2> 288521 T1134 C814 oasrs.BaseSchemaResource.handlePostExecution [collection1]
webapp=/solr path=/schema/dynamicfields params={wt=json&indent=on&fl=*_i,*_s} status=0
QTime=1 
   [junit4]   2> 732 T1134 C11 orel.LogFilter.afterHandle 2014-03-21	10:25:22	127.0.0.1
-	127.0.0.1	47178	GET	/solr/schema/dynamicfields	indent=on&fl=*_i,*_s&wt=json	200
-	0	1	https://127.0.0.1:47178	Apache-HttpClient/4.3.1 (java 1.5)	-
   [junit4]   2> 288522 T1125 oas.SolrTestCaseJ4.tearDown ###Ending testJsonGetTwoDynamicFields
   [junit4]   2> 288528 T1125 oas.SolrTestCaseJ4.setUp ###Starting testGetTwoDynamicFields
   [junit4]   2> 288533 T1134 C814 oasrs.BaseSchemaResource.handlePostExecution [collection1]
webapp=/solr path=/schema/dynamicfields params={wt=xml&indent=on&fl=*_i,*_s} status=0
QTime=1 
   [junit4]   2> 744 T1134 C11 orel.LogFilter.afterHandle 2014-03-21	10:25:22	127.0.0.1
-	127.0.0.1	47178	GET	/solr/schema/dynamicfields	indent=on&wt=xml&fl=*_i,*_s	200	-
0	1	https://127.0.0.1:47178	Apache-HttpClient/4.3.1 (java 1.5)	-
   [junit4]   2> 288537 T1125 oas.SolrTestCaseJ4.tearDown ###Ending testGetTwoDynamicFields
   [junit4]   2> 288559 T1125 oasc.CoreContainer.shutdown Shutting down CoreContainer instance=811381485
   [junit4]   2> 288559 T1125 oasc.SolrCore.close [collection1]  CLOSING SolrCore org.apache.solr.core.SolrCore@3cd23716
   [junit4]   2> 288577 T1029 oasc.Overseer.createOverseerNode ERROR Could not create Overseer
node org.apache.zookeeper.KeeperException$SessionExpiredException: KeeperErrorCode = Session
expired for /overseer
   [junit4]   2> 	at org.apache.zookeeper.KeeperException.create(KeeperException.java:127)
   [junit4]   2> 	at org.apache.zookeeper.KeeperException.create(KeeperException.java:51)
   [junit4]   2> 	at org.apache.zookeeper.ZooKeeper.create(ZooKeeper.java:783)
   [junit4]   2> 	at org.apache.solr.common.cloud.SolrZkClient$9.execute(SolrZkClient.java:311)
   [junit4]   2> 	at org.apache.solr.common.cloud.SolrZkClient$9.execute(SolrZkClient.java:308)
   [junit4]   2> 	at org.apache.solr.common.cloud.ZkCmdExecutor.retryOperation(ZkCmdExecutor.java:73)
   [junit4]   2> 	at org.apache.solr.common.cloud.SolrZkClient.create(SolrZkClient.java:308)
   [junit4]   2> 	at org.apache.solr.cloud.Overseer.createOverseerNode(Overseer.java:1175)
   [junit4]   2> 	at org.apache.solr.cloud.Overseer.getInQueue(Overseer.java:1139)
   [junit4]   2> 	at org.apache.solr.cloud.ShardLeaderElectionContext.runLeaderProcess(ElectionContext.java:191)
   [junit4]   2> 	at org.apache.solr.cloud.LeaderElector.runIamLeaderProcess(LeaderElector.java:164)
   [junit4]   2> 	at org.apache.solr.cloud.LeaderElector.checkIfIamLeader(LeaderElector.java:108)
   [junit4]   2> 	at org.apache.solr.cloud.LeaderElector.joinElection(LeaderElector.java:289)
   [junit4]   2> 	at org.apache.solr.cloud.ShardLeaderElectionContext.rejoinLeaderElection(ElectionContext.java:422)
   [junit4]   2> 	at org.apache.solr.cloud.ShardLeaderElectionContext.runLeaderProcess(ElectionContext.java:212)
   [junit4]   2> 	at org.apache.solr.cloud.LeaderElector.runIamLeaderProcess(LeaderElector.java:164)
   [junit4]   2> 	at org.apache.solr.cloud.LeaderElector.checkIfIamLeader(LeaderElector.java:108)
   [junit4]   2> 	at org.apache.solr.cloud.LeaderElector.access$000(LeaderElector.java:55)
   [junit4]   2> 	at org.apache.solr.cloud.LeaderElector$1.process(LeaderElector.java:137)
   [junit4]   2> 	at org.apache.zookeeper.ClientCnxn$EventThread.processEvent(ClientCnxn.java:522)
   [junit4]   2> 	at org.apache.zookeeper.ClientCnxn$EventThread.run(ClientCnxn.java:498)
   [junit4]   2> 
   [junit4]   2> 288577 T1125 oasu.DirectUpdateHandler2.close closing DirectUpdateHandler2{commits=0,autocommits=0,soft
autocommits=0,optimizes=0,rollbacks=0,expungeDeletes=0,docsPending=0,adds=0,deletesById=0,deletesByQuery=0,errors=0,cumulative_adds=0,cumulative_deletesById=0,cumulative_deletesByQuery=0,cumulative_errors=0,transaction_logs_total_size=0,transaction_logs_total_number=0}
   [junit4]   2> 288578 T1029 oasc.SolrCore.close [testSolrCloudCollection_shard1_replica1]
 CLOSING SolrCore org.apache.solr.core.SolrCore@213c5165
   [junit4]   2> 288578 T1125 oasu.SolrCoreState.decrefSolrCoreState Closing SolrCoreState
   [junit4]   2> 288579 T1125 oasu.DefaultSolrCoreState.closeIndexWriter SolrCoreState
ref count has reached 0 - closing IndexWriter
   [junit4]   2> 288579 T1125 oasu.DefaultSolrCoreState.closeIndexWriter closing IndexWriter
with IndexWriterCloser
   [junit4]   2> 288580 T1125 oasc.SolrCore.closeSearcher [collection1] Closing main searcher
on request.
   [junit4]   2> 288580 T1125 oasc.CachingDirectoryFactory.close Closing MockDirectoryFactory
- 2 directories currently being tracked
   [junit4]   2> 288580 T1125 oasc.CachingDirectoryFactory.closeCacheValue looking to close
/mnt/ssd/jenkins/workspace/Lucene-Solr-4.x-Linux/solr/build/solr-core/test/J1/solrtest-TestDynamicFieldCollectionResource-1395375921711
[CachedDir<<refCount=0;path=/mnt/ssd/jenkins/workspace/Lucene-Solr-4.x-Linux/solr/build/solr-core/test/J1/solrtest-TestDynamicFieldCollectionResource-1395375921711;done=false>>]
   [junit4]   2> 288580 T1125 oasc.CachingDirectoryFactory.close Closing directory: /mnt/ssd/jenkins/workspace/Lucene-Solr-4.x-Linux/solr/build/solr-core/test/J1/solrtest-TestDynamicFieldCollectionResource-1395375921711
   [junit4]   2> 288581 T1125 oasc.CachingDirectoryFactory.closeCacheValue looking to close
/mnt/ssd/jenkins/workspace/Lucene-Solr-4.x-Linux/solr/build/solr-core/test/J1/solrtest-TestDynamicFieldCollectionResource-1395375921711/index
[CachedDir<<refCount=0;path=/mnt/ssd/jenkins/workspace/Lucene-Solr-4.x-Linux/solr/build/solr-core/test/J1/solrtest-TestDynamicFieldCollectionResource-1395375921711/index;done=false>>]
   [junit4]   2> 288581 T1125 oasc.CachingDirectoryFactory.close Closing directory: /mnt/ssd/jenkins/workspace/Lucene-Solr-4.x-Linux/solr/build/solr-core/test/J1/solrtest-TestDynamicFieldCollectionResource-1395375921711/index
   [junit4]   2> 288584 T1125 oejsh.ContextHandler.doStop stopped o.e.j.s.ServletContextHandler{/solr,null}
   [junit4]   2> 288588 T1029 oasu.DirectUpdateHandler2.close closing DirectUpdateHandler2{commits=1,autocommits=0,soft
autocommits=0,optimizes=0,rollbacks=0,expungeDeletes=0,docsPending=0,adds=0,deletesById=0,deletesByQuery=0,errors=0,cumulative_adds=0,cumulative_deletesById=0,cumulative_deletesByQuery=0,cumulative_errors=0,transaction_logs_total_size=0,transaction_logs_total_number=0}
   [junit4]   2> 288589 T1029 oasu.SolrCoreState.decrefSolrCoreState Closing SolrCoreState
   [junit4]   2> 288589 T1029 oasu.DefaultSolrCoreState.closeIndexWriter SolrCoreState
ref count has reached 0 - closing IndexWriter
   [junit4]   2> 288589 T1029 oasu.DefaultSolrCoreState.closeIndexWriter closing IndexWriter
with IndexWriterCloser
   [junit4]   2> 288590 T1029 oasc.SolrCore.closeSearcher [testSolrCloudCollection_shard1_replica1]
Closing main searcher on request.
   [junit4]   2> 288590 T1029 oasc.CachingDirectoryFactory.close Closing RAMDirectoryFactory
- 2 directories currently being tracked
   [junit4]   2> 288590 T1029 oasc.CachingDirectoryFactory.closeCacheValue looking to close
data/index [CachedDir<<refCount=0;path=data/index;done=false>>]
   [junit4]   2> 288590 T1029 oasc.CachingDirectoryFactory.close Closing directory: data/index
   [junit4]   2> 288590 T1029 oasc.CachingDirectoryFactory.closeCacheValue looking to close
data [CachedDir<<refCount=0;path=data;done=false>>]
   [junit4]   2> 288590 T1029 oasc.CachingDirectoryFactory.close Closing directory: data
   [junit4]   2> 288591 T1029 oasc.LeaderElector$1.process WARN  java.lang.RuntimeException:
org.apache.zookeeper.KeeperException$SessionExpiredException: KeeperErrorCode = Session expired
for /overseer
   [junit4]   2> 	at org.apache.solr.cloud.Overseer.createOverseerNode(Overseer.java:1184)
   [junit4]   2> 	at org.apache.solr.cloud.Overseer.getInQueue(Overseer.java:1139)
   [junit4]   2> 	at org.apache.solr.cloud.ShardLeaderElectionContext.runLeaderProcess(ElectionContext.java:191)
   [junit4]   2> 	at org.apache.solr.cloud.LeaderElector.runIamLeaderProcess(LeaderElector.java:164)
   [junit4]   2> 	at org.apache.solr.cloud.LeaderElector.checkIfIamLeader(LeaderElector.java:108)
   [junit4]   2> 	at org.apache.solr.cloud.LeaderElector.joinElection(LeaderElector.java:289)
   [junit4]   2> 	at org.apache.solr.cloud.ShardLeaderElectionContext.rejoinLeaderElection(ElectionContext.java:422)
   [junit4]   2> 	at org.apache.solr.cloud.ShardLeaderElectionContext.runLeaderProcess(ElectionContext.java:212)
   [junit4]   2> 	at org.apache.solr.cloud.LeaderElector.runIamLeaderProcess(LeaderElector.java:164)
   [junit4]   2> 	at org.apache.solr.cloud.LeaderElector.checkIfIamLeader(LeaderElector.java:108)
   [junit4]   2> 	at org.apache.solr.cloud.LeaderElector.access$000(LeaderElector.java:55)
   [junit4]   2> 	at org.apache.solr.cloud.LeaderElector$1.process(LeaderElector.java:137)
   [junit4]   2> 	at org.apache.zookeeper.ClientCnxn$EventThread.processEvent(ClientCnxn.java:522)
   [junit4]   2> 	at org.apache.zookeeper.ClientCnxn$EventThread.run(ClientCnxn.java:498)
   [junit4]   2> Caused by: org.apache.zookeeper.KeeperException$SessionExpiredException:
KeeperErrorCode = Session expired for /overseer
   [junit4]   2> 	at org.apache.zookeeper.KeeperException.create(KeeperException.java:127)
   [junit4]   2> 	at org.apache.zookeeper.KeeperException.create(KeeperException.java:51)
   [junit4]   2> 	at org.apache.zookeeper.ZooKeeper.create(ZooKeeper.java:783)
   [junit4]   2> 	at org.apache.solr.common.cloud.SolrZkClient$9.execute(SolrZkClient.java:311)
   [junit4]   2> 	at org.apache.solr.common.cloud.SolrZkClient$9.execute(SolrZkClient.java:308)
   [junit4]   2> 	at org.apache.solr.common.cloud.ZkCmdExecutor.retryOperation(ZkCmdExecutor.java:73)
   [junit4]   2> 	at org.apache.solr.common.cloud.SolrZkClient.create(SolrZkClient.java:308)
   [junit4]   2> 	at org.apache.solr.cloud.Overseer.createOverseerNode(Overseer.java:1175)
   [junit4]   2> 	... 13 more
   [junit4]   2> 
   [junit4]   2> 288591 T1029 oascc.ZkStateReader$3.process WARN ZooKeeper watch triggered,
but Solr cannot talk to ZK
   [junit4]   2> 288591 T1029 oascc.ZkStateReader$2.process A cluster state change: WatchedEvent
state:SyncConnected type:NodeDataChanged path:/clusterstate.json, has occurred - updating...
(live nodes size: 4)
   [junit4]   2> 288592 T1029 oascc.ZkStateReader$2.process WARN ZooKeeper watch triggered,
but Solr cannot talk to ZK
   [junit4]   2> 288636 T1125 oas.SolrTestCaseJ4.deleteCore ###deleteCore
   [junit4]   2> 288669 T1013 oasc.Overseer.createOverseerNode ERROR Could not create Overseer
node org.apache.zookeeper.KeeperException$SessionExpiredException: KeeperErrorCode = Session
expired for /overseer
   [junit4]   2> 	at org.apache.zookeeper.KeeperException.create(KeeperException.java:127)
   [junit4]   2> 	at org.apache.zookeeper.KeeperException.create(KeeperException.java:51)
   [junit4]   2> 	at org.apache.zookeeper.ZooKeeper.create(ZooKeeper.java:783)
   [junit4]   2> 	at org.apache.solr.common.cloud.SolrZkClient$9.execute(SolrZkClient.java:311)
   [junit4]   2> 	at org.apache.solr.common.cloud.SolrZkClient$9.execute(SolrZkClient.java:308)
   [junit4]   2> 	at org.apache.solr.common.cloud.ZkCmdExecutor.retryOperation(ZkCmdExecutor.java:73)
   [junit4]   2> 	at org.apache.solr.common.cloud.SolrZkClient.create(SolrZkClient.java:308)
   [junit4]   2> 	at org.apache.solr.cloud.Overseer.createOverseerNode(Overseer.java:1175)
   [junit4]   2> 	at org.apache.solr.cloud.Overseer.getInQueue(Overseer.java:1139)
   [junit4]   2> 	at org.apache.solr.cloud.ShardLeaderElectionContext.runLeaderProcess(ElectionContext.java:191)
   [junit4]   2> 	at org.apache.solr.cloud.LeaderElector.runIamLeaderProcess(LeaderElector.java:164)
   [junit4]   2> 	at org.apache.solr.cloud.LeaderElector.checkIfIamLeader(LeaderElector.java:108)
   [junit4]   2> 	at org.apache.solr.cloud.LeaderElector.joinElection(LeaderElector.java:289)
   [junit4]   2> 	at org.apache.solr.cloud.ShardLeaderElectionContext.rejoinLeaderElection(ElectionContext.java:422)
   [junit4]   2> 	at org.apache.solr.cloud.ShardLeaderElectionContext.runLeaderProcess(ElectionContext.java:212)
   [junit4]   2> 	at org.apache.solr.cloud.LeaderElector.runIamLeaderProcess(LeaderElector.java:164)
   [junit4]   2> 	at org.apache.solr.cloud.LeaderElector.checkIfIamLeader(LeaderElector.java:108)
   [junit4]   2> 	at org.apache.solr.cloud.LeaderElector.access$000(LeaderElector.java:55)
   [junit4]   2> 	at org.apache.solr.cloud.LeaderElector$1.process(LeaderElector.java:137)
   [junit4]   2> 	at org.apache.zookeeper.ClientCnxn$EventThread.processEvent(ClientCnxn.java:522)
   [junit4]   2> 	at org.apache.zookeeper.ClientCnxn$EventThread.run(ClientCnxn.java:498)
   [junit4]   2> 
   [junit4]   2> 288670 T1013 oasc.SolrCore.close [testSolrCloudCollection_shard2_replica1]
 CLOSING SolrCore org.apache.solr.core.SolrCore@7a2bfb59
   [junit4]   2> 288679 T1013 oasu.DirectUpdateHandler2.close closing DirectUpdateHandler2{commits=1,autocommits=0,soft
autocommits=0,optimizes=0,rollbacks=0,expungeDeletes=0,docsPending=0,adds=0,deletesById=0,deletesByQuery=0,errors=0,cumulative_adds=0,cumulative_deletesById=0,cumulative_deletesByQuery=0,cumulative_errors=0,transaction_logs_total_size=0,transaction_logs_total_number=0}
   [junit4]   2> 288680 T1013 oasu.SolrCoreState.decrefSolrCoreState Closing SolrCoreState
   [junit4]   2> 288680 T1013 oasu.DefaultSolrCoreState.closeIndexWriter SolrCoreState
ref count has reached 0 - closing IndexWriter
   [junit4]   2> 288680 T1013 oasu.DefaultSolrCoreState.closeIndexWriter closing IndexWriter
with IndexWriterCloser
   [junit4]   2> 288681 T1013 oasc.SolrCore.closeSearcher [testSolrCloudCollection_shard2_replica1]
Closing main searcher on request.
   [junit4]   2> 288681 T1013 oasc.CachingDirectoryFactory.close Closing RAMDirectoryFactory
- 2 directories currently being tracked
   [junit4]   2> 288681 T1013 oasc.CachingDirectoryFactory.closeCacheValue looking to close
data/index [CachedDir<<refCount=0;path=data/index;done=false>>]
   [junit4]   2> 288682 T1013 oasc.CachingDirectoryFactory.close Closing directory: data/index
   [junit4]   2> 288682 T1013 oasc.CachingDirectoryFactory.closeCacheValue looking to close
data [CachedDir<<refCount=0;path=data;done=false>>]
   [junit4]   2> 288682 T1013 oasc.CachingDirectoryFactory.close Closing directory: data
   [junit4]   2> 288682 T1013 oasc.LeaderElector$1.process WARN  java.lang.RuntimeException:
org.apache.zookeeper.KeeperException$SessionExpiredException: KeeperErrorCode = Session expired
for /overseer
   [junit4]   2> 	at org.apache.solr.cloud.Overseer.createOverseerNode(Overseer.java:1184)
   [junit4]   2> 	at org.apache.solr.cloud.Overseer.getInQueue(Overseer.java:1139)
   [junit4]   2> 	at org.apache.solr.cloud.ShardLeaderElectionContext.runLeaderProcess(ElectionContext.java:191)
   [junit4]   2> 	at org.apache.solr.cloud.LeaderElector.runIamLeaderProcess(LeaderElector.java:164)
   [junit4]   2> 	at org.apache.solr.cloud.LeaderElector.checkIfIamLeader(LeaderElector.java:108)
   [junit4]   2> 	at org.apache.solr.cloud.LeaderElector.joinElection(LeaderElector.java:289)
   [junit4]   2> 	at org.apache.solr.cloud.ShardLeaderElectionContext.rejoinLeaderElection(ElectionContext.java:422)
   [junit4]   2> 	at org.apache.solr.cloud.ShardLeaderElectionContext.runLeaderProcess(ElectionContext.java:212)
   [junit4]   2> 	at org.apache.solr.cloud.LeaderElector.runIamLeaderProcess(LeaderElector.java:164)
   [junit4]   2> 	at org.apache.solr.cloud.LeaderElector.checkIfIamLeader(LeaderElector.java:108)
   [junit4]   2> 	at org.apache.solr.cloud.LeaderElector.access$000(LeaderElector.java:55)
   [junit4]   2> 	at org.apache.solr.cloud.LeaderElector$1.process(LeaderElector.java:137)
   [junit4]   2> 	at org.apache.zookeeper.ClientCnxn$EventThread.processEvent(ClientCnxn.java:522)
   [junit4]   2> 	at org.apache.zookeeper.ClientCnxn$EventThread.run(ClientCnxn.java:498)
   [junit4]   2> Caused by: org.apache.zookeeper.KeeperException$SessionExpiredException:
KeeperErrorCode = Session expired for /overseer
   [junit4]   2> 	at org.apache.zookeeper.KeeperException.create(KeeperException.java:127)
   [junit4]   2> 	at org.apache.zookeeper.KeeperException.create(KeeperException.java:51)
   [junit4]   2> 	at org.apache.zookeeper.ZooKeeper.create(ZooKeeper.java:783)
   [junit4]   2> 	at org.apache.solr.common.cloud.SolrZkClient$9.execute(SolrZkClient.java:311)
   [junit4]   2> 	at org.apache.solr.common.cloud.SolrZkClient$9.execute(SolrZkClient.java:308)
   [junit4]   2> 	at org.apache.solr.common.cloud.ZkCmdExecutor.retryOperation(ZkCmdExecutor.java:73)
   [junit4]   2> 	at org.apache.solr.common.cloud.SolrZkClient.create(SolrZkClient.java:308)
   [junit4]   2> 	at org.apache.solr.cloud.Overseer.createOverseerNode(Overseer.java:1175)
   [junit4]   2> 	... 13 more
   [junit4]   2> 
   [junit4]   2> 288683 T1013 oasc.DistributedQueue$LatchChildWatcher.process LatchChildWatcher
fired on path: /overseer/queue state: SyncConnected type NodeChildrenChanged
   [junit4]   2> 288683 T1013 oasc.DistributedQueue$LatchChildWatcher.process LatchChildWatcher
fired on path: /overseer/queue state: SyncConnected type NodeChildrenChanged
   [junit4]   2> 288683 T1013 oascc.ZkStateReader$2.process A cluster state change: WatchedEvent
state:SyncConnected type:NodeDataChanged path:/clusterstate.json, has occurred - updating...
(live nodes size: 2)
   [junit4]   2> 288683 T1013 oascc.ZkStateReader$2.process WARN ZooKeeper watch triggered,
but Solr cannot talk to ZK
   [junit4]   2> 288684 T1013 oasc.DistributedQueue$LatchChildWatcher.process LatchChildWatcher
fired on path: /overseer/queue state: SyncConnected type NodeChildrenChanged
   [junit4]   2> 288684 T1013 oasc.DistributedQueue$LatchChildWatcher.process LatchChildWatcher
fired on path: /overseer/queue state: SyncConnected type NodeChildrenChanged
   [junit4]   2> 288684 T1013 oasc.DistributedQueue$LatchChildWatcher.process LatchChildWatcher
fired on path: /overseer/queue state: SyncConnected type NodeChildrenChanged
   [junit4]   2> 288684 T1013 oascc.ZkStateReader$3.process WARN ZooKeeper watch triggered,
but Solr cannot talk to ZK
   [junit4]   2> 409658 T1125 oas.SolrTestCaseJ4.endTrackingSearchers ERROR ERROR: SolrIndexSearcher
opens=1 closes=3
   [junit4]   2> NOTE: test params are: codec=Lucene45, sim=DefaultSimilarity, locale=es_DO,
timezone=Etc/GMT-6
   [junit4]   2> NOTE: Linux 3.8.0-37-generic amd64/Oracle Corporation 1.7.0_51 (64-bit)/cpus=8,threads=1,free=229522800,total=382001152
   [junit4]   2> NOTE: All tests run in this JVM: [TestSchemaNameResource, TestSolr4Spatial,
DefaultValueUpdateProcessorTest, TestCloudManagedSchemaAddField, BasicZkTest, TestStressRecovery,
OpenExchangeRatesOrgProviderTest, CurrencyFieldOpenExchangeTest, PreAnalyzedFieldTest, CollectionsAPIAsyncDistributedZkTest,
DisMaxRequestHandlerTest, TestOmitPositions, TestDistributedGrouping, TestDistributedMissingSort,
JSONWriterTest, TestExpandComponent, TestFieldResource, TestPartialUpdateDeduplication, DistributedDebugComponentTest,
SortByFunctionTest, TestAnalyzeInfixSuggestions, MigrateRouteKeyTest, TestInfoStreamLogging,
TestUpdate, HdfsUnloadDistributedZkTest, TestStressLucene, TestArbitraryIndexDir, MultiTermTest,
EnumFieldTest, HdfsBasicDistributedZkTest, HighlighterConfigTest, TestHashPartitioner, TestFastOutputStream,
TestClassNameShortening, ChaosMonkeySafeLeaderTest, SpellingQueryConverterTest, TestDynamicFieldCollectionResource]
   [junit4]   2> NOTE: reproduce with: ant test  -Dtestcase=TestDynamicFieldCollectionResource
-Dtests.seed=AF66F1D89DBCEAEB -Dtests.multiplier=3 -Dtests.slow=true -Dtests.locale=es_DO
-Dtests.timezone=Etc/GMT-6 -Dtests.file.encoding=UTF-8
   [junit4] ERROR   0.00s J1 | TestDynamicFieldCollectionResource (suite) <<<
   [junit4]    > Throwable #1: java.lang.AssertionError: ERROR: SolrIndexSearcher opens=1
closes=3
   [junit4]    > 	at __randomizedtesting.SeedInfo.seed([AF66F1D89DBCEAEB]:0)
   [junit4]    > 	at org.apache.solr.SolrTestCaseJ4.endTrackingSearchers(SolrTestCaseJ4.java:405)
   [junit4]    > 	at org.apache.solr.SolrTestCaseJ4.afterClass(SolrTestCaseJ4.java:176)
   [junit4]    > 	at java.lang.Thread.run(Thread.java:744)
   [junit4] Completed on J1 in 121.96s, 5 tests, 1 failure <<< FAILURES!

[...truncated 917 lines...]
BUILD FAILED
/mnt/ssd/jenkins/workspace/Lucene-Solr-4.x-Linux/build.xml:467: The following error occurred
while executing this line:
/mnt/ssd/jenkins/workspace/Lucene-Solr-4.x-Linux/build.xml:447: The following error occurred
while executing this line:
/mnt/ssd/jenkins/workspace/Lucene-Solr-4.x-Linux/build.xml:45: The following error occurred
while executing this line:
/mnt/ssd/jenkins/workspace/Lucene-Solr-4.x-Linux/extra-targets.xml:37: The following error
occurred while executing this line:
/mnt/ssd/jenkins/workspace/Lucene-Solr-4.x-Linux/solr/build.xml:189: The following error occurred
while executing this line:
/mnt/ssd/jenkins/workspace/Lucene-Solr-4.x-Linux/solr/common-build.xml:490: The following
error occurred while executing this line:
/mnt/ssd/jenkins/workspace/Lucene-Solr-4.x-Linux/lucene/common-build.xml:1276: The following
error occurred while executing this line:
/mnt/ssd/jenkins/workspace/Lucene-Solr-4.x-Linux/lucene/common-build.xml:908: There were test
failures: 377 suites, 1597 tests, 1 suite-level error, 37 ignored (16 assumptions)

Total time: 50 minutes 1 second
Build step 'Invoke Ant' marked build as failure
Description set: Java: 64bit/jdk1.7.0_51 -XX:-UseCompressedOops -XX:+UseConcMarkSweepGC -XX:-UseSuperWord
Archiving artifacts
Recording test results
Email was triggered for: Failure
Sending email for trigger: Failure



Mime
View raw message