lucene-dev mailing list archives

Site index · List index
Message view « Date » · « Thread »
Top « Date » · « Thread »
From Apache Jenkins Server <jenk...@builds.apache.org>
Subject [JENKINS-MAVEN] Lucene-Solr-Maven-trunk #1106: POMs out of sync
Date Sun, 16 Feb 2014 07:50:34 GMT
Build: https://builds.apache.org/job/Lucene-Solr-Maven-trunk/1106/

1 tests failed.
FAILED:  org.apache.solr.client.solrj.impl.BasicHttpSolrServerTest.testConnectionRefused

Error Message:
null

Stack Trace:
java.lang.AssertionError: null
	at __randomizedtesting.SeedInfo.seed([B72CEA8C03015393:98854E9DD48E1C97]:0)
	at org.junit.Assert.fail(Assert.java:92)
	at org.junit.Assert.assertTrue(Assert.java:43)
	at org.junit.Assert.assertTrue(Assert.java:54)
	at org.apache.solr.client.solrj.impl.BasicHttpSolrServerTest.testConnectionRefused(BasicHttpSolrServerTest.java:158)




Build Log:
[...truncated 52913 lines...]
BUILD FAILED
/usr/home/hudson/hudson-slave/workspace/Lucene-Solr-Maven-trunk/build.xml:476: The following
error occurred while executing this line:
/usr/home/hudson/hudson-slave/workspace/Lucene-Solr-Maven-trunk/build.xml:176: The following
error occurred while executing this line:
/usr/home/hudson/hudson-slave/workspace/Lucene-Solr-Maven-trunk/extra-targets.xml:77: Java
returned: 1

Total time: 142 minutes 15 seconds
Build step 'Invoke Ant' marked build as failure
Recording test results
Email was triggered for: Failure
Sending email for trigger: Failure



Mime
View raw message