lucene-dev mailing list archives

Site index · List index
Message view « Date » · « Thread »
Top « Date » · « Thread »
From Policeman Jenkins Server <jenk...@thetaphi.de>
Subject [JENKINS] Lucene-Solr-trunk-MacOSX (64bit/jdk1.7.0) - Build # 1335 - Failure!
Date Sun, 16 Feb 2014 12:27:25 GMT
Build: http://jenkins.thetaphi.de/job/Lucene-Solr-trunk-MacOSX/1335/
Java: 64bit/jdk1.7.0 -XX:+UseCompressedOops -XX:+UseConcMarkSweepGC

5 tests failed.
REGRESSION:  org.apache.solr.TestDistributedGrouping.testDistribSearch

Error Message:
Expected mime type application/octet-stream but got text/html. <html> <head> <meta http-equiv="Content-Type" content="text/html;charset=ISO-8859-1"/> <title>Error 500 Server Error</title> </head> <body> <h2>HTTP ERROR: 500</h2> <p>Problem accessing /select. Reason: <pre>    Server Error</pre></p> <hr /><i><small>Powered by Jetty://</small></i>                                                                                                                                                                                                                                                                                                                                                                                                                                                                                                                                                                                                                                                                                                                                                                                                                                                                                                                                                                                                                     </body> </html> 

Stack Trace:
org.apache.solr.client.solrj.impl.HttpSolrServer$RemoteSolrException: Expected mime type application/octet-stream but got text/html. <html>
<head>
<meta http-equiv="Content-Type" content="text/html;charset=ISO-8859-1"/>
<title>Error 500 Server Error</title>
</head>
<body>
<h2>HTTP ERROR: 500</h2>
<p>Problem accessing /select. Reason:
<pre>    Server Error</pre></p>
<hr /><i><small>Powered by Jetty://</small></i>
                                                
                                                
                                                
                                                
                                                
                                                
                                                
                                                
                                                
                                                
                                                
                                                
                                                
                                                
                                                
                                                
                                                
                                                
                                                
                                                
</body>
</html>

	at __randomizedtesting.SeedInfo.seed([5E8B454CB5886380:DF6DCB54C2D703BC]:0)
	at org.apache.solr.client.solrj.impl.HttpSolrServer.request(HttpSolrServer.java:459)
	at org.apache.solr.client.solrj.impl.HttpSolrServer.request(HttpSolrServer.java:199)
	at org.apache.solr.client.solrj.request.QueryRequest.process(QueryRequest.java:90)
	at org.apache.solr.client.solrj.SolrServer.query(SolrServer.java:301)
	at org.apache.solr.BaseDistributedSearchTestCase.queryServer(BaseDistributedSearchTestCase.java:515)
	at org.apache.solr.BaseDistributedSearchTestCase.query(BaseDistributedSearchTestCase.java:563)
	at org.apache.solr.BaseDistributedSearchTestCase.query(BaseDistributedSearchTestCase.java:545)
	at org.apache.solr.BaseDistributedSearchTestCase.query(BaseDistributedSearchTestCase.java:524)
	at org.apache.solr.TestDistributedGrouping.doTest(TestDistributedGrouping.java:156)
	at org.apache.solr.BaseDistributedSearchTestCase.testDistribSearch(BaseDistributedSearchTestCase.java:876)
	at sun.reflect.NativeMethodAccessorImpl.invoke0(Native Method)
	at sun.reflect.NativeMethodAccessorImpl.invoke(NativeMethodAccessorImpl.java:57)
	at sun.reflect.DelegatingMethodAccessorImpl.invoke(DelegatingMethodAccessorImpl.java:43)
	at java.lang.reflect.Method.invoke(Method.java:606)
	at com.carrotsearch.randomizedtesting.RandomizedRunner.invoke(RandomizedRunner.java:1559)
	at com.carrotsearch.randomizedtesting.RandomizedRunner.access$600(RandomizedRunner.java:79)
	at com.carrotsearch.randomizedtesting.RandomizedRunner$6.evaluate(RandomizedRunner.java:737)
	at com.carrotsearch.randomizedtesting.RandomizedRunner$7.evaluate(RandomizedRunner.java:773)
	at com.carrotsearch.randomizedtesting.RandomizedRunner$8.evaluate(RandomizedRunner.java:787)
	at com.carrotsearch.randomizedtesting.rules.SystemPropertiesRestoreRule$1.evaluate(SystemPropertiesRestoreRule.java:53)
	at org.apache.lucene.util.TestRuleSetupTeardownChained$1.evaluate(TestRuleSetupTeardownChained.java:50)
	at org.apache.lucene.util.TestRuleFieldCacheSanity$1.evaluate(TestRuleFieldCacheSanity.java:51)
	at org.apache.lucene.util.AbstractBeforeAfterRule$1.evaluate(AbstractBeforeAfterRule.java:46)
	at com.carrotsearch.randomizedtesting.rules.SystemPropertiesInvariantRule$1.evaluate(SystemPropertiesInvariantRule.java:55)
	at org.apache.lucene.util.TestRuleThreadAndTestName$1.evaluate(TestRuleThreadAndTestName.java:49)
	at org.apache.lucene.util.TestRuleIgnoreAfterMaxFailures$1.evaluate(TestRuleIgnoreAfterMaxFailures.java:70)
	at org.apache.lucene.util.TestRuleMarkFailure$1.evaluate(TestRuleMarkFailure.java:48)
	at com.carrotsearch.randomizedtesting.rules.StatementAdapter.evaluate(StatementAdapter.java:36)
	at com.carrotsearch.randomizedtesting.ThreadLeakControl$StatementRunner.run(ThreadLeakControl.java:358)
	at com.carrotsearch.randomizedtesting.ThreadLeakControl.forkTimeoutingTask(ThreadLeakControl.java:782)
	at com.carrotsearch.randomizedtesting.ThreadLeakControl$3.evaluate(ThreadLeakControl.java:442)
	at com.carrotsearch.randomizedtesting.RandomizedRunner.runSingleTest(RandomizedRunner.java:746)
	at com.carrotsearch.randomizedtesting.RandomizedRunner$3.evaluate(RandomizedRunner.java:648)
	at com.carrotsearch.randomizedtesting.RandomizedRunner$4.evaluate(RandomizedRunner.java:682)
	at com.carrotsearch.randomizedtesting.RandomizedRunner$5.evaluate(RandomizedRunner.java:693)
	at com.carrotsearch.randomizedtesting.rules.StatementAdapter.evaluate(StatementAdapter.java:36)
	at com.carrotsearch.randomizedtesting.rules.SystemPropertiesRestoreRule$1.evaluate(SystemPropertiesRestoreRule.java:53)
	at org.apache.lucene.util.AbstractBeforeAfterRule$1.evaluate(AbstractBeforeAfterRule.java:46)
	at org.apache.lucene.util.TestRuleStoreClassName$1.evaluate(TestRuleStoreClassName.java:42)
	at com.carrotsearch.randomizedtesting.rules.SystemPropertiesInvariantRule$1.evaluate(SystemPropertiesInvariantRule.java:55)
	at com.carrotsearch.randomizedtesting.rules.NoShadowingOrOverridesOnMethodsRule$1.evaluate(NoShadowingOrOverridesOnMethodsRule.java:39)
	at com.carrotsearch.randomizedtesting.rules.NoShadowingOrOverridesOnMethodsRule$1.evaluate(NoShadowingOrOverridesOnMethodsRule.java:39)
	at com.carrotsearch.randomizedtesting.rules.StatementAdapter.evaluate(StatementAdapter.java:36)
	at org.apache.lucene.util.TestRuleAssertionsRequired$1.evaluate(TestRuleAssertionsRequired.java:43)
	at org.apache.lucene.util.TestRuleMarkFailure$1.evaluate(TestRuleMarkFailure.java:48)
	at org.apache.lucene.util.TestRuleIgnoreAfterMaxFailures$1.evaluate(TestRuleIgnoreAfterMaxFailures.java:70)
	at org.apache.lucene.util.TestRuleIgnoreTestSuites$1.evaluate(TestRuleIgnoreTestSuites.java:55)
	at com.carrotsearch.randomizedtesting.rules.StatementAdapter.evaluate(StatementAdapter.java:36)
	at com.carrotsearch.randomizedtesting.ThreadLeakControl$StatementRunner.run(ThreadLeakControl.java:358)
	at java.lang.Thread.run(Thread.java:744)


REGRESSION:  org.apache.solr.TestDistributedSearch.testDistribSearch

Error Message:
Expected mime type application/octet-stream but got text/html. <html> <head> <meta http-equiv="Content-Type" content="text/html;charset=ISO-8859-1"/> <title>Error 500 Server Error</title> </head> <body> <h2>HTTP ERROR: 500</h2> <p>Problem accessing /select. Reason: <pre>    Server Error</pre></p> <hr /><i><small>Powered by Jetty://</small></i>                                                                                                                                                                                                                                                                                                                                                                                                                                                                                                                                                                                                                                                                                                                                                                                                                                                                                                                                                                                                                     </body> </html> 

Stack Trace:
org.apache.solr.client.solrj.impl.HttpSolrServer$RemoteSolrException: Expected mime type application/octet-stream but got text/html. <html>
<head>
<meta http-equiv="Content-Type" content="text/html;charset=ISO-8859-1"/>
<title>Error 500 Server Error</title>
</head>
<body>
<h2>HTTP ERROR: 500</h2>
<p>Problem accessing /select. Reason:
<pre>    Server Error</pre></p>
<hr /><i><small>Powered by Jetty://</small></i>
                                                
                                                
                                                
                                                
                                                
                                                
                                                
                                                
                                                
                                                
                                                
                                                
                                                
                                                
                                                
                                                
                                                
                                                
                                                
                                                
</body>
</html>

	at __randomizedtesting.SeedInfo.seed([5E8B454CB5886380:DF6DCB54C2D703BC]:0)
	at org.apache.solr.client.solrj.impl.HttpSolrServer.request(HttpSolrServer.java:459)
	at org.apache.solr.client.solrj.impl.HttpSolrServer.request(HttpSolrServer.java:199)
	at org.apache.solr.client.solrj.request.QueryRequest.process(QueryRequest.java:90)
	at org.apache.solr.client.solrj.SolrServer.query(SolrServer.java:301)
	at org.apache.solr.BaseDistributedSearchTestCase.queryServer(BaseDistributedSearchTestCase.java:515)
	at org.apache.solr.BaseDistributedSearchTestCase.query(BaseDistributedSearchTestCase.java:563)
	at org.apache.solr.BaseDistributedSearchTestCase.query(BaseDistributedSearchTestCase.java:545)
	at org.apache.solr.BaseDistributedSearchTestCase.query(BaseDistributedSearchTestCase.java:524)
	at org.apache.solr.TestDistributedSearch.doTest(TestDistributedSearch.java:177)
	at org.apache.solr.BaseDistributedSearchTestCase.testDistribSearch(BaseDistributedSearchTestCase.java:876)
	at sun.reflect.NativeMethodAccessorImpl.invoke0(Native Method)
	at sun.reflect.NativeMethodAccessorImpl.invoke(NativeMethodAccessorImpl.java:57)
	at sun.reflect.DelegatingMethodAccessorImpl.invoke(DelegatingMethodAccessorImpl.java:43)
	at java.lang.reflect.Method.invoke(Method.java:606)
	at com.carrotsearch.randomizedtesting.RandomizedRunner.invoke(RandomizedRunner.java:1559)
	at com.carrotsearch.randomizedtesting.RandomizedRunner.access$600(RandomizedRunner.java:79)
	at com.carrotsearch.randomizedtesting.RandomizedRunner$6.evaluate(RandomizedRunner.java:737)
	at com.carrotsearch.randomizedtesting.RandomizedRunner$7.evaluate(RandomizedRunner.java:773)
	at com.carrotsearch.randomizedtesting.RandomizedRunner$8.evaluate(RandomizedRunner.java:787)
	at com.carrotsearch.randomizedtesting.rules.SystemPropertiesRestoreRule$1.evaluate(SystemPropertiesRestoreRule.java:53)
	at org.apache.lucene.util.TestRuleSetupTeardownChained$1.evaluate(TestRuleSetupTeardownChained.java:50)
	at org.apache.lucene.util.TestRuleFieldCacheSanity$1.evaluate(TestRuleFieldCacheSanity.java:51)
	at org.apache.lucene.util.AbstractBeforeAfterRule$1.evaluate(AbstractBeforeAfterRule.java:46)
	at com.carrotsearch.randomizedtesting.rules.SystemPropertiesInvariantRule$1.evaluate(SystemPropertiesInvariantRule.java:55)
	at org.apache.lucene.util.TestRuleThreadAndTestName$1.evaluate(TestRuleThreadAndTestName.java:49)
	at org.apache.lucene.util.TestRuleIgnoreAfterMaxFailures$1.evaluate(TestRuleIgnoreAfterMaxFailures.java:70)
	at org.apache.lucene.util.TestRuleMarkFailure$1.evaluate(TestRuleMarkFailure.java:48)
	at com.carrotsearch.randomizedtesting.rules.StatementAdapter.evaluate(StatementAdapter.java:36)
	at com.carrotsearch.randomizedtesting.ThreadLeakControl$StatementRunner.run(ThreadLeakControl.java:358)
	at com.carrotsearch.randomizedtesting.ThreadLeakControl.forkTimeoutingTask(ThreadLeakControl.java:782)
	at com.carrotsearch.randomizedtesting.ThreadLeakControl$3.evaluate(ThreadLeakControl.java:442)
	at com.carrotsearch.randomizedtesting.RandomizedRunner.runSingleTest(RandomizedRunner.java:746)
	at com.carrotsearch.randomizedtesting.RandomizedRunner$3.evaluate(RandomizedRunner.java:648)
	at com.carrotsearch.randomizedtesting.RandomizedRunner$4.evaluate(RandomizedRunner.java:682)
	at com.carrotsearch.randomizedtesting.RandomizedRunner$5.evaluate(RandomizedRunner.java:693)
	at com.carrotsearch.randomizedtesting.rules.StatementAdapter.evaluate(StatementAdapter.java:36)
	at com.carrotsearch.randomizedtesting.rules.SystemPropertiesRestoreRule$1.evaluate(SystemPropertiesRestoreRule.java:53)
	at org.apache.lucene.util.AbstractBeforeAfterRule$1.evaluate(AbstractBeforeAfterRule.java:46)
	at org.apache.lucene.util.TestRuleStoreClassName$1.evaluate(TestRuleStoreClassName.java:42)
	at com.carrotsearch.randomizedtesting.rules.SystemPropertiesInvariantRule$1.evaluate(SystemPropertiesInvariantRule.java:55)
	at com.carrotsearch.randomizedtesting.rules.NoShadowingOrOverridesOnMethodsRule$1.evaluate(NoShadowingOrOverridesOnMethodsRule.java:39)
	at com.carrotsearch.randomizedtesting.rules.NoShadowingOrOverridesOnMethodsRule$1.evaluate(NoShadowingOrOverridesOnMethodsRule.java:39)
	at com.carrotsearch.randomizedtesting.rules.StatementAdapter.evaluate(StatementAdapter.java:36)
	at org.apache.lucene.util.TestRuleAssertionsRequired$1.evaluate(TestRuleAssertionsRequired.java:43)
	at org.apache.lucene.util.TestRuleMarkFailure$1.evaluate(TestRuleMarkFailure.java:48)
	at org.apache.lucene.util.TestRuleIgnoreAfterMaxFailures$1.evaluate(TestRuleIgnoreAfterMaxFailures.java:70)
	at org.apache.lucene.util.TestRuleIgnoreTestSuites$1.evaluate(TestRuleIgnoreTestSuites.java:55)
	at com.carrotsearch.randomizedtesting.rules.StatementAdapter.evaluate(StatementAdapter.java:36)
	at com.carrotsearch.randomizedtesting.ThreadLeakControl$StatementRunner.run(ThreadLeakControl.java:358)
	at java.lang.Thread.run(Thread.java:744)


REGRESSION:  org.apache.solr.cloud.BasicDistributedZk2Test.testDistribSearch

Error Message:
No live SolrServers available to handle this request:[http://127.0.0.1:51311/collection1, http://127.0.0.1:51314/collection1, http://127.0.0.1:51317/collection1, http://127.0.0.1:51321/collection1]

Stack Trace:
org.apache.solr.client.solrj.SolrServerException: No live SolrServers available to handle this request:[http://127.0.0.1:51311/collection1, http://127.0.0.1:51314/collection1, http://127.0.0.1:51317/collection1, http://127.0.0.1:51321/collection1]
	at __randomizedtesting.SeedInfo.seed([5E8B454CB5886380:DF6DCB54C2D703BC]:0)
	at org.apache.solr.client.solrj.impl.LBHttpSolrServer.request(LBHttpSolrServer.java:362)
	at org.apache.solr.client.solrj.impl.CloudSolrServer.request(CloudSolrServer.java:635)
	at org.apache.solr.client.solrj.request.QueryRequest.process(QueryRequest.java:90)
	at org.apache.solr.client.solrj.SolrServer.query(SolrServer.java:301)
	at org.apache.solr.cloud.AbstractFullDistribZkTestBase.queryServer(AbstractFullDistribZkTestBase.java:1356)
	at org.apache.solr.BaseDistributedSearchTestCase.query(BaseDistributedSearchTestCase.java:563)
	at org.apache.solr.BaseDistributedSearchTestCase.query(BaseDistributedSearchTestCase.java:545)
	at org.apache.solr.BaseDistributedSearchTestCase.query(BaseDistributedSearchTestCase.java:524)
	at org.apache.solr.cloud.AbstractFullDistribZkTestBase.checkQueries(AbstractFullDistribZkTestBase.java:797)
	at org.apache.solr.cloud.BasicDistributedZk2Test.doTest(BasicDistributedZk2Test.java:101)
	at org.apache.solr.BaseDistributedSearchTestCase.testDistribSearch(BaseDistributedSearchTestCase.java:870)
	at sun.reflect.NativeMethodAccessorImpl.invoke0(Native Method)
	at sun.reflect.NativeMethodAccessorImpl.invoke(NativeMethodAccessorImpl.java:57)
	at sun.reflect.DelegatingMethodAccessorImpl.invoke(DelegatingMethodAccessorImpl.java:43)
	at java.lang.reflect.Method.invoke(Method.java:606)
	at com.carrotsearch.randomizedtesting.RandomizedRunner.invoke(RandomizedRunner.java:1559)
	at com.carrotsearch.randomizedtesting.RandomizedRunner.access$600(RandomizedRunner.java:79)
	at com.carrotsearch.randomizedtesting.RandomizedRunner$6.evaluate(RandomizedRunner.java:737)
	at com.carrotsearch.randomizedtesting.RandomizedRunner$7.evaluate(RandomizedRunner.java:773)
	at com.carrotsearch.randomizedtesting.RandomizedRunner$8.evaluate(RandomizedRunner.java:787)
	at com.carrotsearch.randomizedtesting.rules.SystemPropertiesRestoreRule$1.evaluate(SystemPropertiesRestoreRule.java:53)
	at org.apache.lucene.util.TestRuleSetupTeardownChained$1.evaluate(TestRuleSetupTeardownChained.java:50)
	at org.apache.lucene.util.TestRuleFieldCacheSanity$1.evaluate(TestRuleFieldCacheSanity.java:51)
	at org.apache.lucene.util.AbstractBeforeAfterRule$1.evaluate(AbstractBeforeAfterRule.java:46)
	at com.carrotsearch.randomizedtesting.rules.SystemPropertiesInvariantRule$1.evaluate(SystemPropertiesInvariantRule.java:55)
	at org.apache.lucene.util.TestRuleThreadAndTestName$1.evaluate(TestRuleThreadAndTestName.java:49)
	at org.apache.lucene.util.TestRuleIgnoreAfterMaxFailures$1.evaluate(TestRuleIgnoreAfterMaxFailures.java:70)
	at org.apache.lucene.util.TestRuleMarkFailure$1.evaluate(TestRuleMarkFailure.java:48)
	at com.carrotsearch.randomizedtesting.rules.StatementAdapter.evaluate(StatementAdapter.java:36)
	at com.carrotsearch.randomizedtesting.ThreadLeakControl$StatementRunner.run(ThreadLeakControl.java:358)
	at com.carrotsearch.randomizedtesting.ThreadLeakControl.forkTimeoutingTask(ThreadLeakControl.java:782)
	at com.carrotsearch.randomizedtesting.ThreadLeakControl$3.evaluate(ThreadLeakControl.java:442)
	at com.carrotsearch.randomizedtesting.RandomizedRunner.runSingleTest(RandomizedRunner.java:746)
	at com.carrotsearch.randomizedtesting.RandomizedRunner$3.evaluate(RandomizedRunner.java:648)
	at com.carrotsearch.randomizedtesting.RandomizedRunner$4.evaluate(RandomizedRunner.java:682)
	at com.carrotsearch.randomizedtesting.RandomizedRunner$5.evaluate(RandomizedRunner.java:693)
	at com.carrotsearch.randomizedtesting.rules.StatementAdapter.evaluate(StatementAdapter.java:36)
	at com.carrotsearch.randomizedtesting.rules.SystemPropertiesRestoreRule$1.evaluate(SystemPropertiesRestoreRule.java:53)
	at org.apache.lucene.util.AbstractBeforeAfterRule$1.evaluate(AbstractBeforeAfterRule.java:46)
	at org.apache.lucene.util.TestRuleStoreClassName$1.evaluate(TestRuleStoreClassName.java:42)
	at com.carrotsearch.randomizedtesting.rules.SystemPropertiesInvariantRule$1.evaluate(SystemPropertiesInvariantRule.java:55)
	at com.carrotsearch.randomizedtesting.rules.NoShadowingOrOverridesOnMethodsRule$1.evaluate(NoShadowingOrOverridesOnMethodsRule.java:39)
	at com.carrotsearch.randomizedtesting.rules.NoShadowingOrOverridesOnMethodsRule$1.evaluate(NoShadowingOrOverridesOnMethodsRule.java:39)
	at com.carrotsearch.randomizedtesting.rules.StatementAdapter.evaluate(StatementAdapter.java:36)
	at org.apache.lucene.util.TestRuleAssertionsRequired$1.evaluate(TestRuleAssertionsRequired.java:43)
	at org.apache.lucene.util.TestRuleMarkFailure$1.evaluate(TestRuleMarkFailure.java:48)
	at org.apache.lucene.util.TestRuleIgnoreAfterMaxFailures$1.evaluate(TestRuleIgnoreAfterMaxFailures.java:70)
	at org.apache.lucene.util.TestRuleIgnoreTestSuites$1.evaluate(TestRuleIgnoreTestSuites.java:55)
	at com.carrotsearch.randomizedtesting.rules.StatementAdapter.evaluate(StatementAdapter.java:36)
	at com.carrotsearch.randomizedtesting.ThreadLeakControl$StatementRunner.run(ThreadLeakControl.java:358)
	at java.lang.Thread.run(Thread.java:744)
Caused by: org.apache.solr.client.solrj.impl.HttpSolrServer$RemoteSolrException: Expected mime type application/octet-stream but got text/html. <html>
<head>
<meta http-equiv="Content-Type" content="text/html;charset=ISO-8859-1"/>
<title>Error 500 Server Error</title>
</head>
<body>
<h2>HTTP ERROR: 500</h2>
<p>Problem accessing /collection1/select. Reason:
<pre>    Server Error</pre></p>
<hr /><i><small>Powered by Jetty://</small></i>
                                                
                                                
                                                
                                                
                                                
                                                
                                                
                                                
                                                
                                                
                                                
                                                
                                                
                                                
                                                
                                                
                                                
                                                
                                                
                                                
</body>
</html>

	at org.apache.solr.client.solrj.impl.HttpSolrServer.request(HttpSolrServer.java:459)
	at org.apache.solr.client.solrj.impl.HttpSolrServer.request(HttpSolrServer.java:199)
	at org.apache.solr.client.solrj.impl.LBHttpSolrServer.request(LBHttpSolrServer.java:293)
	... 50 more


REGRESSION:  org.apache.solr.cloud.BasicDistributedZkTest.testDistribSearch

Error Message:
No live SolrServers available to handle this request:[https://127.0.0.1:51051/collection1, https://127.0.0.1:51044/collection1, https://127.0.0.1:51047/collection1, https://127.0.0.1:51041/collection1]

Stack Trace:
org.apache.solr.client.solrj.SolrServerException: No live SolrServers available to handle this request:[https://127.0.0.1:51051/collection1, https://127.0.0.1:51044/collection1, https://127.0.0.1:51047/collection1, https://127.0.0.1:51041/collection1]
	at __randomizedtesting.SeedInfo.seed([5E8B454CB5886380:DF6DCB54C2D703BC]:0)
	at org.apache.solr.client.solrj.impl.LBHttpSolrServer.request(LBHttpSolrServer.java:362)
	at org.apache.solr.client.solrj.impl.CloudSolrServer.request(CloudSolrServer.java:635)
	at org.apache.solr.client.solrj.request.QueryRequest.process(QueryRequest.java:90)
	at org.apache.solr.client.solrj.SolrServer.query(SolrServer.java:301)
	at org.apache.solr.cloud.BasicDistributedZkTest.queryServer(BasicDistributedZkTest.java:1176)
	at org.apache.solr.BaseDistributedSearchTestCase.query(BaseDistributedSearchTestCase.java:563)
	at org.apache.solr.BaseDistributedSearchTestCase.query(BaseDistributedSearchTestCase.java:545)
	at org.apache.solr.cloud.BasicDistributedZkTest.doTest(BasicDistributedZkTest.java:264)
	at org.apache.solr.BaseDistributedSearchTestCase.testDistribSearch(BaseDistributedSearchTestCase.java:870)
	at sun.reflect.NativeMethodAccessorImpl.invoke0(Native Method)
	at sun.reflect.NativeMethodAccessorImpl.invoke(NativeMethodAccessorImpl.java:57)
	at sun.reflect.DelegatingMethodAccessorImpl.invoke(DelegatingMethodAccessorImpl.java:43)
	at java.lang.reflect.Method.invoke(Method.java:606)
	at com.carrotsearch.randomizedtesting.RandomizedRunner.invoke(RandomizedRunner.java:1559)
	at com.carrotsearch.randomizedtesting.RandomizedRunner.access$600(RandomizedRunner.java:79)
	at com.carrotsearch.randomizedtesting.RandomizedRunner$6.evaluate(RandomizedRunner.java:737)
	at com.carrotsearch.randomizedtesting.RandomizedRunner$7.evaluate(RandomizedRunner.java:773)
	at com.carrotsearch.randomizedtesting.RandomizedRunner$8.evaluate(RandomizedRunner.java:787)
	at com.carrotsearch.randomizedtesting.rules.SystemPropertiesRestoreRule$1.evaluate(SystemPropertiesRestoreRule.java:53)
	at org.apache.lucene.util.TestRuleSetupTeardownChained$1.evaluate(TestRuleSetupTeardownChained.java:50)
	at org.apache.lucene.util.TestRuleFieldCacheSanity$1.evaluate(TestRuleFieldCacheSanity.java:51)
	at org.apache.lucene.util.AbstractBeforeAfterRule$1.evaluate(AbstractBeforeAfterRule.java:46)
	at com.carrotsearch.randomizedtesting.rules.SystemPropertiesInvariantRule$1.evaluate(SystemPropertiesInvariantRule.java:55)
	at org.apache.lucene.util.TestRuleThreadAndTestName$1.evaluate(TestRuleThreadAndTestName.java:49)
	at org.apache.lucene.util.TestRuleIgnoreAfterMaxFailures$1.evaluate(TestRuleIgnoreAfterMaxFailures.java:70)
	at org.apache.lucene.util.TestRuleMarkFailure$1.evaluate(TestRuleMarkFailure.java:48)
	at com.carrotsearch.randomizedtesting.rules.StatementAdapter.evaluate(StatementAdapter.java:36)
	at com.carrotsearch.randomizedtesting.ThreadLeakControl$StatementRunner.run(ThreadLeakControl.java:358)
	at com.carrotsearch.randomizedtesting.ThreadLeakControl.forkTimeoutingTask(ThreadLeakControl.java:782)
	at com.carrotsearch.randomizedtesting.ThreadLeakControl$3.evaluate(ThreadLeakControl.java:442)
	at com.carrotsearch.randomizedtesting.RandomizedRunner.runSingleTest(RandomizedRunner.java:746)
	at com.carrotsearch.randomizedtesting.RandomizedRunner$3.evaluate(RandomizedRunner.java:648)
	at com.carrotsearch.randomizedtesting.RandomizedRunner$4.evaluate(RandomizedRunner.java:682)
	at com.carrotsearch.randomizedtesting.RandomizedRunner$5.evaluate(RandomizedRunner.java:693)
	at com.carrotsearch.randomizedtesting.rules.StatementAdapter.evaluate(StatementAdapter.java:36)
	at com.carrotsearch.randomizedtesting.rules.SystemPropertiesRestoreRule$1.evaluate(SystemPropertiesRestoreRule.java:53)
	at org.apache.lucene.util.AbstractBeforeAfterRule$1.evaluate(AbstractBeforeAfterRule.java:46)
	at org.apache.lucene.util.TestRuleStoreClassName$1.evaluate(TestRuleStoreClassName.java:42)
	at com.carrotsearch.randomizedtesting.rules.SystemPropertiesInvariantRule$1.evaluate(SystemPropertiesInvariantRule.java:55)
	at com.carrotsearch.randomizedtesting.rules.NoShadowingOrOverridesOnMethodsRule$1.evaluate(NoShadowingOrOverridesOnMethodsRule.java:39)
	at com.carrotsearch.randomizedtesting.rules.NoShadowingOrOverridesOnMethodsRule$1.evaluate(NoShadowingOrOverridesOnMethodsRule.java:39)
	at com.carrotsearch.randomizedtesting.rules.StatementAdapter.evaluate(StatementAdapter.java:36)
	at org.apache.lucene.util.TestRuleAssertionsRequired$1.evaluate(TestRuleAssertionsRequired.java:43)
	at org.apache.lucene.util.TestRuleMarkFailure$1.evaluate(TestRuleMarkFailure.java:48)
	at org.apache.lucene.util.TestRuleIgnoreAfterMaxFailures$1.evaluate(TestRuleIgnoreAfterMaxFailures.java:70)
	at org.apache.lucene.util.TestRuleIgnoreTestSuites$1.evaluate(TestRuleIgnoreTestSuites.java:55)
	at com.carrotsearch.randomizedtesting.rules.StatementAdapter.evaluate(StatementAdapter.java:36)
	at com.carrotsearch.randomizedtesting.ThreadLeakControl$StatementRunner.run(ThreadLeakControl.java:358)
	at java.lang.Thread.run(Thread.java:744)
Caused by: org.apache.solr.client.solrj.impl.HttpSolrServer$RemoteSolrException: Expected mime type application/octet-stream but got text/html. <html>
<head>
<meta http-equiv="Content-Type" content="text/html;charset=ISO-8859-1"/>
<title>Error 500 Server Error</title>
</head>
<body>
<h2>HTTP ERROR: 500</h2>
<p>Problem accessing /collection1/select. Reason:
<pre>    Server Error</pre></p>
<hr /><i><small>Powered by Jetty://</small></i>
                                                
                                                
                                                
                                                
                                                
                                                
                                                
                                                
                                                
                                                
                                                
                                                
                                                
                                                
                                                
                                                
                                                
                                                
                                                
                                                
</body>
</html>

	at org.apache.solr.client.solrj.impl.HttpSolrServer.request(HttpSolrServer.java:459)
	at org.apache.solr.client.solrj.impl.HttpSolrServer.request(HttpSolrServer.java:199)
	at org.apache.solr.client.solrj.impl.LBHttpSolrServer.request(LBHttpSolrServer.java:293)
	... 48 more


REGRESSION:  org.apache.solr.cloud.ChaosMonkeyNothingIsSafeTest.testDistribSearch

Error Message:
document count mismatch.  control=911 sum(shards)=912 cloudClient=912

Stack Trace:
java.lang.AssertionError: document count mismatch.  control=911 sum(shards)=912 cloudClient=912
	at __randomizedtesting.SeedInfo.seed([5E8B454CB5886380:DF6DCB54C2D703BC]:0)
	at org.junit.Assert.fail(Assert.java:93)
	at org.apache.solr.cloud.AbstractFullDistribZkTestBase.checkShardConsistency(AbstractFullDistribZkTestBase.java:1230)
	at org.apache.solr.cloud.ChaosMonkeyNothingIsSafeTest.doTest(ChaosMonkeyNothingIsSafeTest.java:213)
	at org.apache.solr.BaseDistributedSearchTestCase.testDistribSearch(BaseDistributedSearchTestCase.java:870)
	at sun.reflect.NativeMethodAccessorImpl.invoke0(Native Method)
	at sun.reflect.NativeMethodAccessorImpl.invoke(NativeMethodAccessorImpl.java:57)
	at sun.reflect.DelegatingMethodAccessorImpl.invoke(DelegatingMethodAccessorImpl.java:43)
	at java.lang.reflect.Method.invoke(Method.java:606)
	at com.carrotsearch.randomizedtesting.RandomizedRunner.invoke(RandomizedRunner.java:1559)
	at com.carrotsearch.randomizedtesting.RandomizedRunner.access$600(RandomizedRunner.java:79)
	at com.carrotsearch.randomizedtesting.RandomizedRunner$6.evaluate(RandomizedRunner.java:737)
	at com.carrotsearch.randomizedtesting.RandomizedRunner$7.evaluate(RandomizedRunner.java:773)
	at com.carrotsearch.randomizedtesting.RandomizedRunner$8.evaluate(RandomizedRunner.java:787)
	at com.carrotsearch.randomizedtesting.rules.SystemPropertiesRestoreRule$1.evaluate(SystemPropertiesRestoreRule.java:53)
	at org.apache.lucene.util.TestRuleSetupTeardownChained$1.evaluate(TestRuleSetupTeardownChained.java:50)
	at org.apache.lucene.util.TestRuleFieldCacheSanity$1.evaluate(TestRuleFieldCacheSanity.java:51)
	at org.apache.lucene.util.AbstractBeforeAfterRule$1.evaluate(AbstractBeforeAfterRule.java:46)
	at com.carrotsearch.randomizedtesting.rules.SystemPropertiesInvariantRule$1.evaluate(SystemPropertiesInvariantRule.java:55)
	at org.apache.lucene.util.TestRuleThreadAndTestName$1.evaluate(TestRuleThreadAndTestName.java:49)
	at org.apache.lucene.util.TestRuleIgnoreAfterMaxFailures$1.evaluate(TestRuleIgnoreAfterMaxFailures.java:70)
	at org.apache.lucene.util.TestRuleMarkFailure$1.evaluate(TestRuleMarkFailure.java:48)
	at com.carrotsearch.randomizedtesting.rules.StatementAdapter.evaluate(StatementAdapter.java:36)
	at com.carrotsearch.randomizedtesting.ThreadLeakControl$StatementRunner.run(ThreadLeakControl.java:358)
	at com.carrotsearch.randomizedtesting.ThreadLeakControl.forkTimeoutingTask(ThreadLeakControl.java:782)
	at com.carrotsearch.randomizedtesting.ThreadLeakControl$3.evaluate(ThreadLeakControl.java:442)
	at com.carrotsearch.randomizedtesting.RandomizedRunner.runSingleTest(RandomizedRunner.java:746)
	at com.carrotsearch.randomizedtesting.RandomizedRunner$3.evaluate(RandomizedRunner.java:648)
	at com.carrotsearch.randomizedtesting.RandomizedRunner$4.evaluate(RandomizedRunner.java:682)
	at com.carrotsearch.randomizedtesting.RandomizedRunner$5.evaluate(RandomizedRunner.java:693)
	at com.carrotsearch.randomizedtesting.rules.StatementAdapter.evaluate(StatementAdapter.java:36)
	at com.carrotsearch.randomizedtesting.rules.SystemPropertiesRestoreRule$1.evaluate(SystemPropertiesRestoreRule.java:53)
	at org.apache.lucene.util.AbstractBeforeAfterRule$1.evaluate(AbstractBeforeAfterRule.java:46)
	at org.apache.lucene.util.TestRuleStoreClassName$1.evaluate(TestRuleStoreClassName.java:42)
	at com.carrotsearch.randomizedtesting.rules.SystemPropertiesInvariantRule$1.evaluate(SystemPropertiesInvariantRule.java:55)
	at com.carrotsearch.randomizedtesting.rules.NoShadowingOrOverridesOnMethodsRule$1.evaluate(NoShadowingOrOverridesOnMethodsRule.java:39)
	at com.carrotsearch.randomizedtesting.rules.NoShadowingOrOverridesOnMethodsRule$1.evaluate(NoShadowingOrOverridesOnMethodsRule.java:39)
	at com.carrotsearch.randomizedtesting.rules.StatementAdapter.evaluate(StatementAdapter.java:36)
	at org.apache.lucene.util.TestRuleAssertionsRequired$1.evaluate(TestRuleAssertionsRequired.java:43)
	at org.apache.lucene.util.TestRuleMarkFailure$1.evaluate(TestRuleMarkFailure.java:48)
	at org.apache.lucene.util.TestRuleIgnoreAfterMaxFailures$1.evaluate(TestRuleIgnoreAfterMaxFailures.java:70)
	at org.apache.lucene.util.TestRuleIgnoreTestSuites$1.evaluate(TestRuleIgnoreTestSuites.java:55)
	at com.carrotsearch.randomizedtesting.rules.StatementAdapter.evaluate(StatementAdapter.java:36)
	at com.carrotsearch.randomizedtesting.ThreadLeakControl$StatementRunner.run(ThreadLeakControl.java:358)
	at java.lang.Thread.run(Thread.java:744)




Build Log:
[...truncated 10033 lines...]
   [junit4] Suite: org.apache.solr.TestDistributedSearch
   [junit4]   2> 287514 T1060 oas.SolrTestCaseJ4.buildSSLConfig Randomized ssl (false) and clientAuth (false)
   [junit4]   2> 287514 T1060 oas.BaseDistributedSearchTestCase.initHostContext Setting hostContext system property: /
   [junit4]   2> 287518 T1060 oas.SolrTestCaseJ4.setUp ###Starting testDistribSearch
   [junit4]   2> 287520 T1060 oejs.Server.doStart jetty-8.1.10.v20130312
   [junit4]   2> 287527 T1060 oejs.AbstractConnector.doStart Started SelectChannelConnector@127.0.0.1:49503
   [junit4]   2> 287527 T1060 oass.SolrDispatchFilter.init SolrDispatchFilter.init()
   [junit4]   2> 287527 T1060 oasc.SolrResourceLoader.locateSolrHome JNDI not configured for solr (NoInitialContextEx)
   [junit4]   2> 287528 T1060 oasc.SolrResourceLoader.locateSolrHome using system property solr.solr.home: /Users/jenkins/workspace/Lucene-Solr-trunk-MacOSX/solr/build/solr-core/test-files/solr
   [junit4]   2> 287528 T1060 oasc.SolrResourceLoader.<init> new SolrResourceLoader for directory: '/Users/jenkins/workspace/Lucene-Solr-trunk-MacOSX/solr/build/solr-core/test-files/solr/'
   [junit4]   2> 287557 T1060 oasc.ConfigSolr.fromFile Loading container configuration from /Users/jenkins/workspace/Lucene-Solr-trunk-MacOSX/solr/build/solr-core/test-files/solr/solr.xml
   [junit4]   2> 287632 T1060 oasc.CoreContainer.<init> New CoreContainer 1073059006
   [junit4]   2> 287632 T1060 oasc.CoreContainer.load Loading cores into CoreContainer [instanceDir=/Users/jenkins/workspace/Lucene-Solr-trunk-MacOSX/solr/build/solr-core/test-files/solr/]
   [junit4]   2> 287634 T1060 oashc.HttpShardHandlerFactory.getParameter Setting socketTimeout to: 90000
   [junit4]   2> 287634 T1060 oashc.HttpShardHandlerFactory.getParameter Setting urlScheme to: 
   [junit4]   2> 287634 T1060 oashc.HttpShardHandlerFactory.getParameter Setting connTimeout to: 15000
   [junit4]   2> 287635 T1060 oashc.HttpShardHandlerFactory.getParameter Setting maxConnectionsPerHost to: 20
   [junit4]   2> 287636 T1060 oashc.HttpShardHandlerFactory.getParameter Setting corePoolSize to: 0
   [junit4]   2> 287636 T1060 oashc.HttpShardHandlerFactory.getParameter Setting maximumPoolSize to: 2147483647
   [junit4]   2> 287636 T1060 oashc.HttpShardHandlerFactory.getParameter Setting maxThreadIdleTime to: 5
   [junit4]   2> 287637 T1060 oashc.HttpShardHandlerFactory.getParameter Setting sizeOfQueue to: -1
   [junit4]   2> 287637 T1060 oashc.HttpShardHandlerFactory.getParameter Setting fairnessPolicy to: false
   [junit4]   2> 287647 T1060 oasl.LogWatcher.createWatcher SLF4J impl is org.slf4j.impl.Log4jLoggerFactory
   [junit4]   2> 287647 T1060 oasl.LogWatcher.newRegisteredLogWatcher Registering Log Listener [Log4j (org.slf4j.impl.Log4jLoggerFactory)]
   [junit4]   2> 287647 T1060 oasc.CoreContainer.load Host Name: 127.0.0.1
   [junit4]   2> 287663 T1070 oasc.CoreContainer.create Creating SolrCore 'collection1' using instanceDir: /Users/jenkins/workspace/Lucene-Solr-trunk-MacOSX/solr/build/solr-core/test-files/solr/collection1
   [junit4]   2> 287664 T1070 oasc.SolrResourceLoader.<init> new SolrResourceLoader for directory: '/Users/jenkins/workspace/Lucene-Solr-trunk-MacOSX/solr/build/solr-core/test-files/solr/collection1/'
   [junit4]   2> 287665 T1070 oasc.SolrResourceLoader.replaceClassLoader Adding 'file:/Users/jenkins/workspace/Lucene-Solr-trunk-MacOSX/solr/build/solr-core/test-files/solr/collection1/lib/classes/' to classloader
   [junit4]   2> 287666 T1070 oasc.SolrResourceLoader.replaceClassLoader Adding 'file:/Users/jenkins/workspace/Lucene-Solr-trunk-MacOSX/solr/build/solr-core/test-files/solr/collection1/lib/README' to classloader
   [junit4]   2> 287723 T1070 oasc.SolrConfig.<init> Using Lucene MatchVersion: LUCENE_50
   [junit4]   2> 287792 T1070 oasc.SolrConfig.<init> Loaded SolrConfig: solrconfig.xml
   [junit4]   2> 287793 T1070 oass.IndexSchema.readSchema Reading Solr Schema from schema.xml
   [junit4]   2> 287802 T1070 oass.IndexSchema.readSchema [collection1] Schema name=test
   [junit4]   2> 288298 T1070 oass.OpenExchangeRatesOrgProvider.init Initialized with rates=open-exchange-rates.json, refreshInterval=1440.
   [junit4]   2> 288306 T1070 oass.IndexSchema.readSchema default search field in schema is text
   [junit4]   2> 288316 T1070 oass.IndexSchema.readSchema unique key field: id
   [junit4]   2> 288326 T1070 oass.FileExchangeRateProvider.reload Reloading exchange rates from file currency.xml
   [junit4]   2> 288331 T1070 oass.FileExchangeRateProvider.reload Reloading exchange rates from file currency.xml
   [junit4]   2> 288334 T1070 oass.OpenExchangeRatesOrgProvider.reload Reloading exchange rates from open-exchange-rates.json
   [junit4]   2> 288335 T1070 oass.OpenExchangeRatesOrgProvider$OpenExchangeRates.<init> WARN Unknown key IMPORTANT NOTE
   [junit4]   2> 288335 T1070 oass.OpenExchangeRatesOrgProvider$OpenExchangeRates.<init> WARN Expected key, got STRING
   [junit4]   2> 288335 T1070 oass.OpenExchangeRatesOrgProvider.reload Reloading exchange rates from open-exchange-rates.json
   [junit4]   2> 288336 T1070 oass.OpenExchangeRatesOrgProvider$OpenExchangeRates.<init> WARN Unknown key IMPORTANT NOTE
   [junit4]   2> 288336 T1070 oass.OpenExchangeRatesOrgProvider$OpenExchangeRates.<init> WARN Expected key, got STRING
   [junit4]   2> 288336 T1070 oasc.SolrCore.initDirectoryFactory org.apache.solr.core.MockDirectoryFactory
   [junit4]   2> 288337 T1070 oasc.SolrCore.<init> [collection1] Opening new SolrCore at /Users/jenkins/workspace/Lucene-Solr-trunk-MacOSX/solr/build/solr-core/test-files/solr/collection1/, dataDir=./org.apache.solr.TestDistributedSearch-1392550521163/control/data/
   [junit4]   2> 288337 T1070 oasc.JmxMonitoredMap.<init> JMX monitoring is enabled. Adding Solr mbeans to JMX Server: com.sun.jmx.mbeanserver.JmxMBeanServer@4472f925
   [junit4]   2> 288338 T1070 oasc.CachingDirectoryFactory.get return new directory for ./org.apache.solr.TestDistributedSearch-1392550521163/control/data
   [junit4]   2> 288338 T1070 oasc.SolrCore.getNewIndexDir New index directory detected: old=null new=./org.apache.solr.TestDistributedSearch-1392550521163/control/data/index/
   [junit4]   2> 288338 T1070 oasc.SolrCore.initIndex WARN [collection1] Solr index directory './org.apache.solr.TestDistributedSearch-1392550521163/control/data/index' doesn't exist. Creating new index...
   [junit4]   2> 288338 T1070 oasc.CachingDirectoryFactory.get return new directory for ./org.apache.solr.TestDistributedSearch-1392550521163/control/data/index
   [junit4]   2> 288339 T1070 oasu.RandomMergePolicy.<init> RandomMergePolicy wrapping class org.apache.lucene.index.TieredMergePolicy: [TieredMergePolicy: maxMergeAtOnce=17, maxMergeAtOnceExplicit=49, maxMergedSegmentMB=4.7392578125, floorSegmentMB=0.6025390625, forceMergeDeletesPctAllowed=0.02458576679504665, segmentsPerTier=29.0, maxCFSSegmentSizeMB=8.796093022207999E12, noCFSRatio=0.14994039416706295
   [junit4]   2> 288339 T1070 oasc.SolrDeletionPolicy.onCommit SolrDeletionPolicy.onCommit: commits: num=1
   [junit4]   2> 		commit{dir=RateLimitedDirectoryWrapper(MockDirectoryWrapper(RAMDirectory@6e5ca0f4 lockFactory=org.apache.lucene.store.SingleInstanceLockFactory@2a783501)),segFN=segments_1,generation=1}
   [junit4]   2> 288340 T1070 oasc.SolrDeletionPolicy.updateCommits newest commit generation = 1
   [junit4]   2> 288340 T1070 oasc.SolrCore.initWriters created xml: solr.XMLResponseWriter
   [junit4]   2> 288345 T1070 oasup.UpdateRequestProcessorChain.init creating updateRequestProcessorChain "dedupe"
   [junit4]   2> 288345 T1070 oasup.UpdateRequestProcessorChain.init inserting DistributedUpdateProcessorFactory into updateRequestProcessorChain "dedupe"
   [junit4]   2> 288346 T1070 oasup.UpdateRequestProcessorChain.init creating updateRequestProcessorChain "dedupe-allfields"
   [junit4]   2> 288346 T1070 oasup.UpdateRequestProcessorChain.init inserting DistributedUpdateProcessorFactory into updateRequestProcessorChain "dedupe-allfields"
   [junit4]   2> 288346 T1070 oasup.UpdateRequestProcessorChain.init creating updateRequestProcessorChain "stored_sig"
   [junit4]   2> 288346 T1070 oasup.UpdateRequestProcessorChain.init inserting DistributedUpdateProcessorFactory into updateRequestProcessorChain "stored_sig"
   [junit4]   2> 288347 T1070 oasup.UpdateRequestProcessorChain.init creating updateRequestProcessorChain "uniq-fields"
   [junit4]   2> 288347 T1070 oasup.UpdateRequestProcessorChain.init inserting DistributedUpdateProcessorFactory into updateRequestProcessorChain "uniq-fields"
   [junit4]   2> 288347 T1070 oasup.UpdateRequestProcessorChain.init creating updateRequestProcessorChain "distrib-dup-test-chain-explicit"
   [junit4]   2> 288348 T1070 oasup.UpdateRequestProcessorChain.init creating updateRequestProcessorChain "distrib-dup-test-chain-implicit"
   [junit4]   2> 288348 T1070 oasup.UpdateRequestProcessorChain.init inserting DistributedUpdateProcessorFactory into updateRequestProcessorChain "distrib-dup-test-chain-implicit"
   [junit4]   2> 288348 T1070 oasc.SolrCore.loadUpdateProcessorChains no updateRequestProcessorChain defined as default, creating implicit default
   [junit4]   2> 288348 T1070 oasc.RequestHandlers.initHandlersFromConfig adding lazy requestHandler: solr.ReplicationHandler
   [junit4]   2> 288348 T1070 oasc.RequestHandlers.initHandlersFromConfig created /replication: solr.ReplicationHandler
   [junit4]   2> 288349 T1070 oasc.RequestHandlers.initHandlersFromConfig created standard: solr.StandardRequestHandler
   [junit4]   2> 288349 T1070 oasc.RequestHandlers.initHandlersFromConfig created /get: solr.RealTimeGetHandler
   [junit4]   2> 288350 T1070 oasc.RequestHandlers.initHandlersFromConfig created dismax: solr.SearchHandler
   [junit4]   2> 288350 T1070 oasc.RequestHandlers.initHandlersFromConfig created mock: org.apache.solr.core.MockQuerySenderListenerReqHandler
   [junit4]   2> 288351 T1070 oasc.RequestHandlers.initHandlersFromConfig created /admin/: org.apache.solr.handler.admin.AdminHandlers
   [junit4]   2> 288352 T1070 oasc.RequestHandlers.initHandlersFromConfig created /admin/file: solr.admin.ShowFileRequestHandler
   [junit4]   2> 288353 T1070 oasc.RequestHandlers.initHandlersFromConfig created /admin/fileedit: solr.admin.EditFileRequestHandler
   [junit4]   2> 288353 T1070 oasc.RequestHandlers.initHandlersFromConfig created defaults: solr.StandardRequestHandler
   [junit4]   2> 288353 T1070 oasc.RequestHandlers.initHandlersFromConfig adding lazy requestHandler: solr.StandardRequestHandler
   [junit4]   2> 288353 T1070 oasc.RequestHandlers.initHandlersFromConfig created lazy: solr.StandardRequestHandler
   [junit4]   2> 288354 T1070 oasc.RequestHandlers.initHandlersFromConfig created /update: solr.UpdateRequestHandler
   [junit4]   2> 288354 T1070 oasc.RequestHandlers.initHandlersFromConfig created /terms: org.apache.solr.handler.component.SearchHandler
   [junit4]   2> 288355 T1070 oasc.RequestHandlers.initHandlersFromConfig created spellCheckCompRH: org.apache.solr.handler.component.SearchHandler
   [junit4]   2> 288356 T1070 oasc.RequestHandlers.initHandlersFromConfig created spellCheckCompRH_Direct: org.apache.solr.handler.component.SearchHandler
   [junit4]   2> 288356 T1070 oasc.RequestHandlers.initHandlersFromConfig created spellCheckWithWordbreak: org.apache.solr.handler.component.SearchHandler
   [junit4]   2> 288357 T1070 oasc.RequestHandlers.initHandlersFromConfig created spellCheckWithWordbreak_Direct: org.apache.solr.handler.component.SearchHandler
   [junit4]   2> 288358 T1070 oasc.RequestHandlers.initHandlersFromConfig created spellCheckCompRH1: org.apache.solr.handler.component.SearchHandler
   [junit4]   2> 288358 T1070 oasc.RequestHandlers.initHandlersFromConfig created mltrh: org.apache.solr.handler.component.SearchHandler
   [junit4]   2> 288359 T1070 oasc.RequestHandlers.initHandlersFromConfig created tvrh: org.apache.solr.handler.component.SearchHandler
   [junit4]   2> 288360 T1070 oasc.RequestHandlers.initHandlersFromConfig created /mlt: solr.MoreLikeThisHandler
   [junit4]   2> 288361 T1070 oasc.RequestHandlers.initHandlersFromConfig created /debug/dump: solr.DumpRequestHandler
   [junit4]   2> 288372 T1070 oashl.XMLLoader.init xsltCacheLifetimeSeconds=60
   [junit4]   2> 288374 T1070 oasc.SolrCore.initDeprecatedSupport WARN solrconfig.xml uses deprecated <admin/gettableFiles>, Please update your config to use the ShowFileRequestHandler.
   [junit4]   2> 288379 T1070 oasu.CommitTracker.<init> Hard AutoCommit: disabled
   [junit4]   2> 288380 T1070 oasu.CommitTracker.<init> Soft AutoCommit: disabled
   [junit4]   2> 288380 T1070 oasu.RandomMergePolicy.<init> RandomMergePolicy wrapping class org.apache.lucene.index.TieredMergePolicy: [TieredMergePolicy: maxMergeAtOnce=33, maxMergeAtOnceExplicit=33, maxMergedSegmentMB=86.3134765625, floorSegmentMB=1.8310546875, forceMergeDeletesPctAllowed=1.8088540731839031, segmentsPerTier=39.0, maxCFSSegmentSizeMB=8.796093022207999E12, noCFSRatio=0.4194013230522792
   [junit4]   2> 288381 T1070 oasc.SolrDeletionPolicy.onInit SolrDeletionPolicy.onInit: commits: num=1
   [junit4]   2> 		commit{dir=RateLimitedDirectoryWrapper(MockDirectoryWrapper(RAMDirectory@6e5ca0f4 lockFactory=org.apache.lucene.store.SingleInstanceLockFactory@2a783501)),segFN=segments_1,generation=1}
   [junit4]   2> 288381 T1070 oasc.SolrDeletionPolicy.updateCommits newest commit generation = 1
   [junit4]   2> 288381 T1070 oass.SolrIndexSearcher.<init> Opening Searcher@75ceeb77[collection1] main
   [junit4]   2> 288381 T1070 oashc.SpellCheckComponent.inform Initializing spell checkers
   [junit4]   2> 288387 T1070 oass.DirectSolrSpellChecker.init init: {name=direct,classname=DirectSolrSpellChecker,field=lowerfilt,minQueryLength=3}
   [junit4]   2> 288434 T1071 oasc.SolrCore.registerSearcher [collection1] Registered new searcher Searcher@75ceeb77[collection1] main{StandardDirectoryReader(segments_1:1:nrt)}
   [junit4]   2> 288447 T1070 oasc.CoreContainer.registerCore registering core: collection1
   [junit4]   2> 288448 T1060 oass.SolrDispatchFilter.init user.dir=/Users/jenkins/workspace/Lucene-Solr-trunk-MacOSX/solr/build/solr-core/test/J0
   [junit4]   2> 288448 T1060 oass.SolrDispatchFilter.init SolrDispatchFilter.init() done
   [junit4]   2> 288450 T1060 oejs.Server.doStart jetty-8.1.10.v20130312
   [junit4]   2> 288455 T1060 oejs.AbstractConnector.doStart Started SelectChannelConnector@127.0.0.1:49504
   [junit4]   2> 288457 T1060 oass.SolrDispatchFilter.init SolrDispatchFilter.init()
   [junit4]   2> 288457 T1060 oasc.SolrResourceLoader.locateSolrHome JNDI not configured for solr (NoInitialContextEx)
   [junit4]   2> 288457 T1060 oasc.SolrResourceLoader.locateSolrHome using system property solr.solr.home: /Users/jenkins/workspace/Lucene-Solr-trunk-MacOSX/solr/build/solr-core/test-files/solr
   [junit4]   2> 288457 T1060 oasc.SolrResourceLoader.<init> new SolrResourceLoader for directory: '/Users/jenkins/workspace/Lucene-Solr-trunk-MacOSX/solr/build/solr-core/test-files/solr/'
   [junit4]   2> 288488 T1060 oasc.ConfigSolr.fromFile Loading container configuration from /Users/jenkins/workspace/Lucene-Solr-trunk-MacOSX/solr/build/solr-core/test-files/solr/solr.xml
   [junit4]   2> 288551 T1060 oasc.CoreContainer.<init> New CoreContainer 2036190433
   [junit4]   2> 288552 T1060 oasc.CoreContainer.load Loading cores into CoreContainer [instanceDir=/Users/jenkins/workspace/Lucene-Solr-trunk-MacOSX/solr/build/solr-core/test-files/solr/]
   [junit4]   2> 288553 T1060 oashc.HttpShardHandlerFactory.getParameter Setting socketTimeout to: 90000
   [junit4]   2> 288554 T1060 oashc.HttpShardHandlerFactory.getParameter Setting urlScheme to: 
   [junit4]   2> 288554 T1060 oashc.HttpShardHandlerFactory.getParameter Setting connTimeout to: 15000
   [junit4]   2> 288555 T1060 oashc.HttpShardHandlerFactory.getParameter Setting maxConnectionsPerHost to: 20
   [junit4]   2> 288555 T1060 oashc.HttpShardHandlerFactory.getParameter Setting corePoolSize to: 0
   [junit4]   2> 288555 T1060 oashc.HttpShardHandlerFactory.getParameter Setting maximumPoolSize to: 2147483647
   [junit4]   2> 288556 T1060 oashc.HttpShardHandlerFactory.getParameter Setting maxThreadIdleTime to: 5
   [junit4]   2> 288556 T1060 oashc.HttpShardHandlerFactory.getParameter Setting sizeOfQueue to: -1
   [junit4]   2> 288556 T1060 oashc.HttpShardHandlerFactory.getParameter Setting fairnessPolicy to: false
   [junit4]   2> 288567 T1060 oasl.LogWatcher.createWatcher SLF4J impl is org.slf4j.impl.Log4jLoggerFactory
   [junit4]   2> 288568 T1060 oasl.LogWatcher.newRegisteredLogWatcher Registering Log Listener [Log4j (org.slf4j.impl.Log4jLoggerFactory)]
   [junit4]   2> 288568 T1060 oasc.CoreContainer.load Host Name: 127.0.0.1
   [junit4]   2> 288582 T1082 oasc.CoreContainer.create Creating SolrCore 'collection1' using instanceDir: /Users/jenkins/workspace/Lucene-Solr-trunk-MacOSX/solr/build/solr-core/test-files/solr/collection1
   [junit4]   2> 288583 T1082 oasc.SolrResourceLoader.<init> new SolrResourceLoader for directory: '/Users/jenkins/workspace/Lucene-Solr-trunk-MacOSX/solr/build/solr-core/test-files/solr/collection1/'
   [junit4]   2> 288584 T1082 oasc.SolrResourceLoader.replaceClassLoader Adding 'file:/Users/jenkins/workspace/Lucene-Solr-trunk-MacOSX/solr/build/solr-core/test-files/solr/collection1/lib/classes/' to classloader
   [junit4]   2> 288585 T1082 oasc.SolrResourceLoader.replaceClassLoader Adding 'file:/Users/jenkins/workspace/Lucene-Solr-trunk-MacOSX/solr/build/solr-core/test-files/solr/collection1/lib/README' to classloader
   [junit4]   2> 288648 T1082 oasc.SolrConfig.<init> Using Lucene MatchVersion: LUCENE_50
   [junit4]   2> 288735 T1082 oasc.SolrConfig.<init> Loaded SolrConfig: solrconfig.xml
   [junit4]   2> 288736 T1082 oass.IndexSchema.readSchema Reading Solr Schema from schema.xml
   [junit4]   2> 288749 T1082 oass.IndexSchema.readSchema [collection1] Schema name=test
   [junit4]   2> 289259 T1082 oass.OpenExchangeRatesOrgProvider.init Initialized with rates=open-exchange-rates.json, refreshInterval=1440.
   [junit4]   2> 289267 T1082 oass.IndexSchema.readSchema default search field in schema is text
   [junit4]   2> 289270 T1082 oass.IndexSchema.readSchema unique key field: id
   [junit4]   2> 289281 T1082 oass.FileExchangeRateProvider.reload Reloading exchange rates from file currency.xml
   [junit4]   2> 289285 T1082 oass.FileExchangeRateProvider.reload Reloading exchange rates from file currency.xml
   [junit4]   2> 289288 T1082 oass.OpenExchangeRatesOrgProvider.reload Reloading exchange rates from open-exchange-rates.json
   [junit4]   2> 289288 T1082 oass.OpenExchangeRatesOrgProvider$OpenExchangeRates.<init> WARN Unknown key IMPORTANT NOTE
   [junit4]   2> 289290 T1082 oass.OpenExchangeRatesOrgProvider$OpenExchangeRates.<init> WARN Expected key, got STRING
   [junit4]   2> 289290 T1082 oass.OpenExchangeRatesOrgProvider.reload Reloading exchange rates from open-exchange-rates.json
   [junit4]   2> 289291 T1082 oass.OpenExchangeRatesOrgProvider$OpenExchangeRates.<init> WARN Unknown key IMPORTANT NOTE
   [junit4]   2> 289292 T1082 oass.OpenExchangeRatesOrgProvider$OpenExchangeRates.<init> WARN Expected key, got STRING
   [junit4]   2> 289293 T1082 oasc.SolrCore.initDirectoryFactory org.apache.solr.core.MockDirectoryFactory
   [junit4]   2> 289293 T1082 oasc.SolrCore.<init> [collection1] Opening new SolrCore at /Users/jenkins/workspace/Lucene-Solr-trunk-MacOSX/solr/build/solr-core/test-files/solr/collection1/, dataDir=./org.apache.solr.TestDistributedSearch-1392550521163/shard0/data/
   [junit4]   2> 289294 T1082 oasc.JmxMonitoredMap.<init> JMX monitoring is enabled. Adding Solr mbeans to JMX Server: com.sun.jmx.mbeanserver.JmxMBeanServer@4472f925
   [junit4]   2> 289295 T1082 oasc.CachingDirectoryFactory.get return new directory for ./org.apache.solr.TestDistributedSearch-1392550521163/shard0/data
   [junit4]   2> 289295 T1082 oasc.SolrCore.getNewIndexDir New index directory detected: old=null new=./org.apache.solr.TestDistributedSearch-1392550521163/shard0/data/index/
   [junit4]   2> 289296 T1082 oasc.SolrCore.initIndex WARN [collection1] Solr index directory './org.apache.solr.TestDistributedSearch-1392550521163/shard0/data/index' doesn't exist. Creating new index...
   [junit4]   2> 289296 T1082 oasc.CachingDirectoryFactory.get return new directory for ./org.apache.solr.TestDistributedSearch-1392550521163/shard0/data/index
   [junit4]   2> 289297 T1082 oasu.RandomMergePolicy.<init> RandomMergePolicy wrapping class org.apache.lucene.index.TieredMergePolicy: [TieredMergePolicy: maxMergeAtOnce=17, maxMergeAtOnceExplicit=49, maxMergedSegmentMB=4.7392578125, floorSegmentMB=0.6025390625, forceMergeDeletesPctAllowed=0.02458576679504665, segmentsPerTier=29.0, maxCFSSegmentSizeMB=8.796093022207999E12, noCFSRatio=0.14994039416706295
   [junit4]   2> 289300 T1082 oasc.SolrDeletionPolicy.onCommit SolrDeletionPolicy.onCommit: commits: num=1
   [junit4]   2> 		commit{dir=RateLimitedDirectoryWrapper(MockDirectoryWrapper(RAMDirectory@38227266 lockFactory=org.apache.lucene.store.SingleInstanceLockFactory@6b63e34f)),segFN=segments_1,generation=1}
   [junit4]   2> 289300 T1082 oasc.SolrDeletionPolicy.updateCommits newest commit generation = 1
   [junit4]   2> 289301 T1082 oasc.SolrCore.initWriters created xml: solr.XMLResponseWriter
   [junit4]   2> 289309 T1082 oasup.UpdateRequestProcessorChain.init creating updateRequestProcessorChain "dedupe"
   [junit4]   2> 289311 T1082 oasup.UpdateRequestProcessorChain.init inserting DistributedUpdateProcessorFactory into updateRequestProcessorChain "dedupe"
   [junit4]   2> 289311 T1082 oasup.UpdateRequestProcessorChain.init creating updateRequestProcessorChain "dedupe-allfields"
   [junit4]   2> 289311 T1082 oasup.UpdateRequestProcessorChain.init inserting DistributedUpdateProcessorFactory into updateRequestProcessorChain "dedupe-allfields"
   [junit4]   2> 289311 T1082 oasup.UpdateRequestProcessorChain.init creating updateRequestProcessorChain "stored_sig"
   [junit4]   2> 289311 T1082 oasup.UpdateRequestProcessorChain.init inserting DistributedUpdateProcessorFactory into updateRequestProcessorChain "stored_sig"
   [junit4]   2> 289312 T1082 oasup.UpdateRequestProcessorChain.init creating updateRequestProcessorChain "uniq-fields"
   [junit4]   2> 289312 T1082 oasup.UpdateRequestProcessorChain.init inserting DistributedUpdateProcessorFactory into updateRequestProcessorChain "uniq-fields"
   [junit4]   2> 289312 T1082 oasup.UpdateRequestProcessorChain.init creating updateRequestProcessorChain "distrib-dup-test-chain-explicit"
   [junit4]   2> 289313 T1082 oasup.UpdateRequestProcessorChain.init creating updateRequestProcessorChain "distrib-dup-test-chain-implicit"
   [junit4]   2> 289313 T1082 oasup.UpdateRequestProcessorChain.init inserting DistributedUpdateProcessorFactory into updateRequestProcessorChain "distrib-dup-test-chain-implicit"
   [junit4]   2> 289313 T1082 oasc.SolrCore.loadUpdateProcessorChains no updateRequestProcessorChain defined as default, creating implicit default
   [junit4]   2> 289313 T1082 oasc.RequestHandlers.initHandlersFromConfig adding lazy requestHandler: solr.ReplicationHandler
   [junit4]   2> 289314 T1082 oasc.RequestHandlers.initHandlersFromConfig created /replication: solr.ReplicationHandler
   [junit4]   2> 289314 T1082 oasc.RequestHandlers.initHandlersFromConfig created standard: solr.StandardRequestHandler
   [junit4]   2> 289315 T1082 oasc.RequestHandlers.initHandlersFromConfig created /get: solr.RealTimeGetHandler
   [junit4]   2> 289316 T1082 oasc.RequestHandlers.initHandlersFromConfig created dismax: solr.SearchHandler
   [junit4]   2> 289316 T1082 oasc.RequestHandlers.initHandlersFromConfig created mock: org.apache.solr.core.MockQuerySenderListenerReqHandler
   [junit4]   2> 289316 T1082 oasc.RequestHandlers.initHandlersFromConfig created /admin/: org.apache.solr.handler.admin.AdminHandlers
   [junit4]   2> 289317 T1082 oasc.RequestHandlers.initHandlersFromConfig created /admin/file: solr.admin.ShowFileRequestHandler
   [junit4]   2> 289318 T1082 oasc.RequestHandlers.initHandlersFromConfig created /admin/fileedit: solr.admin.EditFileRequestHandler
   [junit4]   2> 289318 T1082 oasc.RequestHandlers.initHandlersFromConfig created defaults: solr.StandardRequestHandler
   [junit4]   2> 289318 T1082 oasc.RequestHandlers.initHandlersFromConfig adding lazy requestHandler: solr.StandardRequestHandler
   [junit4]   2> 289319 T1082 oasc.RequestHandlers.initHandlersFromConfig created lazy: solr.StandardRequestHandler
   [junit4]   2> 289319 T1082 oasc.RequestHandlers.initHandlersFromConfig created /update: solr.UpdateRequestHandler
   [junit4]   2> 289320 T1082 oasc.RequestHandlers.initHandlersFromConfig created /terms: org.apache.solr.handler.component.SearchHandler
   [junit4]   2> 289320 T1082 oasc.RequestHandlers.initHandlersFromConfig created spellCheckCompRH: org.apache.solr.handler.component.SearchHandler
   [junit4]   2> 289321 T1082 oasc.RequestHandlers.initHandlersFromConfig created spellCheckCompRH_Direct: org.apache.solr.handler.component.SearchHandler
   [junit4]   2> 289321 T1082 oasc.RequestHandlers.initHandlersFromConfig created spellCheckWithWordbreak: org.apache.solr.handler.component.SearchHandler
   [junit4]   2> 289322 T1082 oasc.RequestHandlers.initHandlersFromConfig created spellCheckWithWordbreak_Direct: org.apache.solr.handler.component.SearchHandler
   [junit4]   2> 289322 T1082 oasc.RequestHandlers.initHandlersFromConfig created spellCheckCompRH1: org.apache.solr.handler.component.SearchHandler
   [junit4]   2> 289323 T1082 oasc.RequestHandlers.initHandlersFromConfig created mltrh: org.apache.solr.handler.component.SearchHandler
   [junit4]   2> 289323 T1082 oasc.RequestHandlers.initHandlersFromConfig created tvrh: org.apache.solr.handler.component.SearchHandler
   [junit4]   2> 289325 T1082 oasc.RequestHandlers.initHandlersFromConfig created /mlt: solr.MoreLikeThisHandler
   [junit4]   2> 289326 T1082 oasc.RequestHandlers.initHandlersFromConfig created /debug/dump: solr.DumpRequestHandler
   [junit4]   2> 289345 T1082 oashl.XMLLoader.init xsltCacheLifetimeSeconds=60
   [junit4]   2> 289346 T1082 oasc.SolrCore.initDeprecatedSupport WARN solrconfig.xml uses deprecated <admin/gettableFiles>, Please update your config to use the ShowFileRequestHandler.
   [junit4]   2> 289352 T1082 oasu.CommitTracker.<init> Hard AutoCommit: disabled
   [junit4]   2> 289352 T1082 oasu.CommitTracker.<init> Soft AutoCommit: disabled
   [junit4]   2> 289353 T1082 oasu.RandomMergePolicy.<init> RandomMergePolicy wrapping class org.apache.lucene.index.TieredMergePolicy: [TieredMergePolicy: maxMergeAtOnce=33, maxMergeAtOnceExplicit=33, maxMergedSegmentMB=86.3134765625, floorSegmentMB=1.8310546875, forceMergeDeletesPctAllowed=1.8088540731839031, segmentsPerTier=39.0, maxCFSSegmentSizeMB=8.796093022207999E12, noCFSRatio=0.4194013230522792
   [junit4]   2> 289354 T1082 oasc.SolrDeletionPolicy.onInit SolrDeletionPolicy.onInit: commits: num=1
   [junit4]   2> 		commit{dir=RateLimitedDirectoryWrapper(MockDirectoryWrapper(RAMDirectory@38227266 lockFactory=org.apache.lucene.store.SingleInstanceLockFactory@6b63e34f)),segFN=segments_1,generation=1}
   [junit4]   2> 289354 T1082 oasc.SolrDeletionPolicy.updateCommits newest commit generation = 1
   [junit4]   2> 289354 T1082 oass.SolrIndexSearcher.<init> Opening Searcher@3dc82b58[collection1] main
   [junit4]   2> 289355 T1082 oashc.SpellCheckComponent.inform Initializing spell checkers
   [junit4]   2> 289363 T1082 oass.DirectSolrSpellChecker.init init: {name=direct,classname=DirectSolrSpellChecker,field=lowerfilt,minQueryLength=3}
   [junit4]   2> 289406 T1083 oasc.SolrCore.registerSearcher [collection1] Registered new searcher Searcher@3dc82b58[collection1] main{StandardDirectoryReader(segments_1:1:nrt)}
   [junit4]   2> 289412 T1082 oasc.CoreContainer.registerCore registering core: collection1
   [junit4]   2> 289413 T1060 oass.SolrDispatchFilter.init user.dir=/Users/jenkins/workspace/Lucene-Solr-trunk-MacOSX/solr/build/solr-core/test/J0
   [junit4]   2> 289414 T1060 oass.SolrDispatchFilter.init SolrDispatchFilter.init() done
   [junit4]   2> ASYNC  NEW_CORE C340 name=collection1 org.apache.solr.core.SolrCore@3690fae2
   [junit4]   2> 289424 T1068 C340 oasup.LogUpdateProcessor.finish [collection1] webapp= path=/update params={version=2&wt=javabin} {deleteByQuery=*:* (-1460195057273405440)} 0 4
   [junit4]   2> ASYNC  NEW_CORE C341 name=collection1 org.apache.solr.core.SolrCore@3d5e39ca
   [junit4]   2> 289430 T1078 C341 oasup.LogUpdateProcessor.finish [collection1] webapp= path=/update params={version=2&wt=javabin} {deleteByQuery=*:* (-1460195057281794048)} 0 2
   [junit4]   2> 289441 T1069 C340 oasup.LogUpdateProcessor.finish [collection1] webapp= path=/update params={version=2&wt=javabin} {add=[1 (1460195057289134080)]} 0 7
   [junit4]   2> 289452 T1079 C341 oasup.LogUpdateProcessor.finish [collection1] webapp= path=/update params={version=2&wt=javabin} {add=[1 (1460195057299619840)]} 0 8
   [junit4]   2> 289465 T1064 C340 oasup.LogUpdateProcessor.finish [collection1] webapp= path=/update params={version=2&wt=javabin} {add=[2 (1460195057316397056)]} 0 4
   [junit4]   2> 289475 T1080 C341 oasup.LogUpdateProcessor.finish [collection1] webapp= path=/update params={version=2&wt=javabin} {add=[2 (1460195057325834240)]} 0 5
   [junit4]   2> 289486 T1065 C340 oasup.LogUpdateProcessor.finish [collection1] webapp= path=/update params={version=2&wt=javabin} {add=[3 (1460195057336320000)]} 0 6
   [junit4]   2> 289502 T1081 C341 oasup.LogUpdateProcessor.finish [collection1] webapp= path=/update params={version=2&wt=javabin} {add=[3 (1460195057352048640)]} 0 9
   [junit4]   2> 289511 T1066 C340 oasup.LogUpdateProcessor.finish [collection1] webapp= path=/update params={version=2&wt=javabin} {add=[4 (1460195057365680128)]} 0 3
   [junit4]   2> 289518 T1076 C341 oasup.LogUpdateProcessor.finish [collection1] webapp= path=/update params={version=2&wt=javabin} {add=[4 (1460195057373020160)]} 0 4
   [junit4]   2> 289526 T1067 C340 oasup.LogUpdateProcessor.finish [collection1] webapp= path=/update params={version=2&wt=javabin} {add=[5 (1460195057382457344)]} 0 2
   [junit4]   2> 289536 T1077 C341 oasup.LogUpdateProcessor.finish [collection1] webapp= path=/update params={version=2&wt=javabin} {add=[5 (1460195057389797376)]} 0 6
   [junit4]   2> 289548 T1068 C340 oasup.LogUpdateProcessor.finish [collection1] webapp= path=/update params={version=2&wt=javabin} {add=[6 (1460195057403428864)]} 0 4
   [junit4]   2> 289562 T1078 C341 oasup.LogUpdateProcessor.finish [collection1] webapp= path=/update params={version=2&wt=javabin} {add=[6 (1460195057417060352)]} 0 6
   [junit4]   2> 289574 T1064 C340 oasup.LogUpdateProcessor.finish [collection1] webapp= path=/update params={version=2&wt=javabin} {add=[7 (1460195057430691840)]} 0 5
   [junit4]   2> 289586 T1079 C341 oasup.LogUpdateProcessor.finish [collection1] webapp= path=/update params={version=2&wt=javabin} {add=[7 (1460195057442226176)]} 0 6
   [junit4]   2> 289598 T1065 C340 oasup.LogUpdateProcessor.finish [collection1] webapp= path=/update params={version=2&wt=javabin} {add=[8 (1460195057454809088)]} 0 6
   [junit4]   2> 289608 T1080 C341 oasup.LogUpdateProcessor.finish [collection1] webapp= path=/update params={version=2&wt=javabin} {add=[8 (1460195057466343424)]} 0 4
   [junit4]   2> 289616 T1066 C340 oasup.LogUpdateProcessor.finish [collection1] webapp= path=/update params={version=2&wt=javabin} {add=[9 (1460195057475780608)]} 0 4
   [junit4]   2> 289635 T1076 C341 oasup.LogUpdateProcessor.finish [collection1] webapp= path=/update params={version=2&wt=javabin} {add=[9 (1460195057495703552)]} 0 3
   [junit4]   2> 289666 T1067 C340 oasu.DirectUpdateHandler2.commit start commit{,optimize=false,openSearcher=true,waitSearcher=true,expungeDeletes=false,softCommit=false,prepareCommit=false}
   [junit4]   2> 289689 T1067 C340 oasc.SolrDeletionPolicy.onCommit SolrDeletionPolicy.onCommit: commits: num=2
   [junit4]   2> 		commit{dir=RateLimitedDirectoryWrapper(MockDirectoryWrapper(RAMDirectory@6e5ca0f4 lockFactory=org.apache.lucene.store.SingleInstanceLockFactory@2a783501)),segFN=segments_1,generation=1}
   [junit4]   2> 		commit{dir=RateLimitedDirectoryWrapper(MockDirectoryWrapper(RAMDirectory@6e5ca0f4 lockFactory=org.apache.lucene.store.SingleInstanceLockFactory@2a783501)),segFN=segments_2,generation=2}
   [junit4]   2> 289690 T1067 C340 oasc.SolrDeletionPolicy.updateCommits newest commit generation = 2
   [junit4]   2> 289693 T1067 C340 oass.SolrIndexSearcher.<init> Opening Searcher@1271cd5e[collection1] main
   [junit4]   2> 289694 T1067 C340 oasu.DirectUpdateHandler2.commit end_commit_flush
   [junit4]   2> 289695 T1071 oasc.SolrCore.registerSearcher [collection1] Registered new searcher Searcher@1271cd5e[collection1] main{StandardDirectoryReader(segments_2:3:nrt _0(5.0):C9)}
   [junit4]   2> 289699 T1067 C340 oasup.LogUpdateProcessor.finish [collection1] webapp= path=/update params={waitSearcher=true&commit=true&softCommit=false&version=2&wt=javabin} {commit=} 0 34
   [junit4]   2> 289708 T1077 C341 oasu.DirectUpdateHandler2.commit start commit{,optimize=false,openSearcher=true,waitSearcher=true,expungeDeletes=false,softCommit=false,prepareCommit=false}
   [junit4]   2> 289737 T1077 C341 oasc.SolrDeletionPolicy.onCommit SolrDeletionPolicy.onCommit: commits: num=2
   [junit4]   2> 		commit{dir=RateLimitedDirectoryWrapper(MockDirectoryWrapper(RAMDirectory@38227266 lockFactory=org.apache.lucene.store.SingleInstanceLockFactory@6b63e34f)),segFN=segments_1,generation=1}
   [junit4]   2> 		commit{dir=RateLimitedDirectoryWrapper(MockDirectoryWrapper(RAMDirectory@38227266 lockFactory=org.apache.lucene.store.SingleInstanceLockFactory@6b63e34f)),segFN=segments_2,generation=2}
   [junit4]   2> 289738 T1077 C341 oasc.SolrDeletionPolicy.updateCommits newest commit generation = 2
   [junit4]   2> 289744 T1077 C341 oass.SolrIndexSearcher.<init> Opening Searcher@131f1649[collection1] main
   [junit4]   2> 289744 T1077 C341 oasu.DirectUpdateHandler2.commit end_commit_flush
   [junit4]   2> 289747 T1083 oasc.SolrCore.registerSearcher [collection1] Registered new searcher Searcher@131f1649[collection1] main{StandardDirectoryReader(segments_2:3:nrt _0(5.0):C9)}
   [junit4]   2> 289747 T1077 C341 oasup.LogUpdateProcessor.finish [collection1] webapp= path=/update params={waitSearcher=true&commit=true&softCommit=false&version=2&wt=javabin} {commit=} 0 39
   [junit4]   2> 289765 T1069 C340 oasup.LogUpdateProcessor.finish [collection1] webapp= path=/update params={version=2&wt=javabin} {add=[10 (1460195057632018432)]} 0 5
   [junit4]   2> 289776 T1079 C341 oasup.LogUpdateProcessor.finish [collection1] webapp= path=/update params={version=2&wt=javabin} {add=[10 (1460195057642504192)]} 0 4
   [junit4]   2> 289787 T1068 C340 oasup.LogUpdateProcessor.finish [collection1] webapp= path=/update params={version=2&wt=javabin} {add=[11 (1460195057655087104)]} 0 3
   [junit4]   2> 289796 T1081 C341 oasup.LogUpdateProcessor.finish [collection1] webapp= path=/update params={version=2&wt=javabin} {add=[11 (1460195057663475712)]} 0 4
   [junit4]   2> 289805 T1065 C340 oasup.LogUpdateProcessor.finish [collection1] webapp= path=/update params={version=2&wt=javabin} {add=[12 (1460195057675010048)]} 0 2
   [junit4]   2> 289831 T1078 C341 oasup.LogUpdateProcessor.finish [collection1] webapp= path=/update params={version=2&wt=javabin} {add=[12 (1460195057691787264)]} 0 13
   [junit4]   2> 289853 T1066 C340 oasup.LogUpdateProcessor.finish [collection1] webapp= path=/update params={version=2&wt=javabin} {add=[13 (1460195057725341696)]} 0 2
   [junit4]   2> 289877 T1077 C341 oasup.LogUpdateProcessor.finish [collection1] webapp= path=/update params={version=2&wt=javabin} {add=[13 (1460195057748410368)]} 0 4
   [junit4]   2> 289885 T1067 C340 oasup.LogUpdateProcessor.finish [collection1] webapp= path=/update params={version=2&wt=javabin} {add=[1001 (1460195057758896128)]} 0 2
   [junit4]   2> 289903 T1079 C341 oasup.LogUpdateProcessor.finish [collection1] webapp= path=/update params={version=2&wt=javabin} {add=[1001 (1460195057777770496)]} 0 2
   [junit4]   2> 289913 T1069 C340 oasup.LogUpdateProcessor.finish [collection1] webapp= path=/update params={version=2&wt=javabin} {add=[14 (1460195057788256256)]} 0 2
   [junit4]   2> 289929 T1081 C341 oasup.LogUpdateProcessor.finish [collection1] webapp= path=/update params={version=2&wt=javabin} {add=[14 (1460195057805033472)]} 0 3
   [junit4]   2> 289946 T1064 C340 oasup.LogUpdateProcessor.finish [collection1] webapp= path=/update params={version=2&wt=javabin} {add=[15 (1460195057822859264)]} 0 2
   [junit4]   2> 289953 T1076 C341 oasup.LogUpdateProcessor.finish [collection1] webapp= path=/update params={version=2&wt=javabin} {add=[15 (1460195057830199296)]} 0 2
   [junit4]   2> 289958 T1066 C340 oasup.LogUpdateProcessor.finish [collection1] webapp= path=/update params={version=2&wt=javabin} {add=[16 (1460195057836490752)]} 0 2
   [junit4]   2> 289967 T1078 C341 oasup.LogUpdateProcessor.finish [collection1] webapp= path=/update params={version=2&wt=javabin} {add=[16 (1460195057844879360)]} 0 3
   [junit4]   2> 289979 T1067 C340 oasup.LogUpdateProcessor.finish [collection1] webapp= path=/update params={version=2&wt=javabin} {add=[17 (1460195057851170816)]} 0 9
   [junit4]   2> 290005 T1077 C341 oasup.LogUpdateProcessor.finish [collection1] webapp= path=/update params={version=2&wt=javabin} {add=[17 (1460195057880530944)]} 0 7
   [junit4]   2> 290018 T1069 C340 oasup.LogUpdateProcessor.finish [collection1] webapp= path=/update params={version=2&wt=javabin} {add=[100 (1460195057897308160)]} 0 3
   [junit4]   2> 290034 T1079 C341 oasup.LogUpdateProcessor.finish [collection1] webapp= path=/update params={version=2&wt=javabin} {add=[100 (1460195057915133952)]} 0 5
   [junit4]   2> 290040 T1068 C340 oasup.LogUpdateProcessor.finish [collection1] webapp= path=/update params={version=2&wt=javabin} {add=[101 (1460195057921425408)]} 0 2
   [junit4]   2> 290046 T1080 C341 oasup.LogUpdateProcessor.finish [collection1] webapp= path=/update params={version=2&wt=javabin} {add=[101 (1460195057927716864)]} 0 2
   [junit4]   2> 290054 T1065 C340 oasup.LogUpdateProcessor.finish [collection1] webapp= path=/update params={version=2&wt=javabin} {add=[102 (1460195057937154048)]} 0 2
   [junit4]   2> 290059 T1081 C341 oasup.LogUpdateProcessor.finish [collection1] webapp= path=/update params={version=2&wt=javabin} {add=[102 (1460195057942396928)]} 0 1
   [junit4]   2> 290065 T1064 C340 oasup.LogUpdateProcessor.finish [collection1] webapp= path=/update params={version=2&wt=javabin} {add=[103 (1460195057947639808)]} 0 2
   [junit4]   2> 290090 T1076 C341 oasup.LogUpdateProcessor.finish [collection1] webapp= path=/update params={version=2&wt=javabin} {add=[103 (1460195057973854208)]} 0 3
   [junit4]   2> 290097 T1066 C340 oasup.LogUpdateProcessor.finish [collection1] webapp= path=/update params={version=2&wt=javabin} {add=[104 (1460195057980145664)]} 0 2
   [junit4]   2> 290107 T1078 C341 oasup.LogUpdateProcessor.finish [collection1] webapp= path=/update params={version=2&wt=javabin} {add=[104 (1460195057991680000)]} 0 2
   [junit4]   2> 290130 T1067 C340 oasup.LogUpdateProcessor.finish [collection1] webapp= path=/update params={version=2&wt=javabin} {add=[105 (1460195058000068608)]} 0 18
   [junit4]   2> 290144 T1077 C341 oasup.LogUpdateProcessor.finish [collection1] webapp= path=/update params={version=2&wt=javabin} {add=[105 (1460195058031525888)]} 0 1
   [junit4]   2> 290168 T1069 C340 oasup.LogUpdateProcessor.finish [collection1] webapp= path=/update params={version=2&wt=javabin} {add=[106 (1460195058056691712)]} 0 1
   [junit4]   2> 290180 T1080 C341 oasup.LogUpdateProcessor.finish [collection1] webapp= path=/update params={version=2&wt=javabin} {add=[106 (1460195058069274624)]} 0 2
   [junit4]   2> 290185 T1068 C340 oasup.LogUpdateProcessor.finish [collection1] webapp= path=/update params={version=2&wt=javabin} {add=[107 (1460195058074517504)]} 0 1
   [junit4]   2> 290192 T1081 C341 oasup.LogUpdateProcessor.finish [collection1] webapp= path=/update params={version=2&wt=javabin} {add=[107 (1460195058080808960)]} 0 2
   [junit4]   2> 290197 T1065 C340 oasup.LogUpdateProcessor.finish [collection1] webapp= path=/update params={version=2&wt=javabin} {add=[108 (1460195058087100416)]} 0 1
   [junit4]   2> 290202 T1076 C341 oasup.LogUpdateProcessor.finish [collection1] webapp= path=/update params={version=2&wt=javabin} {add=[108 (1460195058091294720)]} 0 2
   [junit4]   2> 290207 T1064 C340 oasup.LogUpdateProcessor.finish [collection1] webapp= path=/update params={version=2&wt=javabin} {add=[109 (1460195058096537600)]} 0 2
   [junit4]   2> 290213 T1078 C341 oasup.LogUpdateProcessor.finish [collection1] webapp= path=/update params={version=2&wt=javabin} {add=[109 (1460195058103877632)]} 0 2
   [junit4]   2> 290218 T1066 C340 oasup.LogUpdateProcessor.finish [collection1] webapp= path=/update params={version=2&wt=javabin} {add=[110 (1460195058109120512)]} 0 2
   [junit4]   2> 290225 T1079 C341 oasup.LogUpdateProcessor.finish [collection1] webapp= path=/update params={version=2&wt=javabin} {add=[110 (1460195058116460544)]} 0 2
   [junit4]   2> 290229 T1067 C340 oasup.LogUpdateProcessor.finish [collection1] webapp= path=/update params={version=2&wt=javabin} {add=[111 (1460195058120654848)]} 0 1
   [junit4]   2> 290234 T1077 C341 oasup.LogUpdateProcessor.finish [collection1] webapp= path=/update params={version=2&wt=javabin} {add=[111 (1460195058125897728)]} 0 1
   [junit4]   2> 290243 T1069 C340 oasup.LogUpdateProcessor.finish [collection1] webapp= path=/update params={version=2&wt=javabin} {add=[112 (1460195058134286336)]} 0 3
   [junit4]   2> 290250 T1080 C341 oasup.LogUpdateProcessor.finish [collection1] webapp= path=/update params={version=2&wt=javabin} {add=[112 (1460195058141626368)]} 0 3
   [junit4]   2> 290256 T1068 C340 oasup.LogUpdateProcessor.finish [collection1] webapp= path=/update params={version=2&wt=javabin} {add=[113 (1460195058147917824)]} 0 2
   [junit4]   2> 290260 T1081 C341 oasup.LogUpdateProcessor.finish [collection1] webapp= path=/update params={version=2&wt=javabin} {add=[113 (1460195058153160704)]} 0 1
   [junit4]   2> 290265 T1065 C340 oasup.LogUpdateProcessor.finish [collection1] webapp= path=/update params={version=2&wt=javabin} {add=[114 (1460195058158403584)]} 0 2
   [junit4]   2> 290270 T1076 C341 oasup.LogUpdateProcessor.finish [collection1] webapp= path=/update params={version=2&wt=javabin} {add=[114 (1460195058163646464)]} 0 1
   [junit4]   2> 290276 T1064 C340 oasup.LogUpdateProcessor.finish [collection1] webapp= path=/update params={version=2&wt=javabin} {add=[115 (1460195058168889344)]} 0 2
   [junit4]   2> 290282 T1078 C341 oasup.LogUpdateProcessor.finish [collection1] webapp= path=/update params={version=2&wt=javabin} {add=[115 (1460195058175180800)]} 0 2
   [junit4]   2> 290287 T1066 C340 oasup.LogUpdateProcessor.finish [collection1] webapp= path=/update params={version=2&wt=javabin} {add=[116 (1460195058181472256)]} 0 1
   [junit4]   2> 290293 T1079 C341 oasup.LogUpdateProcessor.finish [collection1] webapp= path=/update params={version=2&wt=javabin} {add=[116 (1460195058187763712)]} 0 1
   [junit4]   2> 290298 T1067 C340 oasup.LogUpdateProcessor.finish [collection1] webapp= path=/update params={version=2&wt=javabin} {add=[117 (1460195058193006592)]} 0 2
   [junit4]   2> 290304 T1077 C341 oasup.LogUpdateProcessor.finish [collection1] webapp= path=/update params={version=2&wt=javabin} {add=[117 (1460195058198249472)]} 0 2
   [junit4]   2> 290308 T1069 C340 oasup.LogUpdateProcessor.finish [collection1] webapp= path=/update params={version=2&wt=javabin} {add=[118 (1460195058203492352)]} 0 1
   [junit4]   2> 290313 T1080 C341 oasup.LogUpdateProcessor.finish [collection1] webapp= path=/update params={version=2&wt=javabin} {add=[118 (1460195058208735232)]} 0 2
   [junit4]   2> 290318 T1068 C340 oasup.LogUpdateProcessor.finish [collection1] webapp= path=/update params={version=2&wt=javabin} {add=[119 (1460195058212929536)]} 0 2
   [junit4]   2> 290322 T1081 C341 oasup.LogUpdateProcessor.finish [collection1] webapp= path=/update params={version=2&wt=javabin} {add=[119 (1460195058218172416)]} 0 1
   [junit4]   2> 290329 T1065 C340 oasup.LogUpdateProcessor.finish [collection1] webapp= path=/update params={version=2&wt=javabin} {add=[120 (1460195058225512448)]} 0 2
   [junit4]   2> 290335 T1076 C341 oasup.LogUpdateProcessor.finish [collection1] webapp= path=/update params={version=2&wt=javabin} {add=[120 (1460195058229706752)]} 0 2
   [junit4]   2> 290340 T1064 C340 oasup.LogUpdateProcessor.finish [collection1] webapp= path=/update params={version=2&wt=javabin} {add=[121 (1460195058237046784)]} 0 1
   [junit4]   2> 290347 T1078 C341 oasup.LogUpdateProcessor.finish [collection1] webapp= path=/update params={version=2&wt=javabin} {add=[121 (1460195058244386816)]} 0 1
   [junit4]   2> 290352 T1066 C340 oasup.LogUpdateProcessor.finish [collection1] webapp= path=/update params={version=2&wt=javabin} {add=[122 (1460195058248581120)]} 0 2
   [junit4]   2> 290357 T1079 C341 oasup.LogUpdateProcessor.finish [collection1] webapp= path=/update params={version=2&wt=javabin} {add=[122 (1460195058254872576)]} 0 2
   [junit4]   2> 290362 T1069 C340 oasup.LogUpdateProcessor.finish [collection1] webapp= path=/update params={version=2&wt=javabin} {add=[123 (1460195058259066880)]} 0 2
   [junit4]   2> 290367 T1077 C341 oasup.LogUpdateProcessor.finish [collection1] webapp= path=/update params={version=2&wt=javabin} {add=[123 (1460195058264309760)]} 0 1
   [junit4]   2> 290371 T1068 C340 oasup.LogUpdateProcessor.finish [collection1] webapp= path=/update params={version=2&wt=javabin} {add=[124 (1460195058269552640)]} 0 1
   [junit4]   2> 290376 T1080 C341 oasup.LogUpdateProcessor.finish [collection1] webapp= path=/update params={version=2&wt=javabin} {add=[124 (1460195058274795520)]} 0 1
   [junit4]   2> 290388 T1065 C340 oasup.LogUpdateProcessor.finish [collection1] webapp= path=/update params={version=2&wt=javabin} {add=[125 (1460195058287378432)]} 0 2
   [junit4]   2> 290393 T1081 C341 oasup.LogUpdateProcessor.finish [collection1] webapp= path=/update params={version=2&wt=javabin} {add=[125 (1460195058291572736)]} 0 2
   [junit4]   2> 290398 T1064 C340 oasup.LogUpdateProcessor.finish [collection1] webapp= path=/update params={version=2&wt=javabin} {add=[126 (1460195058297864192)]} 0 2
   [junit4]   2> 290403 T1076 C341 oasup.LogUpdateProcessor.finish [collection1] webapp= path=/update params={version=2&wt=javabin} {add=[126 (1460195058302058496)]} 0 2
   [junit4]   2> 290408 T1067 C340 oasup.LogUpdateProcessor.finish [collection1] webapp= path=/update params={version=2&wt=javabin} {add=[127 (1460195058307301376)]} 0 2
   [junit4]   2> 290412 T1078 C341 oasup.LogUpdateProcessor.finish [collection1] webapp= path=/update params={version=2&wt=javabin} {add=[127 (1460195058312544256)]} 0 1
   [junit4]   2> 290419 T1066 C340 oasup.LogUpdateProcessor.finish [collection1] webapp= path=/update params={version=2&wt=javabin} {add=[128 (1460195058318835712)]} 0 2
   [junit4]   2> 290438 T1079 C341 oasup.LogUpdateProcessor.finish [collection1] webapp= path=/update params={version=2&wt=javabin} {add=[128 (1460195058338758656)]} 0 2
   [junit4]   2> 290444 T1069 C340 oasup.LogUpdateProcessor.finish [collection1] webapp= path=/update params={version=2&wt=javabin} {add=[129 (1460195058346098688)]} 0 1
   [junit4]   2> 290453 T1077 C341 oasup.LogUpdateProcessor.finish [collection1] webapp= path=/update params={version=2&wt=javabin} {add=[129 (1460195058355535872)]} 0 1
   [junit4]   2> 290462 T1068 C340 oasup.LogUpdateProcessor.finish [collection1] webapp= path=/update params={version=2&wt=javabin} {add=[130 (1460195058364973056)]} 0 1
   [junit4]   2> 290468 T1080 C341 oasup.LogUpdateProcessor.finish [collection1] webapp= path=/update params={version=2&wt=javabin} {add=[130 (1460195058371264512)]} 0 1
   [junit4]   2> 290474 T1065 C340 oasup.LogUpdateProcessor.finish [collection1] webapp= path=/update params={version=2&wt=javabin} {add=[131 (1460195058377555968)]} 0 1
   [junit4]   2> 290479 T1081 C341 oasup.LogUpdateProcessor.finish [collection1] webapp= path=/update params={version=2&wt=javabin} {add=[131 (1460195058381750272)]} 0 1
   [junit4]   2> 290484 T1064 C340 oasup.LogUpdateProcessor.finish [collection1] webapp= path=/update params={version=2&wt=javabin} {add=[132 (1460195058389090304)]} 0 1
   [junit4]   2> 290490 T1076 C341 oasup.LogUpdateProcessor.finish [collection1] webapp= path=/update params={version=2&wt=javabin} {add=[132 (1460195058393284608)]} 0 2
   [junit4]   2> 290497 T1067 C340 oasup.LogUpdateProcessor.finish [collection1] webapp= path=/update params={version=2&wt=javabin} {add=[133 (1460195058400624640)]} 0 3
   [junit4]   2> 290503 T1078 C341 oasup.LogUpdateProcessor.finish [collection1] webapp= path=/update params={version=2&wt=javabin} {add=[133 (1460195058406916096)]} 0 2
   [junit4]   2> 290510 T1066 C340 oasup.LogUpdateProcessor.finish [collection1] webapp= path=/update params={version=2&wt=javabin} {add=[134 (1460195058415304704)]} 0 2
   [junit4]   2> 290519 T1079 C341 oasup.LogUpdateProcessor.finish [collection1] webapp= path=/update params={version=2&wt=javabin} {add=[134 (1460195058423693312)]} 0 3
   [junit4]   2> 290529 T1069 C340 oasup.LogUpdateProcessor.finish [collection1] webapp= path=/update params={version=2&wt=javabin} {add=[135 (1460195058433130496)]} 0 3
   [junit4]   2> 290537 T1077 C341 oasup.LogUpdateProcessor.finish [collection1] webapp= path=/update params={version=2&wt=javabin} {add=[135 (1460195058442567680)]} 0 3
   [junit4]   2> 290547 T1068 C340 oasup.LogUpdateProcessor.finish [collection1] webapp= path=/update params={version=2&wt=javabin} {add=[136 (1460195058452004864)]} 0 4
   [junit4]   2> 290557 T1080 C341 oasup.LogUpdateProcessor.finish [collection1] webapp= path=/update params={version=2&wt=javabin} {add=[136 (1460195058463539200)]} 0 2
   [junit4]   2> 290567 T1065 C340 oasup.LogUpdateProcessor.finish [collection1] webapp= path=/update params={version=2&wt=javabin} {add=[137 (1460195058472976384)]} 0 3
   [junit4]   2> 290577 T1076 C341 oasup.LogUpdateProcessor.finish [collection1] webapp= path=/update params={version=2&wt=javabin} {add=[137 (1460195058484510720)]} 0 3
   [junit4]   2> 290586 T1064 C340 oasup.LogUpdateProcessor.finish [collection1] webapp= path=/update params={version=2&wt=javabin} {add=[138 (1460195058493947904)]} 0 3
   [junit4]   2> 290598 T1078 C341 oasup.LogUpdateProcessor.finish [collection1] webapp= path=/update params={version=2&wt=javabin} {add=[138 (1460195058505482240)]} 0 3
   [junit4]   2> 290607 T1067 C340 oasup.LogUpdateProcessor.finish [collection1] webapp= path=/update params={version=2&wt=javabin} {add=[139 (1460195058515968000)]} 0 3
   [junit4]   2> 290617 T1079 C341 oasup.LogUpdateProcessor.finish [collection1] webapp= path=/update params={version=2&wt=javabin} {add=[139 (1460195058526453760)]} 0 3
   [junit4]   2> 290628 T1066 C340 oasup.LogUpdateProcessor.finish [collection1] webapp= path=/update params={version=2&wt=javabin} {add=[140 (1460195058536939520)]} 0 3
   [junit4]   2> 290636 T1077 C341 oasup.LogUpdateProcessor.finish [collection1] webapp= path=/update params={version=2&wt=javabin} {add=[140 (1460195058545328128)]} 0 3
   [junit4]   2> 290649 T1069 C340 oasup.LogUpdateProcessor.finish [collection1] webapp= path=/update params={version=2&wt=javabin} {add=[141 (1460195058557911040)]} 0 4
   [junit4]   2> 290657 T1081 C341 oasup.LogUpdateProcessor.finish [collection1] webapp= path=/update params={version=2&wt=javabin} {add=[141 (1460195058568396800)]} 0 3
   [junit4]   2> 290668 T1068 C340 oasup.LogUpdateProcessor.finish [collection1] webapp= path=/update params={version=2&wt=javabin} {add=[142 (1460195058579931136)]} 0 3
   [junit4]   2> 290677 T1080 C341 oasup.LogUpdateProcessor.finish [collection1] webapp= path=/update params={version=2&wt=javabin} {add=[142 (1460195058587271168)]} 0 4
   [junit4]   2> 290685 T1065 C340 oasup.LogUpdateProcessor.finish [collection1] webapp= path=/update params={version=2&wt=javabin} {add=[143 (1460195058597756928)]} 0 3
   [junit4]   2> 290693 T1076 C341 oasup.LogUpdateProcessor.finish [collection1] webapp= path=/update params={version=2&wt=javabin} {add=[143 (1460195058606145536)]} 0 3
   [junit4]   2> 290704 T1064 C340 oasup.LogUpdateProcessor.finish [collection1] webapp= path=/update params={version=2&wt=javabin} {add=[144 (1460195058615582720)]} 0 5
   [junit4]   2> 290712 T1078 C341 oasup.LogUpdateProcessor.finish [collection1] webapp= path=/update params={version=2&wt=javabin} {add=[144 (1460195058625019904)]} 0 3
   [junit4]   2> 290723 T1067 C340 oasup.LogUpdateProcessor.finish [collection1] webapp= path=/update params={version=2&wt=javabin} {add=[145 (1460195058637602816)]} 0 2
   [junit4]   2> 290732 T1079 C341 oasup.LogUpdateProcessor.finish [collection1] webapp= path=/update params={version=2&wt=javabin} {add=[145 (1460195058647040000)]} 0 3
   [junit4]   2> 290741 T1066 C340 oasup.LogUpdateProcessor.finish [collection1] webapp= path=/update params={version=2&wt=javabin} {add=[146 (1460195058655428608)]} 0 3
   [junit4]   2> 290749 T1077 C341 oasup.LogUpdateProcessor.finish [collection1] webapp= path=/update params={version=2&wt=javabin} {add=[146 (1460195058664865792)]} 0 3
   [junit4]   2> 290759 T1069 C340 oasup.LogUpdateProcessor.finish [collection1] webapp= path=/update params={version=2&wt=javabin} {add=[147 (1460195058674302976)]} 0 4
   [junit4]   2> 290767 T1081 C341 oasup.LogUpdateProcessor.finish [collection1] webapp= path=/update params={version=2&wt=javabin} {add=[147 (1460195058682691584)]} 0 3
   [junit4]   2> 290775 T1065 C340 oasup.LogUpdateProcessor.finish [collection1] webapp= path=/update params={version=2&wt=javabin} {add=[148 (1460195058692128768)]} 0 2
   [junit4]   2> 290784 T1080 C341 oasup.LogUpdateProcessor.finish [collection1] webapp= path=/update params={version=2&wt=javabin} {add=[148 (1460195058700517376)]} 0 3
   [junit4]   2> 290793 T1064 C340 oasup.LogUpdateProcessor.finish [collection1] webapp= path=/update params={version=2&wt=javabin} {add=[149 (1460195058709954560)]} 0 4
   [junit4]   2> 290804 T1076 C341 oasup.LogUpdateProcessor.finish [collection1] webapp= path=/update params={version=2&wt=javabin} {add=[149 (1460195058719391744)]} 0 6
   [junit4]   2> 290810 T1067 C340 oasu.DirectUpdateHandler2.commit start commit{,optimize=false,openSearcher=true,waitSearcher=true,expungeDeletes=false,softCommit=false,prepareCommit=false}
   [junit4]   2> 290885 T1067 C340 oasc.SolrDeletionPolicy.onCommit SolrDeletionPolicy.onCommit: commits: num=2
   [junit4]   2> 		commit{dir=RateLimitedDirectoryWrapper(MockDirectoryWrapper(RAMDirectory@6e5ca0f4 lockFactory=org.apache.lucene.store.SingleInstanceLockFactory@2a783501)),segFN=segments_2,generation=2}
   [junit4]   2> 		commit{dir=RateLimitedDirectoryWrapper(MockDirectoryWrapper(RAMDirectory@6e5

[...truncated too long message...]

                       
   [junit4]    >                                                 
   [junit4]    >                                                 
   [junit4]    >                                                 
   [junit4]    >                                                 
   [junit4]    >                                                 
   [junit4]    >                                                 
   [junit4]    >                                                 
   [junit4]    >                                                 
   [junit4]    > </body>
   [junit4]    > </html>
   [junit4]    > 	at __randomizedtesting.SeedInfo.seed([5E8B454CB5886380:DF6DCB54C2D703BC]:0)
   [junit4]    > 	at org.apache.solr.client.solrj.impl.HttpSolrServer.request(HttpSolrServer.java:459)
   [junit4]    > 	at org.apache.solr.client.solrj.impl.HttpSolrServer.request(HttpSolrServer.java:199)
   [junit4]    > 	at org.apache.solr.client.solrj.request.QueryRequest.process(QueryRequest.java:90)
   [junit4]    > 	at org.apache.solr.client.solrj.SolrServer.query(SolrServer.java:301)
   [junit4]    > 	at org.apache.solr.BaseDistributedSearchTestCase.queryServer(BaseDistributedSearchTestCase.java:515)
   [junit4]    > 	at org.apache.solr.BaseDistributedSearchTestCase.query(BaseDistributedSearchTestCase.java:563)
   [junit4]    > 	at org.apache.solr.BaseDistributedSearchTestCase.query(BaseDistributedSearchTestCase.java:545)
   [junit4]    > 	at org.apache.solr.BaseDistributedSearchTestCase.query(BaseDistributedSearchTestCase.java:524)
   [junit4]    > 	at org.apache.solr.TestDistributedGrouping.doTest(TestDistributedGrouping.java:156)
   [junit4]    > 	at org.apache.solr.BaseDistributedSearchTestCase.testDistribSearch(BaseDistributedSearchTestCase.java:876)
   [junit4]    > 	at java.lang.Thread.run(Thread.java:744)
   [junit4]   2> 2455387 T8822 oas.SolrTestCaseJ4.deleteCore ###deleteCore
   [junit4]   2> NOTE: test params are: codec=Lucene46: {foo_b=PostingsFormat(name=Memory doPackFST= false), a_n_tdt=PostingsFormat(name=Lucene41VarGapFixedInterval), n_ti1=PostingsFormat(name=Lucene41VarGapFixedInterval), foo_d=PostingsFormat(name=Lucene41VarGapFixedInterval), b_n_tdt=PostingsFormat(name=Lucene41VarGapFixedInterval), a_si=Pulsing41(freqCutoff=19 minBlockSize=4 maxBlockSize=53), rnd_b=PostingsFormat(name=Lucene41VarGapFixedInterval), n_tf1=PostingsFormat(name=Lucene41VarGapFixedInterval), _version_=PostingsFormat(name=Lucene41VarGapFixedInterval), oddField_s=PostingsFormat(name=Memory doPackFST= false), a_s=PostingsFormat(name=Memory doPackFST= false), n_tl1=Pulsing41(freqCutoff=19 minBlockSize=4 maxBlockSize=53), n_f1=Pulsing41(freqCutoff=19 minBlockSize=4 maxBlockSize=53), n_l1=PostingsFormat(name=Lucene41VarGapFixedInterval), n_tdt1=PostingsFormat(name=Lucene41VarGapFixedInterval), n_d1=PostingsFormat(name=Lucene41VarGapFixedInterval), SubjectTerms_mfacet=PostingsFormat(name=Lucene41VarGapFixedInterval), range_facet_si=Pulsing41(freqCutoff=19 minBlockSize=4 maxBlockSize=53), other_tl1=PostingsFormat(name=Lucene41VarGapFixedInterval), multiDefault=Pulsing41(freqCutoff=19 minBlockSize=4 maxBlockSize=53), id=PostingsFormat(name=Lucene41VarGapFixedInterval), n_td1=Pulsing41(freqCutoff=19 minBlockSize=4 maxBlockSize=53), n_dt1=Pulsing41(freqCutoff=19 minBlockSize=4 maxBlockSize=53), text=PostingsFormat(name=Memory doPackFST= false), range_facet_l=PostingsFormat(name=Lucene41VarGapFixedInterval), intDefault=PostingsFormat(name=Lucene41VarGapFixedInterval), timestamp=PostingsFormat(name=Lucene41VarGapFixedInterval), a_t=PostingsFormat(name=Lucene41VarGapFixedInterval), foo_f=PostingsFormat(name=Memory doPackFST= false), range_facet_sl=PostingsFormat(name=Memory doPackFST= false)}, docValues:{timestamp=DocValuesFormat(name=SimpleText)}, sim=RandomSimilarityProvider(queryNorm=true,coord=crazy): {}, locale=tr, timezone=US/Alaska
   [junit4]   2> NOTE: Mac OS X 10.8.5 x86_64/Oracle Corporation 1.7.0_51 (64-bit)/cpus=2,threads=2,free=78228312,total=347865088
   [junit4]   2> NOTE: All tests run in this JVM: [AssignTest, DistributedSuggestComponentTest, TriLevelCompositeIdRoutingTest, AnalysisErrorHandlingTest, TestSweetSpotSimilarityFactory, ExpressionTest, CSVRequestHandlerTest, TestStressUserVersions, TestMaxScoreQueryParser, TestSolrQueryParser, TermVectorComponentTest, SolrCoreTest, DOMUtilTest, DocValuesTest, TestModifyConfFiles, DisMaxRequestHandlerTest, TestFieldTypeCollectionResource, MinimalSchemaTest, InfoHandlerTest, HdfsRecoveryZkTest, TestUniqueKeyFieldResource, HdfsUnloadDistributedZkTest, TestInitQParser, TestHashPartitioner, TestRemoteStreaming, HighlighterTest, SuggesterTest, TestHighFrequencyDictionaryFactory, TestSimpleQParserPlugin, TestValueSourceCache, AutoCommitTest, TestDistributedSearch, ConvertedLegacyTest, CoreAdminCreateDiscoverTest, TestCoreDiscovery, TestCustomSort, MigrateRouteKeyTest, TestDynamicFieldCollectionResource, SynonymTokenizerTest, CursorMarkTest, TestAddFieldRealTimeGet, ReturnFieldsTest, TestReloadAndDeleteDocs, BlockCacheTest, TestFreeTextSuggestions, TestReload, TestPostingsSolrHighlighter, StressHdfsTest, TestBinaryResponseWriter, TestJmxIntegration, TestSystemIdResolver, DateMathParserTest, SpatialFilterTest, EnumFieldTest, SolrRequestParserTest, TestElisionMultitermQuery, SimpleFacetsTest, TestCursorMarkWithoutUniqueKey, ChaosMonkeyNothingIsSafeTest, ClusterStateUpdateTest, TestDefaultSearchFieldResource, PolyFieldTest, PreAnalyzedUpdateProcessorTest, HardAutoCommitTest, TestConfig, NoFacetTest, TestQueryUtils, OverseerTest, PrimUtilsTest, TermVectorComponentDistributedTest, BasicFunctionalityTest, SearchHandlerTest, TestCharFilters, TestExtendedDismaxParser, HdfsDirectoryTest, EchoParamsTest, DirectSolrSpellCheckerTest, DefaultValueUpdateProcessorTest, SchemaVersionSpecificBehaviorTest, AddSchemaFieldsUpdateProcessorFactoryTest, AbstractAnalyticsFacetTest, QueryParsingTest, SuggesterTSTTest, CollectionsAPIDistributedZkTest, AddBlockUpdateTest, TestSort, TestSolrCoreProperties, ChangedSchemaMergeTest, TestFiltering, SolrPluginUtilsTest, TestFuzzyAnalyzedSuggestions, OpenCloseCoreStressTest, FileBasedSpellCheckerTest, SpellingQueryConverterTest, SignatureUpdateProcessorFactoryTest, AnalysisAfterCoreReloadTest, ExternalFileFieldSortTest, ShowFileRequestHandlerTest, HdfsCollectionsAPIDistributedZkTest, CoreMergeIndexesAdminHandlerTest, UpdateParamsTest, TestPerFieldSimilarity, TestLMJelinekMercerSimilarityFactory, RAMDirectoryFactoryTest, ResponseLogComponentTest, CursorPagingTest, OpenExchangeRatesOrgProviderTest, TestFaceting, TestRandomFaceting, TestReversedWildcardFilterFactory, TestSolrDeletionPolicy2, SpellPossibilityIteratorTest, TestJmxMonitoredMap, TestSearchPerf, TestMultiCoreConfBootstrap, SolrCoreCheckLockOnStartupTest, DocumentAnalysisRequestHandlerTest, TestOmitPositions, TimeZoneUtilsTest, CoreAdminHandlerTest, TestWriterPerf, TestSchemaSimilarityResource, TestCloudManagedSchemaAddField, AlternateDirectoryTest, BlockDirectoryTest, UnloadDistributedZkTest, IndexBasedSpellCheckerTest, ConnectionManagerTest, SolrInfoMBeanTest, DistributedQueryElevationComponentTest, TestLazyCores, TestMergePolicyConfig, TestSolrQueryParserResource, LoggingHandlerTest, TestFieldTypeResource, TestIndexSearcher, HighlighterConfigTest, PeerSyncTest, TestSchemaVersionResource, SampleTest, TestDistributedMissingSort, JSONWriterTest, RemoteQueryErrorTest, ParsingFieldUpdateProcessorsTest, AbstractAnalyticsStatsTest, RangeFacetTest, TestQuerySenderNoQuery, SyncSliceTest, TestStandardQParsers, TestFastOutputStream, TestAtomicUpdateErrorCases, SpellCheckComponentTest, SortByFunctionTest, SystemInfoHandlerTest, DocumentBuilderTest, TestFieldResource, TestFoldingMultitermQuery, TestDocBasedVersionConstraints, NumericFieldsTest, DeleteReplicaTest, URLClassifyProcessorTest, TestIBSimilarityFactory, TermsComponentTest, BJQParserTest, FieldMutatingUpdateProcessorTest, TestUpdate, TestFastLRUCache, SuggestComponentTest, SolrIndexSplitterTest, OverseerRolesTest, CustomCollectionTest, TestRecoveryHdfs, BasicDistributedZkTest, TestFileDictionaryLookup, LegacyHTMLStripCharFilterTest, TestQuerySenderListener, TestXIncludeConfig, TestFieldCollectionResource, ChaosMonkeySafeLeaderTest, BasicDistributedZk2Test, LeaderElectionIntegrationTest, ShardRoutingTest, BasicZkTest, RecoveryZkTest, FullSolrCloudDistribCmdsTest, TestReplicationHandler, LeaderElectionTest, ZkSolrClientTest, TestZkChroot, TestRandomDVFaceting, ZkCLITest, ShardRoutingCustomTest, SliceStateUpdateTest, TestDistributedGrouping]
   [junit4] Completed in 15.44s, 1 test, 1 error <<< FAILURES!

[...truncated 531 lines...]
BUILD FAILED
/Users/jenkins/workspace/Lucene-Solr-trunk-MacOSX/build.xml:453: The following error occurred while executing this line:
/Users/jenkins/workspace/Lucene-Solr-trunk-MacOSX/build.xml:433: The following error occurred while executing this line:
/Users/jenkins/workspace/Lucene-Solr-trunk-MacOSX/build.xml:39: The following error occurred while executing this line:
/Users/jenkins/workspace/Lucene-Solr-trunk-MacOSX/extra-targets.xml:37: The following error occurred while executing this line:
/Users/jenkins/workspace/Lucene-Solr-trunk-MacOSX/solr/build.xml:189: The following error occurred while executing this line:
/Users/jenkins/workspace/Lucene-Solr-trunk-MacOSX/solr/common-build.xml:491: The following error occurred while executing this line:
/Users/jenkins/workspace/Lucene-Solr-trunk-MacOSX/lucene/common-build.xml:1268: The following error occurred while executing this line:
/Users/jenkins/workspace/Lucene-Solr-trunk-MacOSX/lucene/common-build.xml:901: There were test failures: 372 suites, 1604 tests, 4 errors, 1 failure, 40 ignored (6 assumptions)

Total time: 86 minutes 13 seconds
Build step 'Invoke Ant' marked build as failure
Description set: Java: 64bit/jdk1.7.0 -XX:+UseCompressedOops -XX:+UseConcMarkSweepGC
Archiving artifacts
Recording test results
Email was triggered for: Failure
Sending email for trigger: Failure



Mime
View raw message