lucene-dev mailing list archives

Site index · List index
Message view « Date » · « Thread »
Top « Date » · « Thread »
From Policeman Jenkins Server <jenk...@thetaphi.de>
Subject [JENKINS] Lucene-Solr-4.x-Windows (32bit/jdk1.8.0-fcs-b129) - Build # 3713 - Still Failing!
Date Mon, 17 Feb 2014 12:31:12 GMT
Build: http://jenkins.thetaphi.de/job/Lucene-Solr-4.x-Windows/3713/
Java: 32bit/jdk1.8.0-fcs-b129 -client -XX:+UseParallelGC

1 tests failed.
FAILED:  org.apache.solr.client.solrj.impl.BasicHttpSolrServerTest.testConnectionRefused

Error Message:


Stack Trace:
java.lang.AssertionError
	at __randomizedtesting.SeedInfo.seed([248A9812D0C42111:B233C03074B6E15]:0)
	at org.junit.Assert.fail(Assert.java:92)
	at org.junit.Assert.assertTrue(Assert.java:43)
	at org.junit.Assert.assertTrue(Assert.java:54)
	at org.apache.solr.client.solrj.impl.BasicHttpSolrServerTest.testConnectionRefused(BasicHttpSolrServerTest.java:158)
	at sun.reflect.NativeMethodAccessorImpl.invoke0(Native Method)
	at sun.reflect.NativeMethodAccessorImpl.invoke(NativeMethodAccessorImpl.java:62)
	at sun.reflect.DelegatingMethodAccessorImpl.invoke(DelegatingMethodAccessorImpl.java:43)
	at java.lang.reflect.Method.invoke(Method.java:483)
	at com.carrotsearch.randomizedtesting.RandomizedRunner.invoke(RandomizedRunner.java:1559)
	at com.carrotsearch.randomizedtesting.RandomizedRunner.access$600(RandomizedRunner.java:79)
	at com.carrotsearch.randomizedtesting.RandomizedRunner$6.evaluate(RandomizedRunner.java:737)
	at com.carrotsearch.randomizedtesting.RandomizedRunner$7.evaluate(RandomizedRunner.java:773)
	at com.carrotsearch.randomizedtesting.RandomizedRunner$8.evaluate(RandomizedRunner.java:787)
	at com.carrotsearch.randomizedtesting.rules.SystemPropertiesRestoreRule$1.evaluate(SystemPropertiesRestoreRule.java:53)
	at org.apache.lucene.util.TestRuleSetupTeardownChained$1.evaluate(TestRuleSetupTeardownChained.java:50)
	at org.apache.lucene.util.TestRuleFieldCacheSanity$1.evaluate(TestRuleFieldCacheSanity.java:51)
	at org.apache.lucene.util.AbstractBeforeAfterRule$1.evaluate(AbstractBeforeAfterRule.java:46)
	at com.carrotsearch.randomizedtesting.rules.SystemPropertiesInvariantRule$1.evaluate(SystemPropertiesInvariantRule.java:55)
	at org.apache.lucene.util.TestRuleThreadAndTestName$1.evaluate(TestRuleThreadAndTestName.java:49)
	at org.apache.lucene.util.TestRuleIgnoreAfterMaxFailures$1.evaluate(TestRuleIgnoreAfterMaxFailures.java:70)
	at org.apache.lucene.util.TestRuleMarkFailure$1.evaluate(TestRuleMarkFailure.java:48)
	at com.carrotsearch.randomizedtesting.rules.StatementAdapter.evaluate(StatementAdapter.java:36)
	at com.carrotsearch.randomizedtesting.ThreadLeakControl$StatementRunner.run(ThreadLeakControl.java:358)
	at com.carrotsearch.randomizedtesting.ThreadLeakControl.forkTimeoutingTask(ThreadLeakControl.java:782)
	at com.carrotsearch.randomizedtesting.ThreadLeakControl$3.evaluate(ThreadLeakControl.java:442)
	at com.carrotsearch.randomizedtesting.RandomizedRunner.runSingleTest(RandomizedRunner.java:746)
	at com.carrotsearch.randomizedtesting.RandomizedRunner$3.evaluate(RandomizedRunner.java:648)
	at com.carrotsearch.randomizedtesting.RandomizedRunner$4.evaluate(RandomizedRunner.java:682)
	at com.carrotsearch.randomizedtesting.RandomizedRunner$5.evaluate(RandomizedRunner.java:693)
	at com.carrotsearch.randomizedtesting.rules.StatementAdapter.evaluate(StatementAdapter.java:36)
	at com.carrotsearch.randomizedtesting.rules.SystemPropertiesRestoreRule$1.evaluate(SystemPropertiesRestoreRule.java:53)
	at org.apache.lucene.util.AbstractBeforeAfterRule$1.evaluate(AbstractBeforeAfterRule.java:46)
	at org.apache.lucene.util.TestRuleStoreClassName$1.evaluate(TestRuleStoreClassName.java:42)
	at com.carrotsearch.randomizedtesting.rules.SystemPropertiesInvariantRule$1.evaluate(SystemPropertiesInvariantRule.java:55)
	at com.carrotsearch.randomizedtesting.rules.NoShadowingOrOverridesOnMethodsRule$1.evaluate(NoShadowingOrOverridesOnMethodsRule.java:39)
	at com.carrotsearch.randomizedtesting.rules.NoShadowingOrOverridesOnMethodsRule$1.evaluate(NoShadowingOrOverridesOnMethodsRule.java:39)
	at com.carrotsearch.randomizedtesting.rules.StatementAdapter.evaluate(StatementAdapter.java:36)
	at org.apache.lucene.util.TestRuleAssertionsRequired$1.evaluate(TestRuleAssertionsRequired.java:43)
	at org.apache.lucene.util.TestRuleMarkFailure$1.evaluate(TestRuleMarkFailure.java:48)
	at org.apache.lucene.util.TestRuleIgnoreAfterMaxFailures$1.evaluate(TestRuleIgnoreAfterMaxFailures.java:70)
	at org.apache.lucene.util.TestRuleIgnoreTestSuites$1.evaluate(TestRuleIgnoreTestSuites.java:55)
	at com.carrotsearch.randomizedtesting.rules.StatementAdapter.evaluate(StatementAdapter.java:36)
	at com.carrotsearch.randomizedtesting.ThreadLeakControl$StatementRunner.run(ThreadLeakControl.java:358)
	at java.lang.Thread.run(Thread.java:744)




Build Log:
[...truncated 11553 lines...]
   [junit4] Suite: org.apache.solr.client.solrj.impl.BasicHttpSolrServerTest
   [junit4]   2> 188129 T568 oas.SolrTestCaseJ4.buildSSLConfig Randomized ssl (true) and
clientAuth (false)
   [junit4]   2> 188129 T568 oas.SolrTestCaseJ4.initCore ####initCore
   [junit4]   2> Creating dataDir: C:\Users\JenkinsSlave\workspace\Lucene-Solr-4.x-Windows\solr\build\solr-solrj\test\J0\.\solrtest-BasicHttpSolrServerTest-1392640212227
   [junit4]   2> 188130 T568 oas.SolrTestCaseJ4.initCore ####initCore end
   [junit4]   2> 188131 T568 oejs.Server.doStart jetty-8.1.10.v20130312
   [junit4]   2> 188140 T568 oejus.SslContextFactory.doStart Enabled Protocols [SSLv2Hello,
SSLv3, TLSv1, TLSv1.1, TLSv1.2] of [SSLv2Hello, SSLv3, TLSv1, TLSv1.1, TLSv1.2]
   [junit4]   2> 188159 T568 oejs.AbstractConnector.doStart Started SslSelectChannelConnector@127.0.0.1:64554
   [junit4]   2> 188163 T568 oass.SolrDispatchFilter.init SolrDispatchFilter.init()
   [junit4]   2> 188163 T568 oasc.SolrResourceLoader.locateSolrHome JNDI not configured
for solr (NoInitialContextEx)
   [junit4]   2> 188163 T568 oasc.SolrResourceLoader.locateSolrHome using system property
solr.solr.home: C:\Users\JenkinsSlave\workspace\Lucene-Solr-4.x-Windows\solr\example\solr
   [junit4]   2> 188163 T568 oasc.SolrResourceLoader.<init> new SolrResourceLoader
for directory: 'C:\Users\JenkinsSlave\workspace\Lucene-Solr-4.x-Windows\solr\example\solr\'
   [junit4]   2> 188203 T568 oasc.ConfigSolr.fromFile Loading container configuration from
C:\Users\JenkinsSlave\workspace\Lucene-Solr-4.x-Windows\solr\example\solr\solr.xml
   [junit4]   2> 188217 T568 oasc.CorePropertiesLocator.<init> Config-defined core
root directory: C:\Users\JenkinsSlave\workspace\Lucene-Solr-4.x-Windows\solr\example\solr
   [junit4]   2> 188217 T568 oasc.CoreContainer.<init> New CoreContainer 28966554
   [junit4]   2> 188217 T568 oasc.CoreContainer.load Loading cores into CoreContainer [instanceDir=C:\Users\JenkinsSlave\workspace\Lucene-Solr-4.x-Windows\solr\example\solr\]
   [junit4]   2> 188219 T568 oashc.HttpShardHandlerFactory.getParameter Setting socketTimeout
to: 0
   [junit4]   2> 188219 T568 oashc.HttpShardHandlerFactory.getParameter Setting urlScheme
to: null
   [junit4]   2> 188219 T568 oashc.HttpShardHandlerFactory.getParameter Setting connTimeout
to: 0
   [junit4]   2> 188220 T568 oashc.HttpShardHandlerFactory.getParameter Setting maxConnectionsPerHost
to: 20
   [junit4]   2> 188220 T568 oashc.HttpShardHandlerFactory.getParameter Setting corePoolSize
to: 0
   [junit4]   2> 188220 T568 oashc.HttpShardHandlerFactory.getParameter Setting maximumPoolSize
to: 2147483647
   [junit4]   2> 188220 T568 oashc.HttpShardHandlerFactory.getParameter Setting maxThreadIdleTime
to: 5
   [junit4]   2> 188220 T568 oashc.HttpShardHandlerFactory.getParameter Setting sizeOfQueue
to: -1
   [junit4]   2> 188220 T568 oashc.HttpShardHandlerFactory.getParameter Setting fairnessPolicy
to: false
   [junit4]   2> 188234 T568 oasl.LogWatcher.createWatcher SLF4J impl is org.slf4j.impl.Log4jLoggerFactory
   [junit4]   2> 188234 T568 oasl.LogWatcher.newRegisteredLogWatcher Registering Log Listener
[Log4j (org.slf4j.impl.Log4jLoggerFactory)]
   [junit4]   2> 188234 T568 oasc.CoreContainer.load Host Name: 
   [junit4]   2> 188238 T568 oasc.CorePropertiesLocator.discover Looking for core definitions
underneath C:\Users\JenkinsSlave\workspace\Lucene-Solr-4.x-Windows\solr\example\solr
   [junit4]   2> 188262 T568 oasc.CorePropertiesLocator.discoverUnder Found core collection1
in C:\Users\JenkinsSlave\workspace\Lucene-Solr-4.x-Windows\solr\example\solr\collection1\
   [junit4]   2> 188264 T568 oasc.CorePropertiesLocator.discover Found 1 core definitions
   [junit4]   2> 188266 T579 oasc.CoreContainer.create Creating SolrCore 'collection1'
using instanceDir: C:\Users\JenkinsSlave\workspace\Lucene-Solr-4.x-Windows\solr\example\solr\collection1
   [junit4]   2> 188266 T579 oasc.SolrResourceLoader.<init> new SolrResourceLoader
for directory: 'C:\Users\JenkinsSlave\workspace\Lucene-Solr-4.x-Windows\solr\example\solr\collection1\'
   [junit4]   2> 188307 T579 oasc.SolrConfig.initLibs Adding specified lib dirs to ClassLoader
   [junit4]   2> 188309 T579 oasc.SolrResourceLoader.addToClassLoader WARN No files added
to classloader from lib: ../../../contrib/extraction/lib (resolved as: C:\Users\JenkinsSlave\workspace\Lucene-Solr-4.x-Windows\solr\example\solr\collection1\..\..\..\contrib\extraction\lib).
   [junit4]   2> 188309 T579 oasc.SolrResourceLoader.addToClassLoader WARN Can't find (or
read) directory to add to classloader: ../../../dist/ (resolved as: C:\Users\JenkinsSlave\workspace\Lucene-Solr-4.x-Windows\solr\example\solr\collection1\..\..\..\dist).
   [junit4]   2> 188310 T579 oasc.SolrResourceLoader.addToClassLoader WARN No files added
to classloader from lib: ../../../contrib/clustering/lib/ (resolved as: C:\Users\JenkinsSlave\workspace\Lucene-Solr-4.x-Windows\solr\example\solr\collection1\..\..\..\contrib\clustering\lib).
   [junit4]   2> 188310 T579 oasc.SolrResourceLoader.addToClassLoader WARN Can't find (or
read) directory to add to classloader: ../../../dist/ (resolved as: C:\Users\JenkinsSlave\workspace\Lucene-Solr-4.x-Windows\solr\example\solr\collection1\..\..\..\dist).
   [junit4]   2> 188312 T579 oasc.SolrResourceLoader.addToClassLoader WARN No files added
to classloader from lib: ../../../contrib/langid/lib/ (resolved as: C:\Users\JenkinsSlave\workspace\Lucene-Solr-4.x-Windows\solr\example\solr\collection1\..\..\..\contrib\langid\lib).
   [junit4]   2> 188312 T579 oasc.SolrResourceLoader.addToClassLoader WARN Can't find (or
read) directory to add to classloader: ../../../dist/ (resolved as: C:\Users\JenkinsSlave\workspace\Lucene-Solr-4.x-Windows\solr\example\solr\collection1\..\..\..\dist).
   [junit4]   2> 188314 T579 oasc.SolrResourceLoader.addToClassLoader WARN No files added
to classloader from lib: ../../../contrib/velocity/lib (resolved as: C:\Users\JenkinsSlave\workspace\Lucene-Solr-4.x-Windows\solr\example\solr\collection1\..\..\..\contrib\velocity\lib).
   [junit4]   2> 188314 T579 oasc.SolrResourceLoader.addToClassLoader WARN Can't find (or
read) directory to add to classloader: ../../../dist/ (resolved as: C:\Users\JenkinsSlave\workspace\Lucene-Solr-4.x-Windows\solr\example\solr\collection1\..\..\..\dist).
   [junit4]   2> 188333 T579 oasu.SolrIndexConfig.<init> IndexWriter infoStream solr
logging is enabled
   [junit4]   2> 188334 T579 oasc.SolrConfig.<init> Using Lucene MatchVersion: LUCENE_47
   [junit4]   2> 188360 T579 oasc.SolrConfig.<init> Loaded SolrConfig: solrconfig.xml
   [junit4]   2> 188362 T579 oass.IndexSchema.readSchema Reading Solr Schema from schema.xml
   [junit4]   2> 188369 T579 oass.IndexSchema.readSchema [collection1] Schema name=example
   [junit4]   2> 188544 T579 oass.IndexSchema.readSchema unique key field: id
   [junit4]   2> 188555 T579 oass.FileExchangeRateProvider.reload Reloading exchange rates
from file currency.xml
   [junit4]   2> 188558 T579 oass.FileExchangeRateProvider.reload Reloading exchange rates
from file currency.xml
   [junit4]   2> 188581 T579 oasc.SolrCore.initDirectoryFactory org.apache.solr.core.MockDirectoryFactory
   [junit4]   2> 188581 T579 oasc.SolrCore.<init> [collection1] Opening new SolrCore
at C:\Users\JenkinsSlave\workspace\Lucene-Solr-4.x-Windows\solr\example\solr\collection1\,
dataDir=C:\Users\JenkinsSlave\workspace\Lucene-Solr-4.x-Windows\solr\build\solr-solrj\test\J0\solrtest-BasicHttpSolrServerTest-1392640212227\
   [junit4]   2> 188581 T579 oasc.JmxMonitoredMap.<init> JMX monitoring is enabled.
Adding Solr mbeans to JMX Server: com.sun.jmx.mbeanserver.JmxMBeanServer@183316
   [junit4]   2> 188582 T579 oasc.SolrCore.initListeners [collection1] Added SolrEventListener
for newSearcher: org.apache.solr.core.QuerySenderListener{queries=[]}
   [junit4]   2> 188582 T579 oasc.SolrCore.initListeners [collection1] Added SolrEventListener
for firstSearcher: org.apache.solr.core.QuerySenderListener{queries=[{q=static firstSearcher
warming in solrconfig.xml}]}
   [junit4]   2> 188582 T579 oasc.CachingDirectoryFactory.get return new directory for
C:\Users\JenkinsSlave\workspace\Lucene-Solr-4.x-Windows\solr\build\solr-solrj\test\J0\solrtest-BasicHttpSolrServerTest-1392640212227\
   [junit4]   2> 188582 T579 oasc.SolrCore.getNewIndexDir New index directory detected:
old=null new=C:\Users\JenkinsSlave\workspace\Lucene-Solr-4.x-Windows\solr\build\solr-solrj\test\J0\solrtest-BasicHttpSolrServerTest-1392640212227\index/
   [junit4]   2> 188582 T579 oasc.SolrCore.initIndex WARN [collection1] Solr index directory
'C:\Users\JenkinsSlave\workspace\Lucene-Solr-4.x-Windows\solr\build\solr-solrj\test\J0\solrtest-BasicHttpSolrServerTest-1392640212227\index'
doesn't exist. Creating new index...
   [junit4]   2> 188583 T579 oasc.CachingDirectoryFactory.get return new directory for
C:\Users\JenkinsSlave\workspace\Lucene-Solr-4.x-Windows\solr\build\solr-solrj\test\J0\solrtest-BasicHttpSolrServerTest-1392640212227\index
   [junit4]   2> 188585 T579 oasu.LoggingInfoStream.message [IFD][coreLoadExecutor-287-thread-1]:
init: current segments file is "null"; deletionPolicy=org.apache.solr.core.IndexDeletionPolicyWrapper@15b2bba
   [junit4]   2> 188585 T579 oasu.LoggingInfoStream.message [IFD][coreLoadExecutor-287-thread-1]:
now checkpoint "" [0 segments ; isCommit = false]
   [junit4]   2> 188585 T579 oasu.LoggingInfoStream.message [IFD][coreLoadExecutor-287-thread-1]:
0 msec to checkpoint
   [junit4]   2> 188585 T579 oasu.LoggingInfoStream.message [IW][coreLoadExecutor-287-thread-1]:
init: create=true
   [junit4]   2> 188585 T579 oasu.LoggingInfoStream.message [IW][coreLoadExecutor-287-thread-1]:

   [junit4]   2> 	dir=MockDirectoryWrapper(RAMDirectory@91eae8 lockFactory=NativeFSLockFactory@C:\Users\JenkinsSlave\workspace\Lucene-Solr-4.x-Windows\solr\build\solr-solrj\test\J0\solrtest-BasicHttpSolrServerTest-1392640212227\index)
   [junit4]   2> 	index=
   [junit4]   2> 	version=4.7-SNAPSHOT
   [junit4]   2> 	matchVersion=LUCENE_47
   [junit4]   2> 	analyzer=null
   [junit4]   2> 	ramBufferSizeMB=100.0
   [junit4]   2> 	maxBufferedDocs=-1
   [junit4]   2> 	maxBufferedDeleteTerms=-1
   [junit4]   2> 	mergedSegmentWarmer=null
   [junit4]   2> 	readerTermsIndexDivisor=1
   [junit4]   2> 	termIndexInterval=32
   [junit4]   2> 	delPolicy=org.apache.solr.core.IndexDeletionPolicyWrapper
   [junit4]   2> 	commit=null
   [junit4]   2> 	openMode=CREATE
   [junit4]   2> 	similarity=org.apache.lucene.search.similarities.DefaultSimilarity
   [junit4]   2> 	mergeScheduler=ConcurrentMergeScheduler: maxThreadCount=1, maxMergeCount=2,
mergeThreadPriority=-1
   [junit4]   2> 	default WRITE_LOCK_TIMEOUT=1000
   [junit4]   2> 	writeLockTimeout=1000
   [junit4]   2> 	codec=Lucene46
   [junit4]   2> 	infoStream=org.apache.solr.update.LoggingInfoStream
   [junit4]   2> 	mergePolicy=[TieredMergePolicy: maxMergeAtOnce=10, maxMergeAtOnceExplicit=30,
maxMergedSegmentMB=5120.0, floorSegmentMB=2.0, forceMergeDeletesPctAllowed=10.0, segmentsPerTier=10.0,
maxCFSSegmentSizeMB=8.796093022207999E12, noCFSRatio=0.0
   [junit4]   2> 	indexerThreadPool=org.apache.lucene.index.ThreadAffinityDocumentsWriterThreadPool@9a4253
   [junit4]   2> 	readerPooling=false
   [junit4]   2> 	perThreadHardLimitMB=1945
   [junit4]   2> 	useCompoundFile=false
   [junit4]   2> 	
   [junit4]   2> 188585 T579 oasu.LoggingInfoStream.message [IW][coreLoadExecutor-287-thread-1]:
now flush at close waitForMerges=true
   [junit4]   2> 188585 T579 oasu.LoggingInfoStream.message [IW][coreLoadExecutor-287-thread-1]:
  start flush: applyAllDeletes=true
   [junit4]   2> 188585 T579 oasu.LoggingInfoStream.message [IW][coreLoadExecutor-287-thread-1]:
  index before flush 
   [junit4]   2> 188585 T579 oasu.LoggingInfoStream.message [DW][coreLoadExecutor-287-thread-1]:
coreLoadExecutor-287-thread-1 startFullFlush
   [junit4]   2> 188585 T579 oasu.LoggingInfoStream.message [DW][coreLoadExecutor-287-thread-1]:
anyChanges? numDocsInRam=0 deletes=false hasTickets:false pendingChangesInFullFlush: false
   [junit4]   2> 188585 T579 oasu.LoggingInfoStream.message [DW][coreLoadExecutor-287-thread-1]:
coreLoadExecutor-287-thread-1 finishFullFlush success=true
   [junit4]   2> 188587 T579 oasu.LoggingInfoStream.message [IW][coreLoadExecutor-287-thread-1]:
apply all deletes during flush
   [junit4]   2> 188587 T579 oasu.LoggingInfoStream.message [BD][coreLoadExecutor-287-thread-1]:
prune sis=org.apache.lucene.index.SegmentInfos@1f54217 minGen=9223372036854775807 packetCount=0
   [junit4]   2> 188587 T579 oasu.LoggingInfoStream.message [CMS][coreLoadExecutor-287-thread-1]:
now merge
   [junit4]   2> 188587 T579 oasu.LoggingInfoStream.message [CMS][coreLoadExecutor-287-thread-1]:
  index: 
   [junit4]   2> 188587 T579 oasu.LoggingInfoStream.message [CMS][coreLoadExecutor-287-thread-1]:
  no more merges pending; now return
   [junit4]   2> 188587 T579 oasu.LoggingInfoStream.message [IW][coreLoadExecutor-287-thread-1]:
waitForMerges
   [junit4]   2> 188587 T579 oasu.LoggingInfoStream.message [IW][coreLoadExecutor-287-thread-1]:
waitForMerges done
   [junit4]   2> 188587 T579 oasu.LoggingInfoStream.message [IW][coreLoadExecutor-287-thread-1]:
now call final commit()
   [junit4]   2> 188587 T579 oasu.LoggingInfoStream.message [IW][coreLoadExecutor-287-thread-1]:
commit: start
   [junit4]   2> 188587 T579 oasu.LoggingInfoStream.message [IW][coreLoadExecutor-287-thread-1]:
commit: enter lock
   [junit4]   2> 188587 T579 oasu.LoggingInfoStream.message [IW][coreLoadExecutor-287-thread-1]:
commit: now prepare
   [junit4]   2> 188587 T579 oasu.LoggingInfoStream.message [IW][coreLoadExecutor-287-thread-1]:
prepareCommit: flush
   [junit4]   2> 188587 T579 oasu.LoggingInfoStream.message [IW][coreLoadExecutor-287-thread-1]:
  index before flush 
   [junit4]   2> 188587 T579 oasu.LoggingInfoStream.message [DW][coreLoadExecutor-287-thread-1]:
coreLoadExecutor-287-thread-1 startFullFlush
   [junit4]   2> 188587 T579 oasu.LoggingInfoStream.message [DW][coreLoadExecutor-287-thread-1]:
anyChanges? numDocsInRam=0 deletes=false hasTickets:false pendingChangesInFullFlush: false
   [junit4]   2> 188587 T579 oasu.LoggingInfoStream.message [IW][coreLoadExecutor-287-thread-1]:
apply all deletes during flush
   [junit4]   2> 188587 T579 oasu.LoggingInfoStream.message [BD][coreLoadExecutor-287-thread-1]:
prune sis=org.apache.lucene.index.SegmentInfos@1f54217 minGen=9223372036854775807 packetCount=0
   [junit4]   2> 188587 T579 oasu.LoggingInfoStream.message [DW][coreLoadExecutor-287-thread-1]:
coreLoadExecutor-287-thread-1 finishFullFlush success=true
   [junit4]   2> 188589 T579 oasu.LoggingInfoStream.message [IW][coreLoadExecutor-287-thread-1]:
startCommit(): start
   [junit4]   2> 188589 T579 oasu.LoggingInfoStream.message [IW][coreLoadExecutor-287-thread-1]:
startCommit index= changeCount=1
   [junit4]   2> 188589 T579 oasu.LoggingInfoStream.message [IW][coreLoadExecutor-287-thread-1]:
done all syncs: []
   [junit4]   2> 188589 T579 oasu.LoggingInfoStream.message [IW][coreLoadExecutor-287-thread-1]:
commit: pendingCommit != null
   [junit4]   2> 188589 T579 oasu.LoggingInfoStream.message [IW][coreLoadExecutor-287-thread-1]:
commit: wrote segments file "segments_1"
   [junit4]   2> 188589 T579 oasu.LoggingInfoStream.message [IFD][coreLoadExecutor-287-thread-1]:
now checkpoint "" [0 segments ; isCommit = true]
   [junit4]   2> 188590 T579 oasc.SolrDeletionPolicy.onCommit SolrDeletionPolicy.onCommit:
commits: num=1
   [junit4]   2> 		commit{dir=MockDirectoryWrapper(RAMDirectory@91eae8 lockFactory=NativeFSLockFactory@C:\Users\JenkinsSlave\workspace\Lucene-Solr-4.x-Windows\solr\build\solr-solrj\test\J0\solrtest-BasicHttpSolrServerTest-1392640212227\index),segFN=segments_1,generation=1}
   [junit4]   2> 188590 T579 oasc.SolrDeletionPolicy.updateCommits newest commit generation
= 1
   [junit4]   2> 188590 T579 oasu.LoggingInfoStream.message [IFD][coreLoadExecutor-287-thread-1]:
0 msec to checkpoint
   [junit4]   2> 188590 T579 oasu.LoggingInfoStream.message [IW][coreLoadExecutor-287-thread-1]:
commit: done
   [junit4]   2> 188590 T579 oasu.LoggingInfoStream.message [IW][coreLoadExecutor-287-thread-1]:
at close: 
   [junit4]   2> 188591 T579 oasc.SolrCore.initWriters created json: solr.JSONResponseWriter
   [junit4]   2> 188591 T579 oasc.SolrCore.initWriters adding lazy queryResponseWriter:
solr.VelocityResponseWriter
   [junit4]   2> 188591 T579 oasc.SolrCore.initWriters created velocity: solr.VelocityResponseWriter
   [junit4]   2> 188592 T579 oasc.SolrCore.initWriters created xslt: solr.XSLTResponseWriter
   [junit4]   2> 188592 T579 oasr.XSLTResponseWriter.init xsltCacheLifetimeSeconds=5
   [junit4]   2> 188595 T579 oasc.SolrCore.loadUpdateProcessorChains no updateRequestProcessorChain
defined as default, creating implicit default
   [junit4]   2> 188595 T579 oasc.RequestHandlers.initHandlersFromConfig created /select:
solr.SearchHandler
   [junit4]   2> 188595 T579 oasc.RequestHandlers.initHandlersFromConfig created /query:
solr.SearchHandler
   [junit4]   2> 188597 T579 oasc.RequestHandlers.initHandlersFromConfig created /get:
solr.RealTimeGetHandler
   [junit4]   2> 188597 T579 oasc.RequestHandlers.initHandlersFromConfig created /browse:
solr.SearchHandler
   [junit4]   2> 188597 T579 oasc.RequestHandlers.initHandlersFromConfig created /update:
solr.UpdateRequestHandler
   [junit4]   2> 188597 T579 oasc.RequestHandlers.initHandlersFromConfig created /update/json:
solr.UpdateRequestHandler
   [junit4]   2> 188598 T579 oasc.RequestHandlers.initHandlersFromConfig created /update/csv:
solr.UpdateRequestHandler
   [junit4]   2> 188598 T579 oasc.RequestHandlers.initHandlersFromConfig adding lazy requestHandler:
solr.extraction.ExtractingRequestHandler
   [junit4]   2> 188598 T579 oasc.RequestHandlers.initHandlersFromConfig created /update/extract:
solr.extraction.ExtractingRequestHandler
   [junit4]   2> 188598 T579 oasc.RequestHandlers.initHandlersFromConfig adding lazy requestHandler:
solr.FieldAnalysisRequestHandler
   [junit4]   2> 188598 T579 oasc.RequestHandlers.initHandlersFromConfig created /analysis/field:
solr.FieldAnalysisRequestHandler
   [junit4]   2> 188598 T579 oasc.RequestHandlers.initHandlersFromConfig adding lazy requestHandler:
solr.DocumentAnalysisRequestHandler
   [junit4]   2> 188598 T579 oasc.RequestHandlers.initHandlersFromConfig created /analysis/document:
solr.DocumentAnalysisRequestHandler
   [junit4]   2> 188599 T579 oasc.RequestHandlers.initHandlersFromConfig created /admin/:
solr.admin.AdminHandlers
   [junit4]   2> 188600 T579 oasc.RequestHandlers.initHandlersFromConfig created /admin/ping:
solr.PingRequestHandler
   [junit4]   2> 188600 T579 oasc.RequestHandlers.initHandlersFromConfig created /debug/dump:
solr.DumpRequestHandler
   [junit4]   2> 188601 T579 oasc.RequestHandlers.initHandlersFromConfig created /replication:
solr.ReplicationHandler
   [junit4]   2> 188601 T579 oasc.RequestHandlers.initHandlersFromConfig adding lazy requestHandler:
solr.SearchHandler
   [junit4]   2> 188601 T579 oasc.RequestHandlers.initHandlersFromConfig created /spell:
solr.SearchHandler
   [junit4]   2> 188601 T579 oasc.RequestHandlers.initHandlersFromConfig adding lazy requestHandler:
solr.SearchHandler
   [junit4]   2> 188601 T579 oasc.RequestHandlers.initHandlersFromConfig created /suggest:
solr.SearchHandler
   [junit4]   2> 188601 T579 oasc.RequestHandlers.initHandlersFromConfig adding lazy requestHandler:
solr.SearchHandler
   [junit4]   2> 188601 T579 oasc.RequestHandlers.initHandlersFromConfig created /tvrh:
solr.SearchHandler
   [junit4]   2> 188601 T579 oasc.RequestHandlers.initHandlersFromConfig adding lazy requestHandler:
solr.SearchHandler
   [junit4]   2> 188601 T579 oasc.RequestHandlers.initHandlersFromConfig created /terms:
solr.SearchHandler
   [junit4]   2> 188601 T579 oasc.RequestHandlers.initHandlersFromConfig adding lazy requestHandler:
solr.SearchHandler
   [junit4]   2> 188601 T579 oasc.RequestHandlers.initHandlersFromConfig created /elevate:
solr.SearchHandler
   [junit4]   2> 188608 T579 oashl.XMLLoader.init xsltCacheLifetimeSeconds=60
   [junit4]   2> 188609 T579 oashl.XMLLoader.init xsltCacheLifetimeSeconds=60
   [junit4]   2> 188611 T579 oashl.XMLLoader.init xsltCacheLifetimeSeconds=60
   [junit4]   2> 188615 T579 oasu.CommitTracker.<init> Hard AutoCommit: if uncommited
for 15000ms; 
   [junit4]   2> 188615 T579 oasu.CommitTracker.<init> Soft AutoCommit: disabled
   [junit4]   2> 188616 T579 oasu.LoggingInfoStream.message [IFD][coreLoadExecutor-287-thread-1]:
init: current segments file is "segments_1"; deletionPolicy=org.apache.solr.core.IndexDeletionPolicyWrapper@15b2bba
   [junit4]   2> 188616 T579 oasu.LoggingInfoStream.message [IFD][coreLoadExecutor-287-thread-1]:
init: load commit "segments_1"
   [junit4]   2> 188616 T579 oasc.SolrDeletionPolicy.onInit SolrDeletionPolicy.onInit:
commits: num=1
   [junit4]   2> 		commit{dir=MockDirectoryWrapper(RAMDirectory@91eae8 lockFactory=NativeFSLockFactory@C:\Users\JenkinsSlave\workspace\Lucene-Solr-4.x-Windows\solr\build\solr-solrj\test\J0\solrtest-BasicHttpSolrServerTest-1392640212227\index),segFN=segments_1,generation=1}
   [junit4]   2> 188616 T579 oasc.SolrDeletionPolicy.updateCommits newest commit generation
= 1
   [junit4]   2> 188617 T579 oasu.LoggingInfoStream.message [IFD][coreLoadExecutor-287-thread-1]:
now checkpoint "" [0 segments ; isCommit = false]
   [junit4]   2> 188617 T579 oasu.LoggingInfoStream.message [IFD][coreLoadExecutor-287-thread-1]:
0 msec to checkpoint
   [junit4]   2> 188618 T579 oasu.LoggingInfoStream.message [IW][coreLoadExecutor-287-thread-1]:
init: create=false
   [junit4]   2> 188618 T579 oasu.LoggingInfoStream.message [IW][coreLoadExecutor-287-thread-1]:

   [junit4]   2> 	dir=MockDirectoryWrapper(RAMDirectory@91eae8 lockFactory=NativeFSLockFactory@C:\Users\JenkinsSlave\workspace\Lucene-Solr-4.x-Windows\solr\build\solr-solrj\test\J0\solrtest-BasicHttpSolrServerTest-1392640212227\index)
   [junit4]   2> 	index=
   [junit4]   2> 	version=4.7-SNAPSHOT
   [junit4]   2> 	matchVersion=LUCENE_47
   [junit4]   2> 	analyzer=null
   [junit4]   2> 	ramBufferSizeMB=100.0
   [junit4]   2> 	maxBufferedDocs=-1
   [junit4]   2> 	maxBufferedDeleteTerms=-1
   [junit4]   2> 	mergedSegmentWarmer=null
   [junit4]   2> 	readerTermsIndexDivisor=1
   [junit4]   2> 	termIndexInterval=32
   [junit4]   2> 	delPolicy=org.apache.solr.core.IndexDeletionPolicyWrapper
   [junit4]   2> 	commit=null
   [junit4]   2> 	openMode=APPEND
   [junit4]   2> 	similarity=org.apache.lucene.search.similarities.DefaultSimilarity
   [junit4]   2> 	mergeScheduler=ConcurrentMergeScheduler: maxThreadCount=1, maxMergeCount=2,
mergeThreadPriority=-1
   [junit4]   2> 	default WRITE_LOCK_TIMEOUT=1000
   [junit4]   2> 	writeLockTimeout=1000
   [junit4]   2> 	codec=Lucene46
   [junit4]   2> 	infoStream=org.apache.solr.update.LoggingInfoStream
   [junit4]   2> 	mergePolicy=[TieredMergePolicy: maxMergeAtOnce=10, maxMergeAtOnceExplicit=30,
maxMergedSegmentMB=5120.0, floorSegmentMB=2.0, forceMergeDeletesPctAllowed=10.0, segmentsPerTier=10.0,
maxCFSSegmentSizeMB=8.796093022207999E12, noCFSRatio=0.0
   [junit4]   2> 	indexerThreadPool=org.apache.lucene.index.ThreadAffinityDocumentsWriterThreadPool@10525f3
   [junit4]   2> 	readerPooling=false
   [junit4]   2> 	perThreadHardLimitMB=1945
   [junit4]   2> 	useCompoundFile=false
   [junit4]   2> 	
   [junit4]   2> 188618 T579 oasu.LoggingInfoStream.message [IW][coreLoadExecutor-287-thread-1]:
flush at getReader
   [junit4]   2> 188618 T579 oasu.LoggingInfoStream.message [DW][coreLoadExecutor-287-thread-1]:
coreLoadExecutor-287-thread-1 startFullFlush
   [junit4]   2> 188618 T579 oasu.LoggingInfoStream.message [DW][coreLoadExecutor-287-thread-1]:
anyChanges? numDocsInRam=0 deletes=false hasTickets:false pendingChangesInFullFlush: false
   [junit4]   2> 188618 T579 oasu.LoggingInfoStream.message [IW][coreLoadExecutor-287-thread-1]:
apply all deletes during flush
   [junit4]   2> 188618 T579 oasu.LoggingInfoStream.message [BD][coreLoadExecutor-287-thread-1]:
prune sis=org.apache.lucene.index.SegmentInfos@179b1aa minGen=9223372036854775807 packetCount=0
   [junit4]   2> 188618 T579 oasu.LoggingInfoStream.message [IW][coreLoadExecutor-287-thread-1]:
return reader version=1 reader=StandardDirectoryReader(segments_1:1:nrt)
   [junit4]   2> 188618 T579 oasu.LoggingInfoStream.message [DW][coreLoadExecutor-287-thread-1]:
coreLoadExecutor-287-thread-1 finishFullFlush success=true
   [junit4]   2> 188620 T579 oasu.LoggingInfoStream.message [IW][coreLoadExecutor-287-thread-1]:
getReader took 2 msec
   [junit4]   2> 188620 T579 oass.SolrIndexSearcher.<init> Opening Searcher@24591b[collection1]
main
   [junit4]   2> 188620 T579 oashc.SpellCheckComponent.inform Initializing spell checkers
   [junit4]   2> 188621 T579 oass.DirectSolrSpellChecker.init init: {name=default,field=text,classname=solr.DirectSolrSpellChecker,distanceMeasure=internal,accuracy=0.5,maxEdits=2,minPrefix=1,maxInspections=5,minQueryLength=4,maxQueryFrequency=0.01}
   [junit4]   2> 188622 T579 oashc.SpellCheckComponent.inform No queryConverter defined,
using default converter
   [junit4]   2> 188622 T579 oashc.SuggestComponent.inform Initializing SuggestComponent
   [junit4]   2> 188622 T579 oasss.SolrSuggester.init init: {name=mySuggester,lookupImpl=FuzzyLookupFactory,dictionaryImpl=DocumentDictionaryFactory,field=cat,weightField=price,suggestAnalyzerFieldType=string}
   [junit4]   2> 188623 T579 oasss.SolrSuggester.init Dictionary loaded with params: {name=mySuggester,lookupImpl=FuzzyLookupFactory,dictionaryImpl=DocumentDictionaryFactory,field=cat,weightField=price,suggestAnalyzerFieldType=string}
   [junit4]   2> 188623 T579 oashc.QueryElevationComponent.inform Loading QueryElevation
from: C:\Users\JenkinsSlave\workspace\Lucene-Solr-4.x-Windows\solr\example\solr\collection1\conf\elevate.xml
   [junit4]   2> 188638 T579 oash.ReplicationHandler.inform Commits will be reserved for
 10000
   [junit4]   2> 188638 T580 oasc.QuerySenderListener.newSearcher QuerySenderListener sending
requests to Searcher@24591b[collection1] main{StandardDirectoryReader(segments_1:1:nrt)}
   [junit4]   2> ASYNC  NEW_CORE C125 name=collection1 org.apache.solr.core.SolrCore@1fba7a5
   [junit4]   2> 188640 T580 C125 oasc.SolrCore.execute [collection1] webapp=null path=null
params={q=static+firstSearcher+warming+in+solrconfig.xml&distrib=false&event=firstSearcher}
hits=0 status=0 QTime=2 
   [junit4]   2> 188640 T580 oasc.QuerySenderListener.newSearcher QuerySenderListener done.
   [junit4]   2> 188640 T580 oashc.SpellCheckComponent$SpellCheckerListener.newSearcher
Loading spell index for spellchecker: default
   [junit4]   2> 188640 T580 oashc.SpellCheckComponent$SpellCheckerListener.newSearcher
Loading spell index for spellchecker: wordbreak
   [junit4]   2> 188640 T580 oashc.SuggestComponent$SuggesterListener.newSearcher Loading
suggester index for: mySuggester
   [junit4]   2> 188640 T580 oasss.SolrSuggester.reload reload()
   [junit4]   2> 188640 T580 oasss.SolrSuggester.build build()
   [junit4]   2> 188646 T580 oasc.SolrCore.registerSearcher [collection1] Registered new
searcher Searcher@24591b[collection1] main{StandardDirectoryReader(segments_1:1:nrt)}
   [junit4]   2> 188649 T579 oasc.CoreContainer.registerCore registering core: collection1
   [junit4]   2> 188650 T568 oass.SolrDispatchFilter.init user.dir=C:\Users\JenkinsSlave\workspace\Lucene-Solr-4.x-Windows\solr\build\solr-solrj\test\J0
   [junit4]   2> 188650 T568 oass.SolrDispatchFilter.init SolrDispatchFilter.init() done
   [junit4]   2> 188650 T568 oas.SolrJettyTestBase.createJetty Jetty Assigned Port#64554
   [junit4]   2> 188659 T568 oas.SolrTestCaseJ4.setUp ###Starting testQuery
   [junit4]   2> 188743 T568 oas.SolrTestCaseJ4.tearDown ###Ending testQuery
   [junit4]   2> 188751 T568 oas.SolrTestCaseJ4.setUp ###Starting testCompression
   [junit4]   2> 188895 T572 C125 oasc.SolrCore.execute [collection1] webapp=/solr path=/select
params={q=foo&wt=xml} hits=0 status=0 QTime=0 
   [junit4]   2> 188958 T574 C125 oasc.SolrCore.execute [collection1] webapp=/solr path=/select
params={q=foo&wt=javabin&version=2} hits=0 status=0 QTime=0 
   [junit4]   2> 188964 T568 oas.SolrTestCaseJ4.tearDown ###Ending testCompression
   [junit4]   2> 188972 T568 oas.SolrTestCaseJ4.setUp ###Starting testExampleKeystorePath
   [junit4]   2> 188973 T568 oas.SolrTestCaseJ4.tearDown ###Ending testExampleKeystorePath
   [junit4]   2> 188980 T568 oas.SolrTestCaseJ4.setUp ###Starting testUpdate
   [junit4]   2> 189045 T568 oas.SolrTestCaseJ4.tearDown ###Ending testUpdate
   [junit4]   2> 189052 T568 oas.SolrTestCaseJ4.setUp ###Starting testConnectionRefused
   [junit4]   2> 189412 T568 oas.SolrTestCaseJ4.tearDown ###Ending testConnectionRefused
   [junit4]   2> NOTE: reproduce with: ant test  -Dtestcase=BasicHttpSolrServerTest -Dtests.method=testConnectionRefused
-Dtests.seed=248A9812D0C42111 -Dtests.slow=true -Dtests.locale=ar_DZ -Dtests.timezone=Pacific/Nauru
-Dtests.file.encoding=UTF-8
   [junit4] FAILURE 0.47s | BasicHttpSolrServerTest.testConnectionRefused <<<
   [junit4]    > Throwable #1: java.lang.AssertionError
   [junit4]    > 	at __randomizedtesting.SeedInfo.seed([248A9812D0C42111:B233C03074B6E15]:0)
   [junit4]    > 	at org.apache.solr.client.solrj.impl.BasicHttpSolrServerTest.testConnectionRefused(BasicHttpSolrServerTest.java:158)
   [junit4]    > 	at java.lang.Thread.run(Thread.java:744)
   [junit4]   2> 189522 T568 oas.SolrTestCaseJ4.setUp ###Starting testSetParametersExternalClient
   [junit4]   2> 189525 T568 oas.SolrTestCaseJ4.tearDown ###Ending testSetParametersExternalClient
   [junit4]   2> 189531 T568 oas.SolrTestCaseJ4.setUp ###Starting testSolrExceptionCodeNotFromSolr
   [junit4]   2> 189582 T568 oas.SolrTestCaseJ4.tearDown ###Ending testSolrExceptionCodeNotFromSolr
   [junit4]   1> org.apache.solr.client.solrj.impl.HttpSolrServer$RemoteSolrException:
Expected mime type application/octet-stream but got text/html. <html>
   [junit4]   1> <head>
   [junit4]   1> <meta http-equiv="Content-Type" content="text/html;charset=ISO-8859-1"/>
   [junit4]   1> <title>Error 527 527</title>
   [junit4]   1> </head>
   [junit4]   1> <body>
   [junit4]   1> <h2>HTTP ERROR: 527</h2>
   [junit4]   1> <p>Problem accessing /solr/debug/foo/select. Reason:
   [junit4]   1> <pre>    527</pre></p>
   [junit4]   1> <hr /><i><small>Powered by Jetty://</small></i>
   [junit4]   1>                                                 
   [junit4]   1>                                                 
   [junit4]   1>                                                 
   [junit4]   1>                                                 
   [junit4]   1>                                                 
   [junit4]   1>                                                 
   [junit4]   1>                                                 
   [junit4]   1>                                                 
   [junit4]   1>                                                 
   [junit4]   1>                                                 
   [junit4]   1>                                                 
   [junit4]   1>                                                 
   [junit4]   1>                                                 
   [junit4]   1>                                                 
   [junit4]   1>                                                 
   [junit4]   1>                                                 
   [junit4]   1>                                                 
   [junit4]   1>                                                 
   [junit4]   1>                                                 
   [junit4]   1>                                                 
   [junit4]   1> </body>
   [junit4]   1> </html>
   [junit4]   1> 
   [junit4]   2> 189591 T568 oas.SolrTestCaseJ4.setUp ###Starting testGetRawStream
   [junit4]   2> 189642 T577 C125 oasc.SolrCore.execute [collection1] webapp=/solr path=/select
params={} hits=0 status=0 QTime=0 
   [junit4]   2> 189643 T568 oas.SolrTestCaseJ4.tearDown ###Ending testGetRawStream
   [junit4]   2> 189649 T568 oas.SolrTestCaseJ4.setUp ###Starting testDelete
   [junit4]   2> 189697 T568 oas.SolrTestCaseJ4.tearDown ###Ending testDelete
   [junit4]   2> 189702 T568 oas.SolrTestCaseJ4.setUp ###Starting testTimeout
   [junit4]   2> 191172 T568 oas.SolrTestCaseJ4.tearDown ###Ending testTimeout
   [junit4]   2> 191184 T568 oas.SolrTestCaseJ4.setUp ###Starting testRedirect
   [junit4]   2> 191252 T577 C125 oasc.SolrCore.execute [collection1] webapp=/solr path=/select
params={q=*:*&wt=javabin&version=2} hits=0 status=0 QTime=0 
   [junit4]   2> 191255 T568 oas.SolrTestCaseJ4.tearDown ###Ending testRedirect
   [junit4]   2> 191265 T568 oasc.CoreContainer.shutdown Shutting down CoreContainer instance=28966554
   [junit4]   2> 191266 T568 oasc.SolrCore.close [collection1]  CLOSING SolrCore org.apache.solr.core.SolrCore@1fba7a5
   [junit4]   2> 191286 T568 oasu.DirectUpdateHandler2.close closing DirectUpdateHandler2{commits=0,autocommit
maxTime=15000ms,autocommits=0,soft autocommits=0,optimizes=0,rollbacks=0,expungeDeletes=0,docsPending=0,adds=0,deletesById=0,deletesByQuery=0,errors=0,cumulative_adds=0,cumulative_deletesById=0,cumulative_deletesByQuery=0,cumulative_errors=0,transaction_logs_total_size=0,transaction_logs_total_number=0}
   [junit4]   2> 191287 T568 oasu.SolrCoreState.decrefSolrCoreState Closing SolrCoreState
   [junit4]   2> 191287 T568 oasu.DefaultSolrCoreState.closeIndexWriter SolrCoreState ref
count has reached 0 - closing IndexWriter
   [junit4]   2> 191287 T568 oasu.DefaultSolrCoreState.closeIndexWriter closing IndexWriter
with IndexWriterCloser
   [junit4]   2> 191288 T568 C125 oasu.LoggingInfoStream.message [IW][SUITE-BasicHttpSolrServerTest-seed#[248A9812D0C42111]-worker]:
now flush at close waitForMerges=true
   [junit4]   2> 191288 T568 C125 oasu.LoggingInfoStream.message [IW][SUITE-BasicHttpSolrServerTest-seed#[248A9812D0C42111]-worker]:
  start flush: applyAllDeletes=true
   [junit4]   2> 191288 T568 C125 oasu.LoggingInfoStream.message [IW][SUITE-BasicHttpSolrServerTest-seed#[248A9812D0C42111]-worker]:
  index before flush 
   [junit4]   2> 191288 T568 C125 oasu.LoggingInfoStream.message [DW][SUITE-BasicHttpSolrServerTest-seed#[248A9812D0C42111]-worker]:
SUITE-BasicHttpSolrServerTest-seed#[248A9812D0C42111]-worker startFullFlush
   [junit4]   2> 191289 T568 C125 oasu.LoggingInfoStream.message [DW][SUITE-BasicHttpSolrServerTest-seed#[248A9812D0C42111]-worker]:
anyChanges? numDocsInRam=0 deletes=false hasTickets:false pendingChangesInFullFlush: false
   [junit4]   2> 191290 T568 C125 oasu.LoggingInfoStream.message [DW][SUITE-BasicHttpSolrServerTest-seed#[248A9812D0C42111]-worker]:
SUITE-BasicHttpSolrServerTest-seed#[248A9812D0C42111]-worker finishFullFlush success=true
   [junit4]   2> 191290 T568 C125 oasu.LoggingInfoStream.message [IW][SUITE-BasicHttpSolrServerTest-seed#[248A9812D0C42111]-worker]:
apply all deletes during flush
   [junit4]   2> 191290 T568 C125 oasu.LoggingInfoStream.message [BD][SUITE-BasicHttpSolrServerTest-seed#[248A9812D0C42111]-worker]:
prune sis=org.apache.lucene.index.SegmentInfos@179b1aa minGen=9223372036854775807 packetCount=0
   [junit4]   2> 191290 T568 C125 oasu.LoggingInfoStream.message [CMS][SUITE-BasicHttpSolrServerTest-seed#[248A9812D0C42111]-worker]:
now merge
   [junit4]   2> 191290 T568 C125 oasu.LoggingInfoStream.message [CMS][SUITE-BasicHttpSolrServerTest-seed#[248A9812D0C42111]-worker]:
  index: 
   [junit4]   2> 191291 T568 C125 oasu.LoggingInfoStream.message [CMS][SUITE-BasicHttpSolrServerTest-seed#[248A9812D0C42111]-worker]:
  no more merges pending; now return
   [junit4]   2> 191291 T568 C125 oasu.LoggingInfoStream.message [IW][SUITE-BasicHttpSolrServerTest-seed#[248A9812D0C42111]-worker]:
waitForMerges
   [junit4]   2> 191291 T568 C125 oasu.LoggingInfoStream.message [IW][SUITE-BasicHttpSolrServerTest-seed#[248A9812D0C42111]-worker]:
waitForMerges done
   [junit4]   2> 191292 T568 C125 oasu.LoggingInfoStream.message [IW][SUITE-BasicHttpSolrServerTest-seed#[248A9812D0C42111]-worker]:
now call final commit()
   [junit4]   2> 191292 T568 C125 oasu.LoggingInfoStream.message [IW][SUITE-BasicHttpSolrServerTest-seed#[248A9812D0C42111]-worker]:
commit: start
   [junit4]   2> 191292 T568 C125 oasu.LoggingInfoStream.message [IW][SUITE-BasicHttpSolrServerTest-seed#[248A9812D0C42111]-worker]:
commit: enter lock
   [junit4]   2> 191292 T568 C125 oasu.LoggingInfoStream.message [IW][SUITE-BasicHttpSolrServerTest-seed#[248A9812D0C42111]-worker]:
commit: now prepare
   [junit4]   2> 191292 T568 C125 oasu.LoggingInfoStream.message [IW][SUITE-BasicHttpSolrServerTest-seed#[248A9812D0C42111]-worker]:
prepareCommit: flush
   [junit4]   2> 191293 T568 C125 oasu.LoggingInfoStream.message [IW][SUITE-BasicHttpSolrServerTest-seed#[248A9812D0C42111]-worker]:
  index before flush 
   [junit4]   2> 191293 T568 C125 oasu.LoggingInfoStream.message [DW][SUITE-BasicHttpSolrServerTest-seed#[248A9812D0C42111]-worker]:
SUITE-BasicHttpSolrServerTest-seed#[248A9812D0C42111]-worker startFullFlush
   [junit4]   2> 191293 T568 C125 oasu.LoggingInfoStream.message [DW][SUITE-BasicHttpSolrServerTest-seed#[248A9812D0C42111]-worker]:
anyChanges? numDocsInRam=0 deletes=false hasTickets:false pendingChangesInFullFlush: false
   [junit4]   2> 191293 T568 C125 oasu.LoggingInfoStream.message [IW][SUITE-BasicHttpSolrServerTest-seed#[248A9812D0C42111]-worker]:
apply all deletes during flush
   [junit4]   2> 191294 T568 C125 oasu.LoggingInfoStream.message [BD][SUITE-BasicHttpSolrServerTest-seed#[248A9812D0C42111]-worker]:
prune sis=org.apache.lucene.index.SegmentInfos@179b1aa minGen=9223372036854775807 packetCount=0
   [junit4]   2> 191294 T568 C125 oasu.LoggingInfoStream.message [DW][SUITE-BasicHttpSolrServerTest-seed#[248A9812D0C42111]-worker]:
SUITE-BasicHttpSolrServerTest-seed#[248A9812D0C42111]-worker finishFullFlush success=true
   [junit4]   2> 191294 T568 C125 oasu.LoggingInfoStream.message [IW][SUITE-BasicHttpSolrServerTest-seed#[248A9812D0C42111]-worker]:
startCommit(): start
   [junit4]   2> 191295 T568 C125 oasu.LoggingInfoStream.message [IW][SUITE-BasicHttpSolrServerTest-seed#[248A9812D0C42111]-worker]:
  skip startCommit(): no changes pending
   [junit4]   2> 191295 T568 C125 oasu.LoggingInfoStream.message [IW][SUITE-BasicHttpSolrServerTest-seed#[248A9812D0C42111]-worker]:
commit: pendingCommit == null; skip
   [junit4]   2> 191295 T568 C125 oasu.LoggingInfoStream.message [IW][SUITE-BasicHttpSolrServerTest-seed#[248A9812D0C42111]-worker]:
commit: done
   [junit4]   2> 191295 T568 C125 oasu.LoggingInfoStream.message [IW][SUITE-BasicHttpSolrServerTest-seed#[248A9812D0C42111]-worker]:
at close: 
   [junit4]   2> 191298 T568 oasc.SolrCore.closeSearcher [collection1] Closing main searcher
on request.
   [junit4]   2> 191298 T568 oasc.CachingDirectoryFactory.close Closing MockDirectoryFactory
- 2 directories currently being tracked
   [junit4]   2> 191298 T568 oasc.CachingDirectoryFactory.closeCacheValue looking to close
C:\Users\JenkinsSlave\workspace\Lucene-Solr-4.x-Windows\solr\build\solr-solrj\test\J0\solrtest-BasicHttpSolrServerTest-1392640212227\index
[CachedDir<<refCount=0;path=C:\Users\JenkinsSlave\workspace\Lucene-Solr-4.x-Windows\solr\build\solr-solrj\test\J0\solrtest-BasicHttpSolrServerTest-1392640212227\index;done=false>>]
   [junit4]   2> 191298 T568 oasc.CachingDirectoryFactory.close Closing directory: C:\Users\JenkinsSlave\workspace\Lucene-Solr-4.x-Windows\solr\build\solr-solrj\test\J0\solrtest-BasicHttpSolrServerTest-1392640212227\index
   [junit4]   2> 191298 T568 oasc.CachingDirectoryFactory.closeCacheValue looking to close
C:\Users\JenkinsSlave\workspace\Lucene-Solr-4.x-Windows\solr\build\solr-solrj\test\J0\solrtest-BasicHttpSolrServerTest-1392640212227\
[CachedDir<<refCount=0;path=C:\Users\JenkinsSlave\workspace\Lucene-Solr-4.x-Windows\solr\build\solr-solrj\test\J0\solrtest-BasicHttpSolrServerTest-1392640212227\;done=false>>]
   [junit4]   2> 191300 T568 oasc.CachingDirectoryFactory.close Closing directory: C:\Users\JenkinsSlave\workspace\Lucene-Solr-4.x-Windows\solr\build\solr-solrj\test\J0\solrtest-BasicHttpSolrServerTest-1392640212227\
   [junit4]   2> 191300 T568 oejsh.ContextHandler.doStop stopped o.e.j.s.ServletContextHandler{/solr,null}
   [junit4]   2> 191353 T568 oas.SolrTestCaseJ4.deleteCore ###deleteCore
   [junit4]   2> NOTE: test params are: codec=Lucene3x, sim=DefaultSimilarity, locale=ar_DZ,
timezone=Pacific/Nauru
   [junit4]   2> NOTE: Windows 7 6.1 x86/Oracle Corporation 1.8.0 (32-bit)/cpus=2,threads=1,free=46707568,total=220200960
   [junit4]   2> NOTE: All tests run in this JVM: [MultiCoreExampleJettyTest, MultiCoreEmbeddedTest,
IteratorChainTest, TestXMLEscaping, TestSpellCheckResponse, SolrExceptionTest, FieldAnalysisResponseTest,
AnlysisResponseBaseTest, SolrPingTest, SolrParamTest, TestNamedListCodec, DocumentAnalysisResponseTest,
TestBatchUpdate, SolrExampleJettyTest, MergeIndexesEmbeddedTest, TestLBHttpSolrServer, SolrExampleStreamingTest,
LargeVolumeBinaryJettyTest, FacetFieldTest, SolrExampleEmbeddedTest, SolrExampleXMLTest, QueryResponseTest,
CloudSolrServerTest, SolrExampleStreamingBinaryTest, SolrExampleBinaryTest, BasicHttpSolrServerTest]
   [junit4] Completed in 3.27s, 11 tests, 1 failure <<< FAILURES!

[...truncated 69 lines...]
BUILD FAILED
C:\Users\JenkinsSlave\workspace\Lucene-Solr-4.x-Windows\build.xml:459: The following error
occurred while executing this line:
C:\Users\JenkinsSlave\workspace\Lucene-Solr-4.x-Windows\build.xml:439: The following error
occurred while executing this line:
C:\Users\JenkinsSlave\workspace\Lucene-Solr-4.x-Windows\build.xml:39: The following error
occurred while executing this line:
C:\Users\JenkinsSlave\workspace\Lucene-Solr-4.x-Windows\extra-targets.xml:37: The following
error occurred while executing this line:
C:\Users\JenkinsSlave\workspace\Lucene-Solr-4.x-Windows\solr\build.xml:202: The following
error occurred while executing this line:
C:\Users\JenkinsSlave\workspace\Lucene-Solr-4.x-Windows\solr\common-build.xml:491: The following
error occurred while executing this line:
C:\Users\JenkinsSlave\workspace\Lucene-Solr-4.x-Windows\lucene\common-build.xml:1308: The
following error occurred while executing this line:
C:\Users\JenkinsSlave\workspace\Lucene-Solr-4.x-Windows\lucene\common-build.xml:941: There
were test failures: 48 suites, 280 tests, 1 failure

Total time: 74 minutes 0 seconds
Build step 'Invoke Ant' marked build as failure
Description set: Java: 32bit/jdk1.8.0-fcs-b129 -client -XX:+UseParallelGC
Archiving artifacts
Recording test results
Email was triggered for: Failure
Sending email for trigger: Failure



Mime
View raw message