lucene-dev mailing list archives

Site index · List index
Message view « Date » · « Thread »
Top « Date » · « Thread »
From Policeman Jenkins Server <jenk...@thetaphi.de>
Subject [JENKINS] Lucene-Solr-4.x-Linux (32bit/ibm-j9-jdk7) - Build # 9484 - Still Failing!
Date Tue, 25 Feb 2014 13:31:21 GMT
Build: http://jenkins.thetaphi.de/job/Lucene-Solr-4.x-Linux/9484/
Java: 32bit/ibm-j9-jdk7 -Xjit:exclude={org/apache/lucene/util/fst/FST.pack(IIF)Lorg/apache/lucene/util/fst/FST;}

4 tests failed.
REGRESSION:  org.apache.solr.handler.component.DistributedQueryElevationComponentTest.testDistribSearch

Error Message:
.responseHeader.params.rows!=sort (unordered or missing)

Stack Trace:
junit.framework.AssertionFailedError: .responseHeader.params.rows!=sort (unordered or missing)
	at __randomizedtesting.SeedInfo.seed([B474530B20F36F2D:3592DD1357AC0F11]:0)
	at junit.framework.Assert.fail(Assert.java:50)
	at org.apache.solr.BaseDistributedSearchTestCase.compareSolrResponses(BaseDistributedSearchTestCase.java:843)
	at org.apache.solr.BaseDistributedSearchTestCase.compareResponses(BaseDistributedSearchTestCase.java:862)
	at org.apache.solr.BaseDistributedSearchTestCase.query(BaseDistributedSearchTestCase.java:565)
	at org.apache.solr.BaseDistributedSearchTestCase.query(BaseDistributedSearchTestCase.java:545)
	at org.apache.solr.BaseDistributedSearchTestCase.query(BaseDistributedSearchTestCase.java:524)
	at org.apache.solr.handler.component.DistributedQueryElevationComponentTest.doTest(DistributedQueryElevationComponentTest.java:83)
	at org.apache.solr.BaseDistributedSearchTestCase.testDistribSearch(BaseDistributedSearchTestCase.java:870)
	at sun.reflect.NativeMethodAccessorImpl.invoke0(Native Method)
	at sun.reflect.NativeMethodAccessorImpl.invoke(NativeMethodAccessorImpl.java:88)
	at sun.reflect.DelegatingMethodAccessorImpl.invoke(DelegatingMethodAccessorImpl.java:55)
	at java.lang.reflect.Method.invoke(Method.java:613)
	at com.carrotsearch.randomizedtesting.RandomizedRunner.invoke(RandomizedRunner.java:1559)
	at com.carrotsearch.randomizedtesting.RandomizedRunner.access$600(RandomizedRunner.java:79)
	at com.carrotsearch.randomizedtesting.RandomizedRunner$6.evaluate(RandomizedRunner.java:737)
	at com.carrotsearch.randomizedtesting.RandomizedRunner$7.evaluate(RandomizedRunner.java:773)
	at com.carrotsearch.randomizedtesting.RandomizedRunner$8.evaluate(RandomizedRunner.java:787)
	at com.carrotsearch.randomizedtesting.rules.SystemPropertiesRestoreRule$1.evaluate(SystemPropertiesRestoreRule.java:53)
	at org.apache.lucene.util.TestRuleSetupTeardownChained$1.evaluate(TestRuleSetupTeardownChained.java:50)
	at org.apache.lucene.util.TestRuleFieldCacheSanity$1.evaluate(TestRuleFieldCacheSanity.java:51)
	at org.apache.lucene.util.AbstractBeforeAfterRule$1.evaluate(AbstractBeforeAfterRule.java:46)
	at com.carrotsearch.randomizedtesting.rules.SystemPropertiesInvariantRule$1.evaluate(SystemPropertiesInvariantRule.java:55)
	at org.apache.lucene.util.TestRuleThreadAndTestName$1.evaluate(TestRuleThreadAndTestName.java:49)
	at org.apache.lucene.util.TestRuleIgnoreAfterMaxFailures$1.evaluate(TestRuleIgnoreAfterMaxFailures.java:70)
	at org.apache.lucene.util.TestRuleMarkFailure$1.evaluate(TestRuleMarkFailure.java:48)
	at com.carrotsearch.randomizedtesting.rules.StatementAdapter.evaluate(StatementAdapter.java:36)
	at com.carrotsearch.randomizedtesting.ThreadLeakControl$StatementRunner.run(ThreadLeakControl.java:358)
	at com.carrotsearch.randomizedtesting.ThreadLeakControl.forkTimeoutingTask(ThreadLeakControl.java:782)
	at com.carrotsearch.randomizedtesting.ThreadLeakControl$3.evaluate(ThreadLeakControl.java:442)
	at com.carrotsearch.randomizedtesting.RandomizedRunner.runSingleTest(RandomizedRunner.java:746)
	at com.carrotsearch.randomizedtesting.RandomizedRunner$3.evaluate(RandomizedRunner.java:648)
	at com.carrotsearch.randomizedtesting.RandomizedRunner$4.evaluate(RandomizedRunner.java:682)
	at com.carrotsearch.randomizedtesting.RandomizedRunner$5.evaluate(RandomizedRunner.java:693)
	at com.carrotsearch.randomizedtesting.rules.StatementAdapter.evaluate(StatementAdapter.java:36)
	at com.carrotsearch.randomizedtesting.rules.SystemPropertiesRestoreRule$1.evaluate(SystemPropertiesRestoreRule.java:53)
	at org.apache.lucene.util.AbstractBeforeAfterRule$1.evaluate(AbstractBeforeAfterRule.java:46)
	at org.apache.lucene.util.TestRuleStoreClassName$1.evaluate(TestRuleStoreClassName.java:42)
	at com.carrotsearch.randomizedtesting.rules.SystemPropertiesInvariantRule$1.evaluate(SystemPropertiesInvariantRule.java:55)
	at com.carrotsearch.randomizedtesting.rules.NoShadowingOrOverridesOnMethodsRule$1.evaluate(NoShadowingOrOverridesOnMethodsRule.java:39)
	at com.carrotsearch.randomizedtesting.rules.NoShadowingOrOverridesOnMethodsRule$1.evaluate(NoShadowingOrOverridesOnMethodsRule.java:39)
	at com.carrotsearch.randomizedtesting.rules.StatementAdapter.evaluate(StatementAdapter.java:36)
	at org.apache.lucene.util.TestRuleAssertionsRequired$1.evaluate(TestRuleAssertionsRequired.java:43)
	at org.apache.lucene.util.TestRuleMarkFailure$1.evaluate(TestRuleMarkFailure.java:48)
	at org.apache.lucene.util.TestRuleIgnoreAfterMaxFailures$1.evaluate(TestRuleIgnoreAfterMaxFailures.java:70)
	at org.apache.lucene.util.TestRuleIgnoreTestSuites$1.evaluate(TestRuleIgnoreTestSuites.java:55)
	at com.carrotsearch.randomizedtesting.rules.StatementAdapter.evaluate(StatementAdapter.java:36)
	at com.carrotsearch.randomizedtesting.ThreadLeakControl$StatementRunner.run(ThreadLeakControl.java:358)
	at java.lang.Thread.run(Thread.java:780)


REGRESSION:  org.apache.solr.handler.component.TermVectorComponentDistributedTest.testDistribSearch

Error Message:
.termVectors.0.test_basictv!=test_offtv (unordered or missing)

Stack Trace:
junit.framework.AssertionFailedError: .termVectors.0.test_basictv!=test_offtv (unordered or missing)
	at __randomizedtesting.SeedInfo.seed([B474530B20F36F2D:3592DD1357AC0F11]:0)
	at junit.framework.Assert.fail(Assert.java:50)
	at org.apache.solr.BaseDistributedSearchTestCase.compareSolrResponses(BaseDistributedSearchTestCase.java:843)
	at org.apache.solr.BaseDistributedSearchTestCase.compareResponses(BaseDistributedSearchTestCase.java:862)
	at org.apache.solr.BaseDistributedSearchTestCase.query(BaseDistributedSearchTestCase.java:565)
	at org.apache.solr.BaseDistributedSearchTestCase.query(BaseDistributedSearchTestCase.java:545)
	at org.apache.solr.BaseDistributedSearchTestCase.query(BaseDistributedSearchTestCase.java:524)
	at org.apache.solr.handler.component.TermVectorComponentDistributedTest.doTest(TermVectorComponentDistributedTest.java:127)
	at org.apache.solr.BaseDistributedSearchTestCase.testDistribSearch(BaseDistributedSearchTestCase.java:876)
	at sun.reflect.NativeMethodAccessorImpl.invoke0(Native Method)
	at sun.reflect.NativeMethodAccessorImpl.invoke(NativeMethodAccessorImpl.java:88)
	at sun.reflect.DelegatingMethodAccessorImpl.invoke(DelegatingMethodAccessorImpl.java:55)
	at java.lang.reflect.Method.invoke(Method.java:613)
	at com.carrotsearch.randomizedtesting.RandomizedRunner.invoke(RandomizedRunner.java:1559)
	at com.carrotsearch.randomizedtesting.RandomizedRunner.access$600(RandomizedRunner.java:79)
	at com.carrotsearch.randomizedtesting.RandomizedRunner$6.evaluate(RandomizedRunner.java:737)
	at com.carrotsearch.randomizedtesting.RandomizedRunner$7.evaluate(RandomizedRunner.java:773)
	at com.carrotsearch.randomizedtesting.RandomizedRunner$8.evaluate(RandomizedRunner.java:787)
	at com.carrotsearch.randomizedtesting.rules.SystemPropertiesRestoreRule$1.evaluate(SystemPropertiesRestoreRule.java:53)
	at org.apache.lucene.util.TestRuleSetupTeardownChained$1.evaluate(TestRuleSetupTeardownChained.java:50)
	at org.apache.lucene.util.TestRuleFieldCacheSanity$1.evaluate(TestRuleFieldCacheSanity.java:51)
	at org.apache.lucene.util.AbstractBeforeAfterRule$1.evaluate(AbstractBeforeAfterRule.java:46)
	at com.carrotsearch.randomizedtesting.rules.SystemPropertiesInvariantRule$1.evaluate(SystemPropertiesInvariantRule.java:55)
	at org.apache.lucene.util.TestRuleThreadAndTestName$1.evaluate(TestRuleThreadAndTestName.java:49)
	at org.apache.lucene.util.TestRuleIgnoreAfterMaxFailures$1.evaluate(TestRuleIgnoreAfterMaxFailures.java:70)
	at org.apache.lucene.util.TestRuleMarkFailure$1.evaluate(TestRuleMarkFailure.java:48)
	at com.carrotsearch.randomizedtesting.rules.StatementAdapter.evaluate(StatementAdapter.java:36)
	at com.carrotsearch.randomizedtesting.ThreadLeakControl$StatementRunner.run(ThreadLeakControl.java:358)
	at com.carrotsearch.randomizedtesting.ThreadLeakControl.forkTimeoutingTask(ThreadLeakControl.java:782)
	at com.carrotsearch.randomizedtesting.ThreadLeakControl$3.evaluate(ThreadLeakControl.java:442)
	at com.carrotsearch.randomizedtesting.RandomizedRunner.runSingleTest(RandomizedRunner.java:746)
	at com.carrotsearch.randomizedtesting.RandomizedRunner$3.evaluate(RandomizedRunner.java:648)
	at com.carrotsearch.randomizedtesting.RandomizedRunner$4.evaluate(RandomizedRunner.java:682)
	at com.carrotsearch.randomizedtesting.RandomizedRunner$5.evaluate(RandomizedRunner.java:693)
	at com.carrotsearch.randomizedtesting.rules.StatementAdapter.evaluate(StatementAdapter.java:36)
	at com.carrotsearch.randomizedtesting.rules.SystemPropertiesRestoreRule$1.evaluate(SystemPropertiesRestoreRule.java:53)
	at org.apache.lucene.util.AbstractBeforeAfterRule$1.evaluate(AbstractBeforeAfterRule.java:46)
	at org.apache.lucene.util.TestRuleStoreClassName$1.evaluate(TestRuleStoreClassName.java:42)
	at com.carrotsearch.randomizedtesting.rules.SystemPropertiesInvariantRule$1.evaluate(SystemPropertiesInvariantRule.java:55)
	at com.carrotsearch.randomizedtesting.rules.NoShadowingOrOverridesOnMethodsRule$1.evaluate(NoShadowingOrOverridesOnMethodsRule.java:39)
	at com.carrotsearch.randomizedtesting.rules.NoShadowingOrOverridesOnMethodsRule$1.evaluate(NoShadowingOrOverridesOnMethodsRule.java:39)
	at com.carrotsearch.randomizedtesting.rules.StatementAdapter.evaluate(StatementAdapter.java:36)
	at org.apache.lucene.util.TestRuleAssertionsRequired$1.evaluate(TestRuleAssertionsRequired.java:43)
	at org.apache.lucene.util.TestRuleMarkFailure$1.evaluate(TestRuleMarkFailure.java:48)
	at org.apache.lucene.util.TestRuleIgnoreAfterMaxFailures$1.evaluate(TestRuleIgnoreAfterMaxFailures.java:70)
	at org.apache.lucene.util.TestRuleIgnoreTestSuites$1.evaluate(TestRuleIgnoreTestSuites.java:55)
	at com.carrotsearch.randomizedtesting.rules.StatementAdapter.evaluate(StatementAdapter.java:36)
	at com.carrotsearch.randomizedtesting.ThreadLeakControl$StatementRunner.run(ThreadLeakControl.java:358)
	at java.lang.Thread.run(Thread.java:780)


REGRESSION:  org.apache.solr.update.processor.SignatureUpdateProcessorFactoryTest.testDupeDetection

Error Message:
expected:<1> but was:<3>

Stack Trace:
java.lang.AssertionError: expected:<1> but was:<3>
	at __randomizedtesting.SeedInfo.seed([B474530B20F36F2D:EF44A8C323B4CC51]:0)
	at org.junit.Assert.fail(Assert.java:93)
	at org.junit.Assert.failNotEquals(Assert.java:647)
	at org.junit.Assert.assertEquals(Assert.java:128)
	at org.junit.Assert.assertEquals(Assert.java:472)
	at org.junit.Assert.assertEquals(Assert.java:456)
	at org.apache.solr.update.processor.SignatureUpdateProcessorFactoryTest.checkNumDocs(SignatureUpdateProcessorFactoryTest.java:71)
	at org.apache.solr.update.processor.SignatureUpdateProcessorFactoryTest.testDupeDetection(SignatureUpdateProcessorFactoryTest.java:119)
	at sun.reflect.NativeMethodAccessorImpl.invoke0(Native Method)
	at sun.reflect.NativeMethodAccessorImpl.invoke(NativeMethodAccessorImpl.java:88)
	at sun.reflect.DelegatingMethodAccessorImpl.invoke(DelegatingMethodAccessorImpl.java:55)
	at java.lang.reflect.Method.invoke(Method.java:613)
	at com.carrotsearch.randomizedtesting.RandomizedRunner.invoke(RandomizedRunner.java:1559)
	at com.carrotsearch.randomizedtesting.RandomizedRunner.access$600(RandomizedRunner.java:79)
	at com.carrotsearch.randomizedtesting.RandomizedRunner$6.evaluate(RandomizedRunner.java:737)
	at com.carrotsearch.randomizedtesting.RandomizedRunner$7.evaluate(RandomizedRunner.java:773)
	at com.carrotsearch.randomizedtesting.RandomizedRunner$8.evaluate(RandomizedRunner.java:787)
	at com.carrotsearch.randomizedtesting.rules.SystemPropertiesRestoreRule$1.evaluate(SystemPropertiesRestoreRule.java:53)
	at org.apache.lucene.util.TestRuleSetupTeardownChained$1.evaluate(TestRuleSetupTeardownChained.java:50)
	at org.apache.lucene.util.TestRuleFieldCacheSanity$1.evaluate(TestRuleFieldCacheSanity.java:51)
	at org.apache.lucene.util.AbstractBeforeAfterRule$1.evaluate(AbstractBeforeAfterRule.java:46)
	at com.carrotsearch.randomizedtesting.rules.SystemPropertiesInvariantRule$1.evaluate(SystemPropertiesInvariantRule.java:55)
	at org.apache.lucene.util.TestRuleThreadAndTestName$1.evaluate(TestRuleThreadAndTestName.java:49)
	at org.apache.lucene.util.TestRuleIgnoreAfterMaxFailures$1.evaluate(TestRuleIgnoreAfterMaxFailures.java:70)
	at org.apache.lucene.util.TestRuleMarkFailure$1.evaluate(TestRuleMarkFailure.java:48)
	at com.carrotsearch.randomizedtesting.rules.StatementAdapter.evaluate(StatementAdapter.java:36)
	at com.carrotsearch.randomizedtesting.ThreadLeakControl$StatementRunner.run(ThreadLeakControl.java:358)
	at com.carrotsearch.randomizedtesting.ThreadLeakControl.forkTimeoutingTask(ThreadLeakControl.java:782)
	at com.carrotsearch.randomizedtesting.ThreadLeakControl$3.evaluate(ThreadLeakControl.java:442)
	at com.carrotsearch.randomizedtesting.RandomizedRunner.runSingleTest(RandomizedRunner.java:746)
	at com.carrotsearch.randomizedtesting.RandomizedRunner$3.evaluate(RandomizedRunner.java:648)
	at com.carrotsearch.randomizedtesting.RandomizedRunner$4.evaluate(RandomizedRunner.java:682)
	at com.carrotsearch.randomizedtesting.RandomizedRunner$5.evaluate(RandomizedRunner.java:693)
	at com.carrotsearch.randomizedtesting.rules.StatementAdapter.evaluate(StatementAdapter.java:36)
	at com.carrotsearch.randomizedtesting.rules.SystemPropertiesRestoreRule$1.evaluate(SystemPropertiesRestoreRule.java:53)
	at org.apache.lucene.util.AbstractBeforeAfterRule$1.evaluate(AbstractBeforeAfterRule.java:46)
	at org.apache.lucene.util.TestRuleStoreClassName$1.evaluate(TestRuleStoreClassName.java:42)
	at com.carrotsearch.randomizedtesting.rules.SystemPropertiesInvariantRule$1.evaluate(SystemPropertiesInvariantRule.java:55)
	at com.carrotsearch.randomizedtesting.rules.NoShadowingOrOverridesOnMethodsRule$1.evaluate(NoShadowingOrOverridesOnMethodsRule.java:39)
	at com.carrotsearch.randomizedtesting.rules.NoShadowingOrOverridesOnMethodsRule$1.evaluate(NoShadowingOrOverridesOnMethodsRule.java:39)
	at com.carrotsearch.randomizedtesting.rules.StatementAdapter.evaluate(StatementAdapter.java:36)
	at org.apache.lucene.util.TestRuleAssertionsRequired$1.evaluate(TestRuleAssertionsRequired.java:43)
	at org.apache.lucene.util.TestRuleMarkFailure$1.evaluate(TestRuleMarkFailure.java:48)
	at org.apache.lucene.util.TestRuleIgnoreAfterMaxFailures$1.evaluate(TestRuleIgnoreAfterMaxFailures.java:70)
	at org.apache.lucene.util.TestRuleIgnoreTestSuites$1.evaluate(TestRuleIgnoreTestSuites.java:55)
	at com.carrotsearch.randomizedtesting.rules.StatementAdapter.evaluate(StatementAdapter.java:36)
	at com.carrotsearch.randomizedtesting.ThreadLeakControl$StatementRunner.run(ThreadLeakControl.java:358)
	at java.lang.Thread.run(Thread.java:780)


REGRESSION:  org.apache.solr.update.processor.SignatureUpdateProcessorFactoryTest.testMultiThreaded

Error Message:
expected:<1> but was:<3>

Stack Trace:
java.lang.AssertionError: expected:<1> but was:<3>
	at __randomizedtesting.SeedInfo.seed([B474530B20F36F2D:D5E189EBC82265DB]:0)
	at org.junit.Assert.fail(Assert.java:93)
	at org.junit.Assert.failNotEquals(Assert.java:647)
	at org.junit.Assert.assertEquals(Assert.java:128)
	at org.junit.Assert.assertEquals(Assert.java:472)
	at org.junit.Assert.assertEquals(Assert.java:456)
	at org.apache.solr.update.processor.SignatureUpdateProcessorFactoryTest.checkNumDocs(SignatureUpdateProcessorFactoryTest.java:71)
	at org.apache.solr.update.processor.SignatureUpdateProcessorFactoryTest.testMultiThreaded(SignatureUpdateProcessorFactoryTest.java:222)
	at sun.reflect.NativeMethodAccessorImpl.invoke0(Native Method)
	at sun.reflect.NativeMethodAccessorImpl.invoke(NativeMethodAccessorImpl.java:88)
	at sun.reflect.DelegatingMethodAccessorImpl.invoke(DelegatingMethodAccessorImpl.java:55)
	at java.lang.reflect.Method.invoke(Method.java:613)
	at com.carrotsearch.randomizedtesting.RandomizedRunner.invoke(RandomizedRunner.java:1559)
	at com.carrotsearch.randomizedtesting.RandomizedRunner.access$600(RandomizedRunner.java:79)
	at com.carrotsearch.randomizedtesting.RandomizedRunner$6.evaluate(RandomizedRunner.java:737)
	at com.carrotsearch.randomizedtesting.RandomizedRunner$7.evaluate(RandomizedRunner.java:773)
	at com.carrotsearch.randomizedtesting.RandomizedRunner$8.evaluate(RandomizedRunner.java:787)
	at com.carrotsearch.randomizedtesting.rules.SystemPropertiesRestoreRule$1.evaluate(SystemPropertiesRestoreRule.java:53)
	at org.apache.lucene.util.TestRuleSetupTeardownChained$1.evaluate(TestRuleSetupTeardownChained.java:50)
	at org.apache.lucene.util.TestRuleFieldCacheSanity$1.evaluate(TestRuleFieldCacheSanity.java:51)
	at org.apache.lucene.util.AbstractBeforeAfterRule$1.evaluate(AbstractBeforeAfterRule.java:46)
	at com.carrotsearch.randomizedtesting.rules.SystemPropertiesInvariantRule$1.evaluate(SystemPropertiesInvariantRule.java:55)
	at org.apache.lucene.util.TestRuleThreadAndTestName$1.evaluate(TestRuleThreadAndTestName.java:49)
	at org.apache.lucene.util.TestRuleIgnoreAfterMaxFailures$1.evaluate(TestRuleIgnoreAfterMaxFailures.java:70)
	at org.apache.lucene.util.TestRuleMarkFailure$1.evaluate(TestRuleMarkFailure.java:48)
	at com.carrotsearch.randomizedtesting.rules.StatementAdapter.evaluate(StatementAdapter.java:36)
	at com.carrotsearch.randomizedtesting.ThreadLeakControl$StatementRunner.run(ThreadLeakControl.java:358)
	at com.carrotsearch.randomizedtesting.ThreadLeakControl.forkTimeoutingTask(ThreadLeakControl.java:782)
	at com.carrotsearch.randomizedtesting.ThreadLeakControl$3.evaluate(ThreadLeakControl.java:442)
	at com.carrotsearch.randomizedtesting.RandomizedRunner.runSingleTest(RandomizedRunner.java:746)
	at com.carrotsearch.randomizedtesting.RandomizedRunner$3.evaluate(RandomizedRunner.java:648)
	at com.carrotsearch.randomizedtesting.RandomizedRunner$4.evaluate(RandomizedRunner.java:682)
	at com.carrotsearch.randomizedtesting.RandomizedRunner$5.evaluate(RandomizedRunner.java:693)
	at com.carrotsearch.randomizedtesting.rules.StatementAdapter.evaluate(StatementAdapter.java:36)
	at com.carrotsearch.randomizedtesting.rules.SystemPropertiesRestoreRule$1.evaluate(SystemPropertiesRestoreRule.java:53)
	at org.apache.lucene.util.AbstractBeforeAfterRule$1.evaluate(AbstractBeforeAfterRule.java:46)
	at org.apache.lucene.util.TestRuleStoreClassName$1.evaluate(TestRuleStoreClassName.java:42)
	at com.carrotsearch.randomizedtesting.rules.SystemPropertiesInvariantRule$1.evaluate(SystemPropertiesInvariantRule.java:55)
	at com.carrotsearch.randomizedtesting.rules.NoShadowingOrOverridesOnMethodsRule$1.evaluate(NoShadowingOrOverridesOnMethodsRule.java:39)
	at com.carrotsearch.randomizedtesting.rules.NoShadowingOrOverridesOnMethodsRule$1.evaluate(NoShadowingOrOverridesOnMethodsRule.java:39)
	at com.carrotsearch.randomizedtesting.rules.StatementAdapter.evaluate(StatementAdapter.java:36)
	at org.apache.lucene.util.TestRuleAssertionsRequired$1.evaluate(TestRuleAssertionsRequired.java:43)
	at org.apache.lucene.util.TestRuleMarkFailure$1.evaluate(TestRuleMarkFailure.java:48)
	at org.apache.lucene.util.TestRuleIgnoreAfterMaxFailures$1.evaluate(TestRuleIgnoreAfterMaxFailures.java:70)
	at org.apache.lucene.util.TestRuleIgnoreTestSuites$1.evaluate(TestRuleIgnoreTestSuites.java:55)
	at com.carrotsearch.randomizedtesting.rules.StatementAdapter.evaluate(StatementAdapter.java:36)
	at com.carrotsearch.randomizedtesting.ThreadLeakControl$StatementRunner.run(ThreadLeakControl.java:358)
	at java.lang.Thread.run(Thread.java:780)




Build Log:
[...truncated 10445 lines...]
   [junit4] Suite: org.apache.solr.handler.component.DistributedQueryElevationComponentTest
   [junit4]   2> 665329 T2420 oas.SolrTestCaseJ4.buildSSLConfig Randomized ssl (false) and clientAuth (false)
   [junit4]   2> 665329 T2420 oas.BaseDistributedSearchTestCase.initHostContext Setting hostContext system property: /
   [junit4]   2> 665335 T2420 oas.SolrTestCaseJ4.setUp ###Starting testDistribSearch
   [junit4]   2> 665339 T2420 oejs.Server.doStart jetty-8.1.10.v20130312
   [junit4]   2> 665347 T2420 oejs.AbstractConnector.doStart Started SelectChannelConnector@127.0.0.1:?????
   [junit4]   2> 665348 T2420 oass.SolrDispatchFilter.init SolrDispatchFilter.init()
   [junit4]   2> 665348 T2420 oasc.SolrResourceLoader.locateSolrHome JNDI not configured for solr (NoInitialContextEx)
   [junit4]   2> 665349 T2420 oasc.SolrResourceLoader.locateSolrHome using system property solr.solr.home: /mnt/ssd/jenkins/workspace/Lucene-Solr-4.x-Linux/solr/core/src/test-files/solr
   [junit4]   2> 665349 T2420 oasc.SolrResourceLoader.<init> new SolrResourceLoader for directory: '/mnt/ssd/jenkins/workspace/Lucene-Solr-4.x-Linux/solr/core/src/test-files/solr/'
   [junit4]   2> 665360 T2420 oasc.ConfigSolr.fromFile Loading container configuration from /mnt/ssd/jenkins/workspace/Lucene-Solr-4.x-Linux/solr/core/src/test-files/solr/solr.xml
   [junit4]   2> 665413 T2420 oasc.CoreContainer.<init> New CoreContainer 163899766
   [junit4]   2> 665414 T2420 oasc.CoreContainer.load Loading cores into CoreContainer [instanceDir=/mnt/ssd/jenkins/workspace/Lucene-Solr-4.x-Linux/solr/core/src/test-files/solr/]
   [junit4]   2> 665415 T2420 oashc.HttpShardHandlerFactory.getParameter Setting socketTimeout to: 90000
   [junit4]   2> 665415 T2420 oashc.HttpShardHandlerFactory.getParameter Setting urlScheme to: 
   [junit4]   2> 665416 T2420 oashc.HttpShardHandlerFactory.getParameter Setting connTimeout to: 15000
   [junit4]   2> 665417 T2420 oashc.HttpShardHandlerFactory.getParameter Setting maxConnectionsPerHost to: 20
   [junit4]   2> 665417 T2420 oashc.HttpShardHandlerFactory.getParameter Setting corePoolSize to: 0
   [junit4]   2> 665418 T2420 oashc.HttpShardHandlerFactory.getParameter Setting maximumPoolSize to: 2147483647
   [junit4]   2> 665418 T2420 oashc.HttpShardHandlerFactory.getParameter Setting maxThreadIdleTime to: 5
   [junit4]   2> 665419 T2420 oashc.HttpShardHandlerFactory.getParameter Setting sizeOfQueue to: -1
   [junit4]   2> 665419 T2420 oashc.HttpShardHandlerFactory.getParameter Setting fairnessPolicy to: false
   [junit4]   2> 665423 T2420 oasl.LogWatcher.createWatcher SLF4J impl is org.slf4j.impl.Log4jLoggerFactory
   [junit4]   2> 665423 T2420 oasl.LogWatcher.newRegisteredLogWatcher Registering Log Listener [Log4j (org.slf4j.impl.Log4jLoggerFactory)]
   [junit4]   2> 665424 T2420 oasc.CoreContainer.load Host Name: 127.0.0.1
   [junit4]   2> 665427 T2430 oasc.CoreContainer.create Creating SolrCore 'collection1' using instanceDir: /mnt/ssd/jenkins/workspace/Lucene-Solr-4.x-Linux/solr/core/src/test-files/solr/collection1
   [junit4]   2> 665428 T2430 oasc.SolrResourceLoader.<init> new SolrResourceLoader for directory: '/mnt/ssd/jenkins/workspace/Lucene-Solr-4.x-Linux/solr/core/src/test-files/solr/collection1/'
   [junit4]   2> 665428 T2430 oasc.SolrResourceLoader.replaceClassLoader Adding 'file:/mnt/ssd/jenkins/workspace/Lucene-Solr-4.x-Linux/solr/core/src/test-files/solr/collection1/lib/.svn/' to classloader
   [junit4]   2> 665429 T2430 oasc.SolrResourceLoader.replaceClassLoader Adding 'file:/mnt/ssd/jenkins/workspace/Lucene-Solr-4.x-Linux/solr/core/src/test-files/solr/collection1/lib/classes/' to classloader
   [junit4]   2> 665429 T2430 oasc.SolrResourceLoader.replaceClassLoader Adding 'file:/mnt/ssd/jenkins/workspace/Lucene-Solr-4.x-Linux/solr/core/src/test-files/solr/collection1/lib/README' to classloader
   [junit4]   2> 665459 T2430 oasc.SolrConfig.<init> Using Lucene MatchVersion: LUCENE_48
   [junit4]   2> 665499 T2430 oasc.SolrConfig.<init> Loaded SolrConfig: solrconfig-elevate.xml
   [junit4]   2> 665500 T2430 oass.IndexSchema.readSchema Reading Solr Schema from schema11.xml
   [junit4]   2> 665504 T2430 oass.IndexSchema.readSchema [collection1] Schema name=example
   [junit4]   2> 665630 T2430 oass.IndexSchema.readSchema default search field in schema is text
   [junit4]   2> 665632 T2430 oass.IndexSchema.readSchema unique key field: id
   [junit4]   2> 665636 T2430 oasc.SolrCore.initDirectoryFactory org.apache.solr.core.MockDirectoryFactory
   [junit4]   2> 665636 T2430 oasc.SolrCore.<init> [collection1] Opening new SolrCore at /mnt/ssd/jenkins/workspace/Lucene-Solr-4.x-Linux/solr/core/src/test-files/solr/collection1/, dataDir=./org.apache.solr.handler.component.DistributedQueryElevationComponentTest-1393333900181/control/data/
   [junit4]   2> 665637 T2430 oasc.JmxMonitoredMap.<init> JMX monitoring is enabled. Adding Solr mbeans to JMX Server: com.sun.jmx.mbeanserver.JmxMBeanServer@bf1810d7
   [junit4]   2> 665638 T2430 oasc.CachingDirectoryFactory.get return new directory for ./org.apache.solr.handler.component.DistributedQueryElevationComponentTest-1393333900181/control/data
   [junit4]   2> 665638 T2430 oasc.SolrCore.getNewIndexDir New index directory detected: old=null new=./org.apache.solr.handler.component.DistributedQueryElevationComponentTest-1393333900181/control/data/index/
   [junit4]   2> 665638 T2430 oasc.SolrCore.initIndex WARN [collection1] Solr index directory './org.apache.solr.handler.component.DistributedQueryElevationComponentTest-1393333900181/control/data/index' doesn't exist. Creating new index...
   [junit4]   2> 665639 T2430 oasc.CachingDirectoryFactory.get return new directory for ./org.apache.solr.handler.component.DistributedQueryElevationComponentTest-1393333900181/control/data/index
   [junit4]   2> 665639 T2430 oasu.RandomMergePolicy.<init> RandomMergePolicy wrapping class org.apache.lucene.index.LogDocMergePolicy: [LogDocMergePolicy: minMergeSize=1000, mergeFactor=39, maxMergeSize=9223372036854775807, maxMergeSizeForForcedMerge=9223372036854775807, calibrateSizeByDeletes=false, maxMergeDocs=2147483647, maxCFSSegmentSizeMB=8.796093022207999E12, noCFSRatio=1.0]
   [junit4]   2> 665640 T2430 oasc.SolrDeletionPolicy.onCommit SolrDeletionPolicy.onCommit: commits: num=1
   [junit4]   2> 		commit{dir=MockDirectoryWrapper(RAMDirectory@1b768ad4 lockFactory=org.apache.lucene.store.SingleInstanceLockFactory@c409e279),segFN=segments_1,generation=1}
   [junit4]   2> 665641 T2430 oasc.SolrDeletionPolicy.updateCommits newest commit generation = 1
   [junit4]   2> 665643 T2430 oasc.SolrCore.loadUpdateProcessorChains no updateRequestProcessorChain defined as default, creating implicit default
   [junit4]   2> 665644 T2430 oasc.RequestHandlers.initHandlersFromConfig created /update: solr.UpdateRequestHandler
   [junit4]   2> 665644 T2430 oasc.RequestHandlers.initHandlersFromConfig created /elevate: org.apache.solr.handler.component.SearchHandler
   [junit4]   2> 665645 T2430 oasc.RequestHandlers.initHandlersFromConfig created /dataElevate: org.apache.solr.handler.component.SearchHandler
   [junit4]   2> 665646 T2430 oashl.XMLLoader.init xsltCacheLifetimeSeconds=60
   [junit4]   2> 665646 T2430 oasc.RequestHandlers.initHandlersFromConfig WARN no default request handler is registered (either '/select' or 'standard')
   [junit4]   2> 665647 T2430 oasc.SolrCore.initDeprecatedSupport WARN solrconfig.xml uses deprecated <admin/gettableFiles>, Please update your config to use the ShowFileRequestHandler.
   [junit4]   2> 665649 T2430 oasc.SolrCore.initDeprecatedSupport WARN adding ShowFileRequestHandler with hidden files: [KEEP-1.TXT, BAD-SCHEMA-UNIQUEKEY-IS-COPYFIELD-DEST.XML, SOLRCONFIG-QUERYSENDER.XML, BAD-SOLRCONFIG-SCHEMA-MUTABLE-BUT-NOT-MANAGED.XML, SCHEMA-BINARYFIELD.XML, BAD-SCHEMA-CURRENCY-FT-MULTIVALUED.XML, BAD-SCHEMA-OMIT-TF-BUT-NOT-POS.XML, SCHEMA-SIM.XML, SCHEMA15.XML, HYPHENATION.DTD, SOLRCONFIG-DEFAULTS.XML, SOLRCONFIG-POSTINGSHIGHLIGHT.XML, SOLRCONFIG-IMPLICITPROPERTIES.XML, KEEP-2.TXT, SOLRCONFIG-COMPONENTS-NAME.XML, SOLRCONFIG-LAZYWRITER.XML, BAD-SCHEMA-CURRENCY-MULTIVALUED.XML, SCHEMA-EFF.XML, SCHEMA-COLLATEFILTER.XML, SOLRCONFIG-DELPOLICY1.XML, SCHEMA-SNIPPET-TYPE.XML, SOLRCONFIG.SNIPPET.RANDOMINDEXCONFIG.XML, FREETEXTSUGGEST.TXT, SCHEMA-REVERSED.XML, SOLRCONFIG-MASTER.XML, SOLRCONFIG-LOGMERGEPOLICY.XML, SOLRCONFIG-MASTER1.XML, SCHEMA-SPATIAL.XML, SOLRCONFIG-RESPONSE-LOG-COMPONENT.XML, STOPTYPES-2.TXT, BAD-SCHEMA-CURRENCY-FT-BOGUS-DEFAULT-CODE.XML, BAD-SCHEMA-MISPLACED-ASTERISK-COPYFIELD-DEST-SHOULD-FAIL-TEST.XML, SOLRCONFIG-TERMINDEX.XML, BAD-SOLRCONFIG-UNEXPECTED-SCHEMA-ATTRIBUTE.XML, BAD-SCHEMA-CURRENCY-DYNAMIC-MULTIVALUED.XML, BAD-SCHEMA-SIM-GLOBAL-VS-FT-MISMATCH.XML, SOLRCONFIG-UPDATE-PROCESSOR-CHAINS.XML, SCHEMA-DOCVALUESFACETING.XML, SOLRCONFIG-TRANSFORMERS.XML, SCHEMA-BM25.XML, HUNSPELL-TEST.DIC, SCHEMA-CHARFILTERS.XML, SOLRCONFIG-DEEPPAGING.XML, SCHEMA-ID-AND-VERSION-FIELDS-ONLY.XML, SOLRCONFIG-MASTER2.XML, MISSING.FUNCTIONS.UPDATEPROCESSOR.JS, SCHEMA-ENUMS.XML, BAD-MP-SOLRCONFIG.XML, SOLRCONFIG-SOLCOREPROPERTIES.XML, BAD-SCHEMA-EXTERNAL-FILEFIELD.XML, BAD-SCHEMA-CURRENCY-FT-OER-NORATES.XML, SOLRCONFIG-COLLAPSEQPARSER.XML, BAD-SCHEMA-ANALYZER-CLASS-AND-NESTED.XML, SCHEMA-TRIE.XML, SCHEMA-XINCLUDE.XML, SCHEMA-POSTINGSHIGHLIGHT.XML, SOLRCONFIG-QUERY-PARSER-INIT.XML, SCHEMA-SPELLCHECKER.XML, BAD-SOLRCONFIG-INVALID-SCRIPTFILE.XML, SOLRCONFIG-SLAVE1.XML, BAD_SOLRCONFIG.XML, BAD-SCHEMA-DYNAMICFIELD-REQUIRED.XML, THROW.ERROR.ON.ADD.UPDATEPROCESSOR.JS, BAD-SOLRCONFIG-MISSING-SCRIPTFILE.XML, SOLRCONFIG-REQHANDLER.INCL, BAD-SCHEMA-SWEETSPOT-BOTH-TF.XML, JASUGGEST.TXT, STOPWORDSWRONGENCODING.TXT, OPEN-EXCHANGE-RATES.JSON, STEMDICT.TXT, BAD-SCHEMA-NON-GLOB-COPYFIELD-SOURCE-MATCHING-NOTHING-SHOULD-FAIL-TEST.XML, SCHEMA-CUSTOMFIELD.XML, SCHEMA-REST.XML, CONDITIONAL.UPDATEPROCESSOR.JS, ENUMSCONFIG.XML, TRIVIAL.UPDATEPROCESSOR1.JS, MISSLEADING.EXTENSION.UPDATEPROCESSOR.JS.TXT, BAD-SCHEMA-BOGUS-FIELD-PARAMETERS.XML, SOLRCONFIG-ALTDIRECTORY.XML, SOLRCONFIG-MASTER1-KEEPONEBACKUP.XML, SOLRCONFIG-PARSING-UPDATE-PROCESSOR-CHAINS.XML, BAD-SCHEMA-MULTIPLE-ASTERISK-COPYFIELD-DEST-SHOULD-FAIL-TEST.XML, BAD-SCHEMA-MULTIPLE-ASTERISK-COPYFIELD-SOURCE-SHOULD-FAIL-TEST.XML, SOLRCONFIG-SOLR-749.XML, BAD-SOLRCONFIG-WARMER-NO-REOPEN.XML, SOLRCONFIG-ELEVATE.XML, PHRASESUGGEST.TXT, SCHEMA_CODEC.XML, SOLRCONFIG_PERF.XML, MAPPING-ISOLATIN1ACCENT.TXT, BAD-SCHEMA-UNIQUEKEY-MULTIVALUED.XML, SCHEMA-LMDIRICHLET.XML, SOLRCONFIG-REPEATER.XML, BAD-SCHEMA-NONTEXT-ANALYZER.XML, SCHEMA12.XML, STOP-1.TXT, STOPWORDS.TXT, SCHEMA-NUMERIC.XML, SOLRCONFIG-PHRASESUGGEST.XML, SOLRCONFIG-XINCLUDE.XML, XSLT, DA_UTF8.XML, BAD-SCHEMA-CODEC-GLOBAL-VS-FT-MISMATCH.XML, BAD-SCHEMA-NOT-INDEXED-BUT-NORMS.XML, SCHEMA-TFIDF.XML, ANALYZINGINFIXSUGGEST.TXT, COMPOUNDDICTIONARY.TXT, SCHEMA-ONE-FIELD-NO-DYNAMIC-FIELD-UNIQUE-KEY.XML, SOLRCONFIG-MINIMAL.XML, SOLRCONFIG-MERGEPOLICY-LEGACY.XML, SOLRCONFIG-SPELLCHECKER.XML, SCHEMA-REST-LUCENE-MATCH-VERSION.XML, SOLRCONFIG-INFOSTREAM-LOGGING.XML, SCHEMA-DISTRIBUTED-MISSING-SORT.XML, SCHEMA-PHRASESUGGEST.XML, SOLRCONFIG-MERGEPOLICY-DEFAULTS.XML, SCHEMA-DFR.XML, BAD-SCHEMA-SWEETSPOT-PARTIAL-BASELINE.XML, FRENCHARTICLES.TXT, SCHEMA-BEHAVIOR.XML, BAD-SCHEMA-NOT-INDEXED-BUT-TF.XML, SOLRCONFIG-SUGGESTERCOMPONENT.XML, TRIVIAL.UPDATEPROCESSOR0.JS, BAD-SCHEMA-DUP-FIELD.XML, HUNSPELL-TEST.AFF, SOLRCONFIG-FUNCTIONQUERY.XML, BAD-CURRENCY.XML, SOLRCONFIG-CACHING.XML, ELEVATE.XML, SCHEMA-SYNONYM-TOKENIZER.XML, SCHEMA-SWEETSPOT.XML, BAD-SCHEMA-CURRENCY-FT-BOGUS-CODE-IN-XML.XML, SOLRCONFIG-TEST-MISC.XML, CURRENCY.XML, BAD-SOLRCONFIG-BOGUS-SCRIPTENGINE-NAME.XML, BAD-SCHEMA-BOGUS-ANALYSIS-PARAMETERS.XML, SOLRCONFIG-HIGHLIGHT.XML, SCHEMA-SORTS.XML, SCHEMA-ADD-SCHEMA-FIELDS-UPDATE-PROCESSOR.XML, ADDFIELDS.UPDATEPROCESSOR.JS, SCHEMA-COPYFIELD-TEST.XML, BAD-SCHEMA-SWEETSPOT-PARTIAL-HYPERBOLIC.XML, SOLRCONFIG-NOOPREGEN.XML, SCHEMA-STOP-KEEP.XML, SCHEMA-DOCVALUESMISSING.XML, SOLRCONFIG-NOCACHE.XML, SOLRCONFIG-WARMER.XML, SYNONYMS.TXT, PROTWORDS.TXT, SCHEMA-DOCVALUESMULTI.XML, BAD-SOLRCONFIG-MULTIPLE-INDEXCONFIGS.XML, STOPWITHBOM.TXT, SCHEMA-NOT-REQUIRED-UNIQUE-KEY.XML, SCHEMA-REPLICATION1.XML, STOPTYPES-1.TXT, BAD-SOLRCONFIG-MULTIPLE-DIRFACTORY.XML, SCHEMA-IB.XML, SCHEMA-COLLATE-DV.XML, SOLRCONFIG-QUERYSENDER-NOQUERY.XML, SCHEMA-SIMPLEQPPLUGIN.XML, SCHEMA-CUSTOM-FIELD.XML, SOLRCONFIG-DELPOLICY2.XML, SCHEMA-DOCVALUES.XML, SOLRCONFIG_CODEC.XML, WDFTYPES.TXT, SOLRCONFIG-SPELLCHECKCOMPONENT.XML, SCHEMA-SNIPPET-TYPES.INCL, SOLRCONFIG-TLOG.XML, SOLRCONFIG-SLAVE.XML, OLD_SYNONYMS.TXT, BLENDEDINFIXSUGGEST.TXT, SOLRCONFIG-SNIPPET-PROCESSOR.XML, SCHEMA-FOLDING.XML, SCHEMA11.XML, FUZZYSUGGEST.TXT, SCHEMA-REQUIRED-FIELDS.XML, BAD-SCHEMA-DYNAMICFIELD-DEFAULT-VAL.XML, BAD-SCHEMA-SWEETSPOT-PARTIAL-NORMS.XML, SOLRCONFIG-MASTER3.XML, REGEX-BOOST-PROCESSOR-TEST.TXT, BAD-SOLRCONFIG-MULTIPLE-CFS.XML, BAD-SCHEMA-UNSUPPORTED-DOCVALUES.XML, SOLRCONFIG-BASIC-LUCENEVERSION31.XML, SOLRCONFIG-BASIC.XML, BAD-SCHEMA-DUP-FIELDTYPE.XML, SCHEMA-SNIPPET-FIELD.XML, BAD-SOLRCONFIG-MANAGED-SCHEMA-NAMED-SCHEMA.XML.XML, STOP-2.TXT, .SVN, SOLRCONFIG-SCRIPT-UPDATEPROCESSOR.XML, SOLRCONFIG-ADD-SCHEMA-FIELDS-UPDATE-PROCESSOR-CHAINS.XML, SOLRCONFIG-MANAGED-SCHEMA.XML, SCHEMA-LMJELINEKMERCER.XML, SCHEMA-COLLATE.XML, SOLRCONFIG-INDEXCONFIG.XML, BAD-SCHEMA-MISPLACED-ASTERISK-COPYFIELD-SOURCE-SHOULD-FAIL-TEST.XML, SCHEMA-MINIMAL.XML, BAD-SCHEMA-DUP-DYNAMICFIELD.XML, SCHEMA-LUCENEMATCHVERSION.XML, SCHEMA-TINY.XML, BAD-SCHEMA-NOT-INDEXED-BUT-POS.XML, STOP-SNOWBALL.TXT, SCHEMA-REPLICATION2.XML, BAD-SCHEMA-UNIQUEKEY-USES-DEFAULT.XML, SCHEMASURROUND.XML, SOLRCONFIG-TIEREDMERGEPOLICY.XML, SOLRCONFIG-EXTERNALVERSIONCONSTRAINT.XML, SCHEMA-ONE-FIELD-NO-DYNAMIC-FIELD.XML, SCHEMA-CLASS-NAME-SHORTENING-ON-SERIALIZATION.XML, DA_COMPOUNDDICTIONARY.TXT]
   [junit4]   2> 665650 T2430 oasu.CommitTracker.<init> Hard AutoCommit: disabled
   [junit4]   2> 665651 T2430 oasu.CommitTracker.<init> Soft AutoCommit: disabled
   [junit4]   2> 665651 T2430 oasu.RandomMergePolicy.<init> RandomMergePolicy wrapping class org.apache.lucene.index.LogDocMergePolicy: [LogDocMergePolicy: minMergeSize=1000, mergeFactor=39, maxMergeSize=9223372036854775807, maxMergeSizeForForcedMerge=9223372036854775807, calibrateSizeByDeletes=false, maxMergeDocs=2147483647, maxCFSSegmentSizeMB=8.796093022207999E12, noCFSRatio=1.0]
   [junit4]   2> 665652 T2430 oasc.SolrDeletionPolicy.onInit SolrDeletionPolicy.onInit: commits: num=1
   [junit4]   2> 		commit{dir=MockDirectoryWrapper(RAMDirectory@1b768ad4 lockFactory=org.apache.lucene.store.SingleInstanceLockFactory@c409e279),segFN=segments_1,generation=1}
   [junit4]   2> 665652 T2430 oasc.SolrDeletionPolicy.updateCommits newest commit generation = 1
   [junit4]   2> 665653 T2430 oass.SolrIndexSearcher.<init> Opening Searcher@e5ad4477[collection1] main
   [junit4]   2> 665653 T2430 oashc.QueryElevationComponent.inform Loading QueryElevation from: /mnt/ssd/jenkins/workspace/Lucene-Solr-4.x-Linux/solr/core/src/test-files/solr/collection1/conf/elevate.xml
   [junit4]   2> 665663 T2430 oashc.QueryElevationComponent.inform Loading QueryElevation from: /mnt/ssd/jenkins/workspace/Lucene-Solr-4.x-Linux/solr/core/src/test-files/solr/collection1/conf/elevate.xml
   [junit4]   2> 665673 T2431 oasc.SolrCore.registerSearcher [collection1] Registered new searcher Searcher@e5ad4477[collection1] main{StandardDirectoryReader(segments_1:1:nrt)}
   [junit4]   2> 665674 T2430 oasc.CoreContainer.registerCore registering core: collection1
   [junit4]   2> 665675 T2420 oass.SolrDispatchFilter.init user.dir=/mnt/ssd/jenkins/workspace/Lucene-Solr-4.x-Linux/solr/build/solr-core/test/J0
   [junit4]   2> 665675 T2420 oass.SolrDispatchFilter.init SolrDispatchFilter.init() done
   [junit4]   2> 665676 T2420 oejs.Server.doStart jetty-8.1.10.v20130312
   [junit4]   2> 665678 T2420 oejs.AbstractConnector.doStart Started SelectChannelConnector@127.0.0.1:?????
   [junit4]   2> 665679 T2420 oass.SolrDispatchFilter.init SolrDispatchFilter.init()
   [junit4]   2> 665680 T2420 oasc.SolrResourceLoader.locateSolrHome JNDI not configured for solr (NoInitialContextEx)
   [junit4]   2> 665680 T2420 oasc.SolrResourceLoader.locateSolrHome using system property solr.solr.home: /mnt/ssd/jenkins/workspace/Lucene-Solr-4.x-Linux/solr/core/src/test-files/solr
   [junit4]   2> 665681 T2420 oasc.SolrResourceLoader.<init> new SolrResourceLoader for directory: '/mnt/ssd/jenkins/workspace/Lucene-Solr-4.x-Linux/solr/core/src/test-files/solr/'
   [junit4]   2> 665689 T2420 oasc.ConfigSolr.fromFile Loading container configuration from /mnt/ssd/jenkins/workspace/Lucene-Solr-4.x-Linux/solr/core/src/test-files/solr/solr.xml
   [junit4]   2> 665724 T2420 oasc.CoreContainer.<init> New CoreContainer -1707928618
   [junit4]   2> 665725 T2420 oasc.CoreContainer.load Loading cores into CoreContainer [instanceDir=/mnt/ssd/jenkins/workspace/Lucene-Solr-4.x-Linux/solr/core/src/test-files/solr/]
   [junit4]   2> 665726 T2420 oashc.HttpShardHandlerFactory.getParameter Setting socketTimeout to: 90000
   [junit4]   2> 665727 T2420 oashc.HttpShardHandlerFactory.getParameter Setting urlScheme to: 
   [junit4]   2> 665727 T2420 oashc.HttpShardHandlerFactory.getParameter Setting connTimeout to: 15000
   [junit4]   2> 665728 T2420 oashc.HttpShardHandlerFactory.getParameter Setting maxConnectionsPerHost to: 20
   [junit4]   2> 665728 T2420 oashc.HttpShardHandlerFactory.getParameter Setting corePoolSize to: 0
   [junit4]   2> 665729 T2420 oashc.HttpShardHandlerFactory.getParameter Setting maximumPoolSize to: 2147483647
   [junit4]   2> 665729 T2420 oashc.HttpShardHandlerFactory.getParameter Setting maxThreadIdleTime to: 5
   [junit4]   2> 665730 T2420 oashc.HttpShardHandlerFactory.getParameter Setting sizeOfQueue to: -1
   [junit4]   2> 665730 T2420 oashc.HttpShardHandlerFactory.getParameter Setting fairnessPolicy to: false
   [junit4]   2> 665734 T2420 oasl.LogWatcher.createWatcher SLF4J impl is org.slf4j.impl.Log4jLoggerFactory
   [junit4]   2> 665734 T2420 oasl.LogWatcher.newRegisteredLogWatcher Registering Log Listener [Log4j (org.slf4j.impl.Log4jLoggerFactory)]
   [junit4]   2> 665735 T2420 oasc.CoreContainer.load Host Name: 127.0.0.1
   [junit4]   2> 665739 T2442 oasc.CoreContainer.create Creating SolrCore 'collection1' using instanceDir: /mnt/ssd/jenkins/workspace/Lucene-Solr-4.x-Linux/solr/core/src/test-files/solr/collection1
   [junit4]   2> 665739 T2442 oasc.SolrResourceLoader.<init> new SolrResourceLoader for directory: '/mnt/ssd/jenkins/workspace/Lucene-Solr-4.x-Linux/solr/core/src/test-files/solr/collection1/'
   [junit4]   2> 665740 T2442 oasc.SolrResourceLoader.replaceClassLoader Adding 'file:/mnt/ssd/jenkins/workspace/Lucene-Solr-4.x-Linux/solr/core/src/test-files/solr/collection1/lib/.svn/' to classloader
   [junit4]   2> 665740 T2442 oasc.SolrResourceLoader.replaceClassLoader Adding 'file:/mnt/ssd/jenkins/workspace/Lucene-Solr-4.x-Linux/solr/core/src/test-files/solr/collection1/lib/classes/' to classloader
   [junit4]   2> 665740 T2442 oasc.SolrResourceLoader.replaceClassLoader Adding 'file:/mnt/ssd/jenkins/workspace/Lucene-Solr-4.x-Linux/solr/core/src/test-files/solr/collection1/lib/README' to classloader
   [junit4]   2> 665770 T2442 oasc.SolrConfig.<init> Using Lucene MatchVersion: LUCENE_48
   [junit4]   2> 665807 T2442 oasc.SolrConfig.<init> Loaded SolrConfig: solrconfig-elevate.xml
   [junit4]   2> 665807 T2442 oass.IndexSchema.readSchema Reading Solr Schema from schema11.xml
   [junit4]   2> 665812 T2442 oass.IndexSchema.readSchema [collection1] Schema name=example
   [junit4]   2> 665958 T2442 oass.IndexSchema.readSchema default search field in schema is text
   [junit4]   2> 665960 T2442 oass.IndexSchema.readSchema unique key field: id
   [junit4]   2> 665963 T2442 oasc.SolrCore.initDirectoryFactory org.apache.solr.core.MockDirectoryFactory
   [junit4]   2> 665964 T2442 oasc.SolrCore.<init> [collection1] Opening new SolrCore at /mnt/ssd/jenkins/workspace/Lucene-Solr-4.x-Linux/solr/core/src/test-files/solr/collection1/, dataDir=./org.apache.solr.handler.component.DistributedQueryElevationComponentTest-1393333900181/shard0/data/
   [junit4]   2> 665964 T2442 oasc.JmxMonitoredMap.<init> JMX monitoring is enabled. Adding Solr mbeans to JMX Server: com.sun.jmx.mbeanserver.JmxMBeanServer@bf1810d7
   [junit4]   2> 665965 T2442 oasc.CachingDirectoryFactory.get return new directory for ./org.apache.solr.handler.component.DistributedQueryElevationComponentTest-1393333900181/shard0/data
   [junit4]   2> 665966 T2442 oasc.SolrCore.getNewIndexDir New index directory detected: old=null new=./org.apache.solr.handler.component.DistributedQueryElevationComponentTest-1393333900181/shard0/data/index/
   [junit4]   2> 665966 T2442 oasc.SolrCore.initIndex WARN [collection1] Solr index directory './org.apache.solr.handler.component.DistributedQueryElevationComponentTest-1393333900181/shard0/data/index' doesn't exist. Creating new index...
   [junit4]   2> 665966 T2442 oasc.CachingDirectoryFactory.get return new directory for ./org.apache.solr.handler.component.DistributedQueryElevationComponentTest-1393333900181/shard0/data/index
   [junit4]   2> 665967 T2442 oasu.RandomMergePolicy.<init> RandomMergePolicy wrapping class org.apache.lucene.index.LogDocMergePolicy: [LogDocMergePolicy: minMergeSize=1000, mergeFactor=39, maxMergeSize=9223372036854775807, maxMergeSizeForForcedMerge=9223372036854775807, calibrateSizeByDeletes=false, maxMergeDocs=2147483647, maxCFSSegmentSizeMB=8.796093022207999E12, noCFSRatio=1.0]
   [junit4]   2> 665968 T2442 oasc.SolrDeletionPolicy.onCommit SolrDeletionPolicy.onCommit: commits: num=1
   [junit4]   2> 		commit{dir=MockDirectoryWrapper(RAMDirectory@75915485 lockFactory=org.apache.lucene.store.SingleInstanceLockFactory@2b832791),segFN=segments_1,generation=1}
   [junit4]   2> 665968 T2442 oasc.SolrDeletionPolicy.updateCommits newest commit generation = 1
   [junit4]   2> 665971 T2442 oasc.SolrCore.loadUpdateProcessorChains no updateRequestProcessorChain defined as default, creating implicit default
   [junit4]   2> 665971 T2442 oasc.RequestHandlers.initHandlersFromConfig created /update: solr.UpdateRequestHandler
   [junit4]   2> 665972 T2442 oasc.RequestHandlers.initHandlersFromConfig created /elevate: org.apache.solr.handler.component.SearchHandler
   [junit4]   2> 665972 T2442 oasc.RequestHandlers.initHandlersFromConfig created /dataElevate: org.apache.solr.handler.component.SearchHandler
   [junit4]   2> 665974 T2442 oashl.XMLLoader.init xsltCacheLifetimeSeconds=60
   [junit4]   2> 665974 T2442 oasc.RequestHandlers.initHandlersFromConfig WARN no default request handler is registered (either '/select' or 'standard')
   [junit4]   2> 665975 T2442 oasc.SolrCore.initDeprecatedSupport WARN solrconfig.xml uses deprecated <admin/gettableFiles>, Please update your config to use the ShowFileRequestHandler.
   [junit4]   2> 665977 T2442 oasc.SolrCore.initDeprecatedSupport WARN adding ShowFileRequestHandler with hidden files: [SOLRCONFIG-UPDATE-PROCESSOR-CHAINS.XML, SCHEMA-DOCVALUESFACETING.XML, SOLRCONFIG-TRANSFORMERS.XML, BAD-SCHEMA-CURRENCY-DYNAMIC-MULTIVALUED.XML, BAD-SCHEMA-SIM-GLOBAL-VS-FT-MISMATCH.XML, SCHEMA-BM25.XML, HUNSPELL-TEST.DIC, SCHEMA-CHARFILTERS.XML, BAD-SCHEMA-MISPLACED-ASTERISK-COPYFIELD-DEST-SHOULD-FAIL-TEST.XML, SOLRCONFIG-TERMINDEX.XML, BAD-SOLRCONFIG-UNEXPECTED-SCHEMA-ATTRIBUTE.XML, SOLRCONFIG-LOGMERGEPOLICY.XML, SOLRCONFIG-MASTER1.XML, SCHEMA-SPATIAL.XML, SOLRCONFIG-RESPONSE-LOG-COMPONENT.XML, STOPTYPES-2.TXT, BAD-SCHEMA-CURRENCY-FT-BOGUS-DEFAULT-CODE.XML, SCHEMA-SNIPPET-TYPE.XML, SOLRCONFIG.SNIPPET.RANDOMINDEXCONFIG.XML, SCHEMA-REVERSED.XML, FREETEXTSUGGEST.TXT, SOLRCONFIG-MASTER.XML, SOLRCONFIG-SOLCOREPROPERTIES.XML, BAD-SCHEMA-EXTERNAL-FILEFIELD.XML, BAD-SCHEMA-CURRENCY-FT-OER-NORATES.XML, SCHEMA-ENUMS.XML, BAD-MP-SOLRCONFIG.XML, SCHEMA-ID-AND-VERSION-FIELDS-ONLY.XML, SOLRCONFIG-MASTER2.XML, MISSING.FUNCTIONS.UPDATEPROCESSOR.JS, SOLRCONFIG-DEEPPAGING.XML, SCHEMA-BINARYFIELD.XML, BAD-SCHEMA-CURRENCY-FT-MULTIVALUED.XML, BAD-SOLRCONFIG-SCHEMA-MUTABLE-BUT-NOT-MANAGED.XML, KEEP-1.TXT, BAD-SCHEMA-UNIQUEKEY-IS-COPYFIELD-DEST.XML, SOLRCONFIG-QUERYSENDER.XML, SOLRCONFIG-LAZYWRITER.XML, BAD-SCHEMA-CURRENCY-MULTIVALUED.XML, SCHEMA-EFF.XML, SCHEMA-COLLATEFILTER.XML, SOLRCONFIG-DELPOLICY1.XML, KEEP-2.TXT, SOLRCONFIG-COMPONENTS-NAME.XML, SOLRCONFIG-DEFAULTS.XML, SOLRCONFIG-POSTINGSHIGHLIGHT.XML, SOLRCONFIG-IMPLICITPROPERTIES.XML, SCHEMA15.XML, HYPHENATION.DTD, BAD-SCHEMA-OMIT-TF-BUT-NOT-POS.XML, SCHEMA-SIM.XML, BAD-SCHEMA-MULTIPLE-ASTERISK-COPYFIELD-DEST-SHOULD-FAIL-TEST.XML, BAD-SCHEMA-MULTIPLE-ASTERISK-COPYFIELD-SOURCE-SHOULD-FAIL-TEST.XML, SOLRCONFIG-SOLR-749.XML, BAD-SOLRCONFIG-WARMER-NO-REOPEN.XML, PHRASESUGGEST.TXT, SOLRCONFIG-ELEVATE.XML, BAD-SCHEMA-BOGUS-FIELD-PARAMETERS.XML, SOLRCONFIG-ALTDIRECTORY.XML, SOLRCONFIG-MASTER1-KEEPONEBACKUP.XML, SOLRCONFIG-PARSING-UPDATE-PROCESSOR-CHAINS.XML, TRIVIAL.UPDATEPROCESSOR1.JS, MISSLEADING.EXTENSION.UPDATEPROCESSOR.JS.TXT, SCHEMA-CUSTOMFIELD.XML, SCHEMA-REST.XML, BAD-SCHEMA-NON-GLOB-COPYFIELD-SOURCE-MATCHING-NOTHING-SHOULD-FAIL-TEST.XML, CONDITIONAL.UPDATEPROCESSOR.JS, ENUMSCONFIG.XML, SOLRCONFIG-PHRASESUGGEST.XML, STOP-1.TXT, STOPWORDS.TXT, SCHEMA-NUMERIC.XML, SOLRCONFIG-REPEATER.XML, BAD-SCHEMA-NONTEXT-ANALYZER.XML, SCHEMA12.XML, SCHEMA_CODEC.XML, MAPPING-ISOLATIN1ACCENT.TXT, BAD-SCHEMA-UNIQUEKEY-MULTIVALUED.XML, SOLRCONFIG_PERF.XML, SCHEMA-LMDIRICHLET.XML, SOLRCONFIG-SLAVE1.XML, SOLRCONFIG-QUERY-PARSER-INIT.XML, SCHEMA-SPELLCHECKER.XML, BAD-SOLRCONFIG-INVALID-SCRIPTFILE.XML, SCHEMA-POSTINGSHIGHLIGHT.XML, SCHEMA-XINCLUDE.XML, BAD-SCHEMA-ANALYZER-CLASS-AND-NESTED.XML, SOLRCONFIG-COLLAPSEQPARSER.XML, SCHEMA-TRIE.XML, STOPWORDSWRONGENCODING.TXT, OPEN-EXCHANGE-RATES.JSON, STEMDICT.TXT, SOLRCONFIG-REQHANDLER.INCL, BAD-SCHEMA-SWEETSPOT-BOTH-TF.XML, JASUGGEST.TXT, BAD-SCHEMA-DYNAMICFIELD-REQUIRED.XML, BAD_SOLRCONFIG.XML, THROW.ERROR.ON.ADD.UPDATEPROCESSOR.JS, BAD-SOLRCONFIG-MISSING-SCRIPTFILE.XML, SCHEMA-SORTS.XML, SOLRCONFIG-HIGHLIGHT.XML, CURRENCY.XML, BAD-SOLRCONFIG-BOGUS-SCRIPTENGINE-NAME.XML, BAD-SCHEMA-BOGUS-ANALYSIS-PARAMETERS.XML, SCHEMA-SWEETSPOT.XML, SCHEMA-SYNONYM-TOKENIZER.XML, BAD-SCHEMA-CURRENCY-FT-BOGUS-CODE-IN-XML.XML, SOLRCONFIG-TEST-MISC.XML, SOLRCONFIG-CACHING.XML, ELEVATE.XML, SYNONYMS.TXT, PROTWORDS.TXT, SCHEMA-DOCVALUESMULTI.XML, BAD-SOLRCONFIG-MULTIPLE-INDEXCONFIGS.XML, SOLRCONFIG-NOOPREGEN.XML, SCHEMA-DOCVALUESMISSING.XML, SCHEMA-STOP-KEEP.XML, SOLRCONFIG-WARMER.XML, SOLRCONFIG-NOCACHE.XML, BAD-SCHEMA-SWEETSPOT-PARTIAL-HYPERBOLIC.XML, SCHEMA-ADD-SCHEMA-FIELDS-UPDATE-PROCESSOR.XML, ADDFIELDS.UPDATEPROCESSOR.JS, SCHEMA-COPYFIELD-TEST.XML, SOLRCONFIG-MERGEPOLICY-LEGACY.XML, SCHEMA-ONE-FIELD-NO-DYNAMIC-FIELD-UNIQUE-KEY.XML, SOLRCONFIG-MINIMAL.XML, SCHEMA-TFIDF.XML, ANALYZINGINFIXSUGGEST.TXT, BAD-SCHEMA-NOT-INDEXED-BUT-NORMS.XML, COMPOUNDDICTIONARY.TXT, SOLRCONFIG-XINCLUDE.XML, XSLT, DA_UTF8.XML, BAD-SCHEMA-CODEC-GLOBAL-VS-FT-MISMATCH.XML, HUNSPELL-TEST.AFF, SOLRCONFIG-FUNCTIONQUERY.XML, BAD-CURRENCY.XML, SCHEMA-BEHAVIOR.XML, BAD-SCHEMA-NOT-INDEXED-BUT-TF.XML, SOLRCONFIG-SUGGESTERCOMPONENT.XML, BAD-SCHEMA-DUP-FIELD.XML, TRIVIAL.UPDATEPROCESSOR0.JS, BAD-SCHEMA-SWEETSPOT-PARTIAL-BASELINE.XML, FRENCHARTICLES.TXT, SCHEMA-REST-LUCENE-MATCH-VERSION.XML, SOLRCONFIG-INFOSTREAM-LOGGING.XML, SOLRCONFIG-SPELLCHECKER.XML, SCHEMA-PHRASESUGGEST.XML, SCHEMA-DISTRIBUTED-MISSING-SORT.XML, SOLRCONFIG-MERGEPOLICY-DEFAULTS.XML, SCHEMA-DFR.XML, BAD-SCHEMA-MISPLACED-ASTERISK-COPYFIELD-SOURCE-SHOULD-FAIL-TEST.XML, SOLRCONFIG-INDEXCONFIG.XML, SCHEMA-MINIMAL.XML, SOLRCONFIG-ADD-SCHEMA-FIELDS-UPDATE-PROCESSOR-CHAINS.XML, SOLRCONFIG-MANAGED-SCHEMA.XML, SCHEMA-LMJELINEKMERCER.XML, SCHEMA-COLLATE.XML, SOLRCONFIG-SCRIPT-UPDATEPROCESSOR.XML, .SVN, BAD-SCHEMA-DUP-FIELDTYPE.XML, SCHEMA-SNIPPET-FIELD.XML, BAD-SOLRCONFIG-MANAGED-SCHEMA-NAMED-SCHEMA.XML.XML, STOP-2.TXT, SOLRCONFIG-EXTERNALVERSIONCONSTRAINT.XML, SCHEMA-ONE-FIELD-NO-DYNAMIC-FIELD.XML, SCHEMA-CLASS-NAME-SHORTENING-ON-SERIALIZATION.XML, DA_COMPOUNDDICTIONARY.TXT, SCHEMASURROUND.XML, SOLRCONFIG-TIEREDMERGEPOLICY.XML, SCHEMA-REPLICATION2.XML, BAD-SCHEMA-UNIQUEKEY-USES-DEFAULT.XML, BAD-SCHEMA-DUP-DYNAMICFIELD.XML, SCHEMA-LUCENEMATCHVERSION.XML, SCHEMA-TINY.XML, BAD-SCHEMA-NOT-INDEXED-BUT-POS.XML, STOP-SNOWBALL.TXT, SCHEMA-SNIPPET-TYPES.INCL, SOLRCONFIG-TLOG.XML, SOLRCONFIG-SLAVE.XML, OLD_SYNONYMS.TXT, BLENDEDINFIXSUGGEST.TXT, SCHEMA-CUSTOM-FIELD.XML, SCHEMA-DOCVALUES.XML, SOLRCONFIG-DELPOLICY2.XML, WDFTYPES.TXT, SOLRCONFIG-SPELLCHECKCOMPONENT.XML, SOLRCONFIG_CODEC.XML, BAD-SOLRCONFIG-MULTIPLE-DIRFACTORY.XML, SCHEMA-IB.XML, SCHEMA-COLLATE-DV.XML, SOLRCONFIG-QUERYSENDER-NOQUERY.XML, SCHEMA-SIMPLEQPPLUGIN.XML, STOPWITHBOM.TXT, SCHEMA-NOT-REQUIRED-UNIQUE-KEY.XML, SCHEMA-REPLICATION1.XML, STOPTYPES-1.TXT, REGEX-BOOST-PROCESSOR-TEST.TXT, BAD-SCHEMA-UNSUPPORTED-DOCVALUES.XML, BAD-SOLRCONFIG-MULTIPLE-CFS.XML, SOLRCONFIG-BASIC-LUCENEVERSION31.XML, SOLRCONFIG-BASIC.XML, BAD-SCHEMA-DYNAMICFIELD-DEFAULT-VAL.XML, BAD-SCHEMA-SWEETSPOT-PARTIAL-NORMS.XML, SOLRCONFIG-MASTER3.XML, SOLRCONFIG-SNIPPET-PROCESSOR.XML, SCHEMA-FOLDING.XML, SCHEMA11.XML, SCHEMA-REQUIRED-FIELDS.XML, FUZZYSUGGEST.TXT]
   [junit4]   2> 665978 T2442 oasu.CommitTracker.<init> Hard AutoCommit: disabled
   [junit4]   2> 665979 T2442 oasu.CommitTracker.<init> Soft AutoCommit: disabled
   [junit4]   2> 665979 T2442 oasu.RandomMergePolicy.<init> RandomMergePolicy wrapping class org.apache.lucene.index.LogDocMergePolicy: [LogDocMergePolicy: minMergeSize=1000, mergeFactor=39, maxMergeSize=9223372036854775807, maxMergeSizeForForcedMerge=9223372036854775807, calibrateSizeByDeletes=false, maxMergeDocs=2147483647, maxCFSSegmentSizeMB=8.796093022207999E12, noCFSRatio=1.0]
   [junit4]   2> 665980 T2442 oasc.SolrDeletionPolicy.onInit SolrDeletionPolicy.onInit: commits: num=1
   [junit4]   2> 		commit{dir=MockDirectoryWrapper(RAMDirectory@75915485 lockFactory=org.apache.lucene.store.SingleInstanceLockFactory@2b832791),segFN=segments_1,generation=1}
   [junit4]   2> 665980 T2442 oasc.SolrDeletionPolicy.updateCommits newest commit generation = 1
   [junit4]   2> 665981 T2442 oass.SolrIndexSearcher.<init> Opening Searcher@c7e7508a[collection1] main
   [junit4]   2> 665981 T2442 oashc.QueryElevationComponent.inform Loading QueryElevation from: /mnt/ssd/jenkins/workspace/Lucene-Solr-4.x-Linux/solr/core/src/test-files/solr/collection1/conf/elevate.xml
   [junit4]   2> 665991 T2442 oashc.QueryElevationComponent.inform Loading QueryElevation from: /mnt/ssd/jenkins/workspace/Lucene-Solr-4.x-Linux/solr/core/src/test-files/solr/collection1/conf/elevate.xml
   [junit4]   2> 666001 T2443 oasc.SolrCore.registerSearcher [collection1] Registered new searcher Searcher@c7e7508a[collection1] main{StandardDirectoryReader(segments_1:1:nrt)}
   [junit4]   2> 666002 T2442 oasc.CoreContainer.registerCore registering core: collection1
   [junit4]   2> 666003 T2420 oass.SolrDispatchFilter.init user.dir=/mnt/ssd/jenkins/workspace/Lucene-Solr-4.x-Linux/solr/build/solr-core/test/J0
   [junit4]   2> 666004 T2420 oass.SolrDispatchFilter.init SolrDispatchFilter.init() done
   [junit4]   2> 666005 T2420 oejs.Server.doStart jetty-8.1.10.v20130312
   [junit4]   2> 666007 T2420 oejs.AbstractConnector.doStart Started SelectChannelConnector@127.0.0.1:?????
   [junit4]   2> 666008 T2420 oass.SolrDispatchFilter.init SolrDispatchFilter.init()
   [junit4]   2> 666008 T2420 oasc.SolrResourceLoader.locateSolrHome JNDI not configured for solr (NoInitialContextEx)
   [junit4]   2> 666009 T2420 oasc.SolrResourceLoader.locateSolrHome using system property solr.solr.home: /mnt/ssd/jenkins/workspace/Lucene-Solr-4.x-Linux/solr/core/src/test-files/solr
   [junit4]   2> 666010 T2420 oasc.SolrResourceLoader.<init> new SolrResourceLoader for directory: '/mnt/ssd/jenkins/workspace/Lucene-Solr-4.x-Linux/solr/core/src/test-files/solr/'
   [junit4]   2> 666020 T2420 oasc.ConfigSolr.fromFile Loading container configuration from /mnt/ssd/jenkins/workspace/Lucene-Solr-4.x-Linux/solr/core/src/test-files/solr/solr.xml
   [junit4]   2> 666060 T2420 oasc.CoreContainer.<init> New CoreContainer -1463587562
   [junit4]   2> 666061 T2420 oasc.CoreContainer.load Loading cores into CoreContainer [instanceDir=/mnt/ssd/jenkins/workspace/Lucene-Solr-4.x-Linux/solr/core/src/test-files/solr/]
   [junit4]   2> 666062 T2420 oashc.HttpShardHandlerFactory.getParameter Setting socketTimeout to: 90000
   [junit4]   2> 666063 T2420 oashc.HttpShardHandlerFactory.getParameter Setting urlScheme to: 
   [junit4]   2> 666063 T2420 oashc.HttpShardHandlerFactory.getParameter Setting connTimeout to: 15000
   [junit4]   2> 666064 T2420 oashc.HttpShardHandlerFactory.getParameter Setting maxConnectionsPerHost to: 20
   [junit4]   2> 666065 T2420 oashc.HttpShardHandlerFactory.getParameter Setting corePoolSize to: 0
   [junit4]   2> 666065 T2420 oashc.HttpShardHandlerFactory.getParameter Setting maximumPoolSize to: 2147483647
   [junit4]   2> 666066 T2420 oashc.HttpShardHandlerFactory.getParameter Setting maxThreadIdleTime to: 5
   [junit4]   2> 666066 T2420 oashc.HttpShardHandlerFactory.getParameter Setting sizeOfQueue to: -1
   [junit4]   2> 666067 T2420 oashc.HttpShardHandlerFactory.getParameter Setting fairnessPolicy to: false
   [junit4]   2> 666070 T2420 oasl.LogWatcher.createWatcher SLF4J impl is org.slf4j.impl.Log4jLoggerFactory
   [junit4]   2> 666071 T2420 oasl.LogWatcher.newRegisteredLogWatcher Registering Log Listener [Log4j (org.slf4j.impl.Log4jLoggerFactory)]
   [junit4]   2> 666071 T2420 oasc.CoreContainer.load Host Name: 127.0.0.1
   [junit4]   2> 666074 T2454 oasc.CoreContainer.create Creating SolrCore 'collection1' using instanceDir: /mnt/ssd/jenkins/workspace/Lucene-Solr-4.x-Linux/solr/core/src/test-files/solr/collection1
   [junit4]   2> 666075 T2454 oasc.SolrResourceLoader.<init> new SolrResourceLoader for directory: '/mnt/ssd/jenkins/workspace/Lucene-Solr-4.x-Linux/solr/core/src/test-files/solr/collection1/'
   [junit4]   2> 666075 T2454 oasc.SolrResourceLoader.replaceClassLoader Adding 'file:/mnt/ssd/jenkins/workspace/Lucene-Solr-4.x-Linux/solr/core/src/test-files/solr/collection1/lib/.svn/' to classloader
   [junit4]   2> 666076 T2454 oasc.SolrResourceLoader.replaceClassLoader Adding 'file:/mnt/ssd/jenkins/workspace/Lucene-Solr-4.x-Linux/solr/core/src/test-files/solr/collection1/lib/classes/' to classloader
   [junit4]   2> 666076 T2454 oasc.SolrResourceLoader.replaceClassLoader Adding 'file:/mnt/ssd/jenkins/workspace/Lucene-Solr-4.x-Linux/solr/core/src/test-files/solr/collection1/lib/README' to classloader
   [junit4]   2> 666106 T2454 oasc.SolrConfig.<init> Using Lucene MatchVersion: LUCENE_48
   [junit4]   2> 666142 T2454 oasc.SolrConfig.<init> Loaded SolrConfig: solrconfig-elevate.xml
   [junit4]   2> 666143 T2454 oass.IndexSchema.readSchema Reading Solr Schema from schema11.xml
   [junit4]   2> 666147 T2454 oass.IndexSchema.readSchema [collection1] Schema name=example
   [junit4]   2> 666275 T2454 oass.IndexSchema.readSchema default search field in schema is text
   [junit4]   2> 666277 T2454 oass.IndexSchema.readSchema unique key field: id
   [junit4]   2> 666281 T2454 oasc.SolrCore.initDirectoryFactory org.apache.solr.core.MockDirectoryFactory
   [junit4]   2> 666281 T2454 oasc.SolrCore.<init> [collection1] Opening new SolrCore at /mnt/ssd/jenkins/workspace/Lucene-Solr-4.x-Linux/solr/core/src/test-files/solr/collection1/, dataDir=./org.apache.solr.handler.component.DistributedQueryElevationComponentTest-1393333900181/shard1/data/
   [junit4]   2> 666281 T2454 oasc.JmxMonitoredMap.<init> JMX monitoring is enabled. Adding Solr mbeans to JMX Server: com.sun.jmx.mbeanserver.JmxMBeanServer@bf1810d7
   [junit4]   2> 666282 T2454 oasc.CachingDirectoryFactory.get return new directory for ./org.apache.solr.handler.component.DistributedQueryElevationComponentTest-1393333900181/shard1/data
   [junit4]   2> 666283 T2454 oasc.SolrCore.getNewIndexDir New index directory detected: old=null new=./org.apache.solr.handler.component.DistributedQueryElevationComponentTest-1393333900181/shard1/data/index/
   [junit4]   2> 666283 T2454 oasc.SolrCore.initIndex WARN [collection1] Solr index directory './org.apache.solr.handler.component.DistributedQueryElevationComponentTest-1393333900181/shard1/data/index' doesn't exist. Creating new index...
   [junit4]   2> 666283 T2454 oasc.CachingDirectoryFactory.get return new directory for ./org.apache.solr.handler.component.DistributedQueryElevationComponentTest-1393333900181/shard1/data/index
   [junit4]   2> 666284 T2454 oasu.RandomMergePolicy.<init> RandomMergePolicy wrapping class org.apache.lucene.index.LogDocMergePolicy: [LogDocMergePolicy: minMergeSize=1000, mergeFactor=39, maxMergeSize=9223372036854775807, maxMergeSizeForForcedMerge=9223372036854775807, calibrateSizeByDeletes=false, maxMergeDocs=2147483647, maxCFSSegmentSizeMB=8.796093022207999E12, noCFSRatio=1.0]
   [junit4]   2> 666285 T2454 oasc.SolrDeletionPolicy.onCommit SolrDeletionPolicy.onCommit: commits: num=1
   [junit4]   2> 		commit{dir=MockDirectoryWrapper(RAMDirectory@e8b01686 lockFactory=org.apache.lucene.store.SingleInstanceLockFactory@4850549f),segFN=segments_1,generation=1}
   [junit4]   2> 666285 T2454 oasc.SolrDeletionPolicy.updateCommits newest commit generation = 1
   [junit4]   2> 666288 T2454 oasc.SolrCore.loadUpdateProcessorChains no updateRequestProcessorChain defined as default, creating implicit default
   [junit4]   2> 666288 T2454 oasc.RequestHandlers.initHandlersFromConfig created /update: solr.UpdateRequestHandler
   [junit4]   2> 666289 T2454 oasc.RequestHandlers.initHandlersFromConfig created /elevate: org.apache.solr.handler.component.SearchHandler
   [junit4]   2> 666289 T2454 oasc.RequestHandlers.initHandlersFromConfig created /dataElevate: org.apache.solr.handler.component.SearchHandler
   [junit4]   2> 666291 T2454 oashl.XMLLoader.init xsltCacheLifetimeSeconds=60
   [junit4]   2> 666291 T2454 oasc.RequestHandlers.initHandlersFromConfig WARN no default request handler is registered (either '/select' or 'standard')
   [junit4]   2> 666292 T2454 oasc.SolrCore.initDeprecatedSupport WARN solrconfig.xml uses deprecated <admin/gettableFiles>, Please update your config to use the ShowFileRequestHandler.
   [junit4]   2> 666294 T2454 oasc.SolrCore.initDeprecatedSupport WARN adding ShowFileRequestHandler with hidden files: [SCHEMA-BINARYFIELD.XML, BAD-SCHEMA-CURRENCY-FT-MULTIVALUED.XML, BAD-SOLRCONFIG-SCHEMA-MUTABLE-BUT-NOT-MANAGED.XML, BAD-SCHEMA-UNIQUEKEY-IS-COPYFIELD-DEST.XML, SOLRCONFIG-QUERYSENDER.XML, KEEP-1.TXT, SOLRCONFIG-DELPOLICY1.XML, SOLRCONFIG-LAZYWRITER.XML, BAD-SCHEMA-CURRENCY-MULTIVALUED.XML, SCHEMA-EFF.XML, SCHEMA-COLLATEFILTER.XML, SOLRCONFIG-DEFAULTS.XML, SOLRCONFIG-POSTINGSHIGHLIGHT.XML, SOLRCONFIG-IMPLICITPROPERTIES.XML, KEEP-2.TXT, SOLRCONFIG-COMPONENTS-NAME.XML, HYPHENATION.DTD, SCHEMA15.XML, SCHEMA-SIM.XML, BAD-SCHEMA-OMIT-TF-BUT-NOT-POS.XML, SCHEMA-CHARFILTERS.XML, SCHEMA-BM25.XML, HUNSPELL-TEST.DIC, BAD-SCHEMA-CURRENCY-DYNAMIC-MULTIVALUED.XML, BAD-SCHEMA-SIM-GLOBAL-VS-FT-MISMATCH.XML, SOLRCONFIG-UPDATE-PROCESSOR-CHAINS.XML, SCHEMA-DOCVALUESFACETING.XML, SOLRCONFIG-TRANSFORMERS.XML, BAD-SOLRCONFIG-UNEXPECTED-SCHEMA-ATTRIBUTE.XML, BAD-SCHEMA-MISPLACED-ASTERISK-COPYFIELD-DEST-SHOULD-FAIL-TEST.XML, SOLRCONFIG-TERMINDEX.XML, STOPTYPES-2.TXT, BAD-SCHEMA-CURRENCY-FT-BOGUS-DEFAULT-CODE.XML, SOLRCONFIG-RESPONSE-LOG-COMPONENT.XML, SOLRCONFIG-MASTER1.XML, SCHEMA-SPATIAL.XML, SOLRCONFIG-LOGMERGEPOLICY.XML, SOLRCONFIG-MASTER.XML, FREETEXTSUGGEST.TXT, SCHEMA-REVERSED.XML, SCHEMA-SNIPPET-TYPE.XML, SOLRCONFIG.SNIPPET.RANDOMINDEXCONFIG.XML, BAD-SCHEMA-CURRENCY-FT-OER-NORATES.XML, SOLRCONFIG-SOLCOREPROPERTIES.XML, BAD-SCHEMA-EXTERNAL-FILEFIELD.XML, SCHEMA-ENUMS.XML, BAD-MP-SOLRCONFIG.XML, MISSING.FUNCTIONS.UPDATEPROCESSOR.JS, SOLRCONFIG-MASTER2.XML, SCHEMA-ID-AND-VERSION-FIELDS-ONLY.XML, SOLRCONFIG-DEEPPAGING.XML, SOLRCONFIG-SLAVE1.XML, SCHEMA-SPELLCHECKER.XML, BAD-SOLRCONFIG-INVALID-SCRIPTFILE.XML, SOLRCONFIG-QUERY-PARSER-INIT.XML, SCHEMA-XINCLUDE.XML, SCHEMA-POSTINGSHIGHLIGHT.XML, SCHEMA-TRIE.XML, SOLRCONFIG-COLLAPSEQPARSER.XML, BAD-SCHEMA-ANALYZER-CLASS-AND-NESTED.XML, STEMDICT.TXT, OPEN-EXCHANGE-RATES.JSON, STOPWORDSWRONGENCODING.TXT, JASUGGEST.TXT, BAD-SCHEMA-SWEETSPOT-BOTH-TF.XML, SOLRCONFIG-REQHANDLER.INCL, BAD-SOLRCONFIG-MISSING-SCRIPTFILE.XML, THROW.ERROR.ON.ADD.UPDATEPROCESSOR.JS, BAD_SOLRCONFIG.XML, BAD-SCHEMA-DYNAMICFIELD-REQUIRED.XML, SOLRCONFIG-ELEVATE.XML, PHRASESUGGEST.TXT, SOLRCONFIG-SOLR-749.XML, BAD-SOLRCONFIG-WARMER-NO-REOPEN.XML, BAD-SCHEMA-MULTIPLE-ASTERISK-COPYFIELD-SOURCE-SHOULD-FAIL-TEST.XML, BAD-SCHEMA-MULTIPLE-ASTERISK-COPYFIELD-DEST-SHOULD-FAIL-TEST.XML, SOLRCONFIG-PARSING-UPDATE-PROCESSOR-CHAINS.XML, SOLRCONFIG-ALTDIRECTORY.XML, SOLRCONFIG-MASTER1-KEEPONEBACKUP.XML, BAD-SCHEMA-BOGUS-FIELD-PARAMETERS.XML, MISSLEADING.EXTENSION.UPDATEPROCESSOR.JS.TXT, TRIVIAL.UPDATEPROCESSOR1.JS, ENUMSCONFIG.XML, CONDITIONAL.UPDATEPROCESSOR.JS, BAD-SCHEMA-NON-GLOB-COPYFIELD-SOURCE-MATCHING-NOTHING-SHOULD-FAIL-TEST.XML, SCHEMA-CUSTOMFIELD.XML, SCHEMA-REST.XML, SOLRCONFIG-PHRASESUGGEST.XML, SCHEMA-NUMERIC.XML, STOPWORDS.TXT, STOP-1.TXT, BAD-SCHEMA-NONTEXT-ANALYZER.XML, SCHEMA12.XML, SOLRCONFIG-REPEATER.XML, SCHEMA-LMDIRICHLET.XML, SOLRCONFIG_PERF.XML, MAPPING-ISOLATIN1ACCENT.TXT, BAD-SCHEMA-UNIQUEKEY-MULTIVALUED.XML, SCHEMA_CODEC.XML, SOLRCONFIG-MERGEPOLICY-LEGACY.XML, SOLRCONFIG-MINIMAL.XML, SCHEMA-ONE-FIELD-NO-DYNAMIC-FIELD-UNIQUE-KEY.XML, COMPOUNDDICTIONARY.TXT, BAD-SCHEMA-NOT-INDEXED-BUT-NORMS.XML, SCHEMA-TFIDF.XML, ANALYZINGINFIXSUGGEST.TXT, DA_UTF8.XML, BAD-SCHEMA-CODEC-GLOBAL-VS-FT-MISMATCH.XML, SOLRCONFIG-XINCLUDE.XML, XSLT, BAD-CURRENCY.XML, SOLRCONFIG-FUNCTIONQUERY.XML, HUNSPELL-TEST.AFF, TRIVIAL.UPDATEPROCESSOR0.JS, BAD-SCHEMA-DUP-FIELD.XML, SCHEMA-BEHAVIOR.XML, BAD-SCHEMA-NOT-INDEXED-BUT-TF.XML, SOLRCONFIG-SUGGESTERCOMPONENT.XML, FRENCHARTICLES.TXT, BAD-SCHEMA-SWEETSPOT-PARTIAL-BASELINE.XML, SOLRCONFIG-MERGEPOLICY-DEFAULTS.XML, SCHEMA-DFR.XML, SCHEMA-DISTRIBUTED-MISSING-SORT.XML, SCHEMA-PHRASESUGGEST.XML, SOLRCONFIG-SPELLCHECKER.XML, SCHEMA-REST-LUCENE-MATCH-VERSION.XML, SOLRCONFIG-INFOSTREAM-LOGGING.XML, SOLRCONFIG-HIGHLIGHT.XML, SCHEMA-SORTS.XML, BAD-SCHEMA-BOGUS-ANALYSIS-PARAMETERS.XML, BAD-SOLRCONFIG-BOGUS-SCRIPTENGINE-NAME.XML, CURRENCY.XML, SOLRCONFIG-TEST-MISC.XML, BAD-SCHEMA-CURRENCY-FT-BOGUS-CODE-IN-XML.XML, SCHEMA-SYNONYM-TOKENIZER.XML, SCHEMA-SWEETSPOT.XML, ELEVATE.XML, SOLRCONFIG-CACHING.XML, BAD-SOLRCONFIG-MULTIPLE-INDEXCONFIGS.XML, SCHEMA-DOCVALUESMULTI.XML, SYNONYMS.TXT, PROTWORDS.TXT, SOLRCONFIG-NOCACHE.XML, SOLRCONFIG-WARMER.XML, SCHEMA-STOP-KEEP.XML, SCHEMA-DOCVALUESMISSING.XML, SOLRCONFIG-NOOPREGEN.XML, BAD-SCHEMA-SWEETSPOT-PARTIAL-HYPERBOLIC.XML, SCHEMA-COPYFIELD-TEST.XML, ADDFIELDS.UPDATEPROCESSOR.JS, SCHEMA-ADD-SCHEMA-FIELDS-UPDATE-PROCESSOR.XML, BLENDEDINFIXSUGGEST.TXT, OLD_SYNONYMS.TXT, SOLRCONFIG-SLAVE.XML, SCHEMA-SNIPPET-TYPES.INCL, SOLRCONFIG-TLOG.XML, SOLRCONFIG_CODEC.XML, WDFTYPES.TXT, SOLRCONFIG-SPELLCHECKCOMPONENT.XML, SOLRCONFIG-DELPOLICY2.XML, SCHEMA-DOCVALUES.XML, SCHEMA-CUSTOM-FIELD.XML, SOLRCONFIG-QUERYSENDER-NOQUERY.XML, SCHEMA-SIMPLEQPPLUGIN.XML, SCHEMA-COLLATE-DV.XML, BAD-SOLRCONFIG-MULTIPLE-DIRFACTORY.XML, SCHEMA-IB.XML, STOPTYPES-1.TXT, SCHEMA-REPLICATION1.XML, SCHEMA-NOT-REQUIRED-UNIQUE-KEY.XML, STOPWITHBOM.TXT, SOLRCONFIG-BASIC.XML, SOLRCONFIG-BASIC-LUCENEVERSION31.XML, BAD-SOLRCONFIG-MULTIPLE-CFS.XML, BAD-SCHEMA-UNSUPPORTED-DOCVALUES.XML, REGEX-BOOST-PROCESSOR-TEST.TXT, SOLRCONFIG-MASTER3.XML, BAD-SCHEMA-SWEETSPOT-PARTIAL-NORMS.XML, BAD-SCHEMA-DYNAMICFIELD-DEFAULT-VAL.XML, FUZZYSUGGEST.TXT, SCHEMA-REQUIRED-FIELDS.XML, SCHEMA-FOLDING.XML, SCHEMA11.XML, SOLRCONFIG-SNIPPET-PROCESSOR.XML, SCHEMA-MINIMAL.XML, SOLRCONFIG-INDEXCONFIG.XML, BAD-SCHEMA-MISPLACED-ASTERISK-COPYFIELD-SOURCE-SHOULD-FAIL-TEST.XML, SCHEMA-COLLATE.XML, SOLRCONFIG-MANAGED-SCHEMA.XML, SCHEMA-LMJELINEKMERCER.XML, SOLRCONFIG-ADD-SCHEMA-FIELDS-UPDATE-PROCESSOR-CHAINS.XML, .SVN, SOLRCONFIG-SCRIPT-UPDATEPROCESSOR.XML, STOP-2.TXT, SCHEMA-SNIPPET-FIELD.XML, BAD-SOLRCONFIG-MANAGED-SCHEMA-NAMED-SCHEMA.XML.XML, BAD-SCHEMA-DUP-FIELDTYPE.XML, DA_COMPOUNDDICTIONARY.TXT, SCHEMA-ONE-FIELD-NO-DYNAMIC-FIELD.XML, SCHEMA-CLASS-NAME-SHORTENING-ON-SERIALIZATION.XML, SOLRCONFIG-EXTERNALVERSIONCONSTRAINT.XML, SOLRCONFIG-TIEREDMERGEPOLICY.XML, SCHEMASURROUND.XML, BAD-SCHEMA-UNIQUEKEY-USES-DEFAULT.XML, SCHEMA-REPLICATION2.XML, BAD-SCHEMA-NOT-INDEXED-BUT-POS.XML, STOP-SNOWBALL.TXT, SCHEMA-TINY.XML, BAD-SCHEMA-DUP-DYNAMICFIELD.XML, SCHEMA-LUCENEMATCHVERSION.XML]
   [junit4]   2> 666295 T2454 oasu.CommitTracker.<init> Hard AutoCommit: disabled
   [junit4]   2> 666295 T2454 oasu.CommitTracker.<init> Soft AutoCommit: disabled
   [junit4]   2> 666296 T2454 oasu.RandomMergePolicy.<init> RandomMergePolicy wrapping class org.apache.lucene.index.LogDocMergePolicy: [LogDocMergePolicy: minMergeSize=1000, mergeFactor=39, maxMergeSize=9223372036854775807, maxMergeSizeForForcedMerge=9223372036854775807, calibrateSizeByDeletes=false, maxMergeDocs=2147483647, maxCFSSegmentSizeMB=8.796093022207999E12, noCFSRatio=1.0]
   [junit4]   2> 666297 T2454 oasc.SolrDeletionPolicy.onInit SolrDeletionPolicy.onInit: commits: num=1
   [junit4]   2> 		commit{dir=MockDirectoryWrapper(RAMDirectory@e8b01686 lockFactory=org.apache.lucene.store.SingleInstanceLockFactory@4850549f),segFN=segments_1,generation=1}
   [junit4]   2> 666297 T2454 oasc.SolrDeletionPolicy.updateCommits newest commit generation = 1
   [junit4]   2> 666298 T2454 oass.SolrIndexSearcher.<init> Opening Searcher@6e57c950[collection1] main
   [junit4]   2> 666298 T2454 oashc.QueryElevationComponent.inform Loading QueryElevation from: /mnt/ssd/jenkins/workspace/Lucene-Solr-4.x-Linux/solr/core/src/test-files/solr/collection1/conf/elevate.xml
   [junit4]   2> 666311 T2454 oashc.QueryElevationComponent.inform Loading QueryElevation from: /mnt/ssd/jenkins/workspace/Lucene-Solr-4.x-Linux/solr/core/src/test-files/solr/collection1/conf/elevate.xml
   [junit4]   2> 666322 T2455 oasc.SolrCore.registerSearcher [collection1] Registered new searcher Searcher@6e57c950[collection1] main{StandardDirectoryReader(segments_1:1:nrt)}
   [junit4]   2> 666324 T2454 oasc.CoreContainer.registerCore registering core: collection1
   [junit4]   2> 666325 T2420 oass.SolrDispatchFilter.init user.dir=/mnt/ssd/jenkins/workspace/Lucene-Solr-4.x-Linux/solr/build/solr-core/test/J0
   [junit4]   2> 666326 T2420 oass.SolrDispatchFilter.init SolrDispatchFilter.init() done
   [junit4]   2> 666327 T2420 oejs.Server.doStart jetty-8.1.10.v20130312
   [junit4]   2> 666329 T2420 oejs.AbstractConnector.doStart Started SelectChannelConnector@127.0.0.1:?????
   [junit4]   2> 666329 T2420 oass.SolrDispatchFilter.init SolrDispatchFilter.init()
   [junit4]   2> 666330 T2420 oasc.SolrResourceLoader.locateSolrHome JNDI not configured for solr (NoInitialContextEx)
   [junit4]   2> 666331 T2420 oasc.SolrResourceLoader.locateSolrHome using system property solr.solr.home: /mnt/ssd/jenkins/workspace/Lucene-Solr-4.x-Linux/solr/core/src/test-files/solr
   [junit4]   2> 666331 T2420 oasc.SolrResourceLoader.<init> new SolrResourceLoader for directory: '/mnt/ssd/jenkins/workspace/Lucene-Solr-4.x-Linux/solr/core/src/test-files/solr/'
   [junit4]   2> 666339 T2420 oasc.ConfigSolr.fromFile Loading container configuration from /mnt/ssd/jenkins/workspace/Lucene-Solr-4.x-Linux/solr/core/src/test-files/solr/solr.xml
   [junit4]   2> 666374 T2420 oasc.CoreContainer.<init> New CoreContainer -1838551135
   [junit4]   2> 666374 T2420 oasc.CoreContainer.load Loading cores into CoreContainer [instanceDir=/mnt/ssd/jenkins/workspace/Lucene-Solr-4.x-Linux/solr/core/src/test-files/solr/]
   [junit4]   2> 666376 T2420 oashc.HttpShardHandlerFactory.getParameter Setting socketTimeout to: 90000
   [junit4]   2> 666376 T2420 oashc.HttpShardHandlerFactory.getParameter Setting urlScheme to: 
   [junit4]   2> 666377 T2420 oashc.HttpShardHandlerFactory.getParameter Setting connTimeout to: 15000
   [junit4]   2> 666377 T2420 oashc.HttpShardHandlerFactory.getParameter Setting maxConnectionsPerHost to: 20
   [junit4]   2> 666378 T2420 oashc.HttpShardHandlerFactory.getParameter Setting corePoolSize to: 0
   [junit4]   2> 666378 T2420 oashc.HttpShardHandlerFactory.getParameter Setting maximumPoolSize to: 2147483647
   [junit4]   2> 666379 T2420 oashc.HttpShardHandlerFactory.getParameter Setting maxThreadIdleTime to: 5
   [junit4]   2> 666379 T2420 oashc.HttpShardHandlerFactory.getParameter Setting sizeOfQueue to: -1
   [junit4]   2> 666380 T2420 oashc.HttpShardHandlerFactory.getParameter Setting fairnessPolicy to: false
   [junit4]   2> 666383 T2420 oasl.LogWatcher.createWatcher SLF4J impl is org.slf4j.impl.Log4jLoggerFactory
   [junit4]   2> 666384 T2420 oasl.LogWatcher.newRegisteredLogWatcher Registering Log Listener [Log4j (org.slf4j.impl.Log4jLoggerFactory)]
   [junit4]   2> 666385 T2420 oasc.CoreContainer.load Host Name: 127.0.0.1
   [junit4]   2> 666388 T2466 oasc.CoreContainer.create Creating SolrCore 'collection1' using instanceDir: /mnt/ssd/jenkins/workspace/Lucene-Solr-4.x-Linux/solr/core/src/test-files/solr/collection1
   [junit4]   2> 666388 T2466 oasc.SolrResourceLoader.<init> new SolrResourceLoader for directory: '/mnt/ssd/jenkins/workspace/Lucene-Solr-4.x-Linux/solr/core/src/test-files/solr/collection1/'
   [junit4]   2> 666389 T2466 oasc.SolrResourceLoader.replaceClassLoader Adding 'file:/mnt/ssd/jenkins/workspace/Lucene-Solr-4.x-Linux/solr/core/src/test-files/solr/collection1/lib/.svn/' to classloader
   [junit4]   2> 666390 T2466 oasc.SolrResourceLoader.replaceClassLoader Adding 'file:/mnt/ssd/jenkins/workspace/Lucene-Solr-4.x-Linux/solr/core/src/test-files/solr/collection1/lib/classes/' to classloader
   [junit4]   2> 666390 T2466 oasc.SolrResourceLoader.replaceClassLoader Adding 'file:/mnt/ssd/jenkins/workspace/Lucene-Solr-4.x-Linux/solr/core/src/test-files/solr/collection1/lib/README' to classloader
   [junit4]   2> 666421 T2466 oasc.SolrConfig.<init> Using Lucene MatchVersion: LUCENE_48
   [junit4]   2> 666459 T2466 oasc.SolrConfig.<init> Loaded SolrConfig: solrconfig-elevate.xml
   [junit4]   2> 666460 T2466 oass.IndexSchema.readSchema Reading Solr Schema from schema11.xml
   [junit4]   2> 666471 T2466 oass.IndexSchema.readSchema [collection1] Schema name=example
   [junit4]   2> 666598 T2466 oass.IndexSchema.readSchema default search field in schema is text
   [junit4]   2> 666600 T2466 oass.IndexSchema.readSchema unique key field: id
   [junit4]   2> 666604 T2466 oasc.SolrCore.initDirectoryFactory org.apache.solr.core.MockDirectoryFactory
   [junit4]   2> 666604 T2466 oasc.SolrCore.<init> [collection1] Opening new SolrCore at /mnt/ssd/jenkins/workspace/Lucene-Solr-4.x-Linux/solr/core/src/test-files/solr/collection1/, dataDir=./org.apache.solr.handler.component.DistributedQueryElevationComponentTest-1393333900181/shard2/data/
   [junit4]   2> 666604 T2466 oasc.JmxMonitoredMap.<init> JMX monitoring is enabled. Adding Solr mbeans to JMX Server: com.sun.jmx.mbeanserver.JmxMBeanServer@bf1810d7
   [junit4]   2> 666605 T2466 oasc.CachingDirectoryFactory.get return new directory for ./org.apache.solr.handler.component.DistributedQueryElevationComponentTest-1393333900181/shard2/data
   [junit4]   2> 666606 T2466 oasc.SolrCore.getNewIndexDir New index directory detected: old=null new=./org.apache.solr.handler.component.DistributedQueryElevationComponentTest-1393333900181/shard2/data/index/
   [junit4]   2> 666606 T2466 oasc.SolrCore.initIndex WARN [collection1] Solr index directory './org.apache.solr.handler.component.DistributedQueryElevationComponentTest-1393333900181/shard2/data/index' doesn't exist. Creating new index...
   [junit4]   2> 666606 T2466 oasc.CachingDirectoryFactory.get return new directory for ./org.apache.solr.handler.component.DistributedQueryElevationComponentTest-1393333900181/shard2/data/index
   [junit4]   2> 666607 T2466 oasu.RandomMergePolicy.<init> RandomMergePolicy wrapping class org.apache.lucene.index.LogDocMergePolicy: [LogDocMergePolicy: minMergeSize=1000, mergeFactor=39, maxMergeSize=9223372036854775807, maxMergeSizeForForcedMerge=9223372036854775807, calibrateSizeByDeletes=false, maxMergeDocs=2147483647, maxCFSSegmentSizeMB=8.796093022207999E12, noCFSRatio=1.0]
   [junit4]   2> 666608 T2466 oasc.SolrDeletionPolicy.onCommit SolrDeletionPolicy.onCommit: commits: num=1
   [junit4]   2> 		commit{dir=MockDirectoryWrapper(RAMDirectory@d514631b lockFactory=org.apache.lucene.store.SingleInstanceLockFactory@7885b23d),segFN=segments_1,generation=1}
   [junit4]   2> 666608 T2466 oasc.SolrDeletionPolicy.updateCommits newest commit generation = 1
   [junit4]   2> 666611 T2466 oasc.SolrCore.loadUpdateProcessorChains no updateRequestProcessorChain defined as default, creating implicit default
   [junit4]   2> 666611 T2466 oasc.RequestHandlers.initHandlersFromConfig created /update: solr.UpdateRequestHandler
   [junit4]   2> 666612 T2466 oasc.RequestHandlers.initHandlersFromConfig created /elevate: org.apache.solr.handler.component.SearchHandler
   [junit4]   2> 666612 T2466 oasc.RequestHandlers.initHandlersFromConfig created /dataElevate: org.apache.solr.handler.component.SearchHandler
   [junit4]   2> 666614 T2466 oashl.XMLLoader.init xsltCacheLifetimeSeconds=60
   [junit4]   2> 666614 T2466 oasc.RequestHandlers.initHandlersFromConfig WARN no default request handler is registered (either '/select' or 'standard')
   [junit4]   2> 666615 T2466 oasc.SolrCore.initDeprecatedSupport WARN solrconfig.xml uses deprecated <admin/gettableFiles>, Please update your config to use the ShowFileRequestHandler.
   [junit4]   2> 666616 T2466 oasc.SolrCore.initDeprecatedSupport WARN adding ShowFileRequestHandler with hidden files: [SOLRCONFIG-PHRASESUGGEST.XML, STOP-1.TXT, STOPWORDS.TXT, SCHEMA-NUMERIC.XML, SOLRCONFIG-REPEATER.XML, BAD-SCHEMA-NONTEXT-ANALYZER.XML, SCHEMA12.XML, SCHEMA_CODEC.XML, SOLRCONFIG_PERF.XML, MAPPING-ISOLATIN1ACCENT.TXT, BAD-SCHEMA-UNIQUEKEY-MULTIVALUED.XML, SCHEMA-LMDIRICHLET.XML, BAD-SCHEMA-MULTIPLE-ASTERISK-COPYFIELD-DEST-SHOULD-FAIL-TEST.XML, BAD-SCHEMA-MULTIPLE-ASTERISK-COPYFIELD-SOURCE-SHOULD-FAIL-TEST.XML, SOLRCONFIG-SOLR-749.XML, BAD-SOLRCONFIG-WARMER-NO-REOPEN.XML, SOLRCONFIG-ELEVATE.XML, PHRASESUGGEST.TXT, BAD-SCHEMA-BOGUS-FIELD-PARAMETERS.XML, SOLRCONFIG-ALTDIRECTORY.XML, SOLRCONFIG-MASTER1-KEEPONEBACKUP.XML, SOLRCONFIG-PARSING-UPDATE-PROCESSOR-CHAINS.XML, TRIVIAL.UPDATEPROCESSOR1.JS, MISSLEADING.EXTENSION.UPDATEPROCESSOR.JS.TXT, BAD-SCHEMA-NON-GLOB-COPYFIELD-SOURCE-MATCHING-NOTHING-SHOULD-FAIL-TEST.XML, SCHEMA-CUSTOMFIELD.XML, SCHEMA-REST.XML, CONDITIONAL.UPDATEPROCESSOR.JS, ENUMSCONFIG.XML, STOPWORDSWRONGENCODING.TXT, OPEN-EXCHANGE-RATES.JSON, STEMDICT.TXT, SOLRCONFIG-REQHANDLER.INCL, BAD-SCHEMA-SWEETSPOT-BOTH-TF.XML, JASUGGEST.TXT, BAD_SOLRCONFIG.XML, BAD-SCHEMA-DYNAMICFIELD-REQUIRED.XML, THROW.ERROR.ON.ADD.UPDATEPROCESSOR.JS, BAD-SOLRCONFIG-MISSING-SCRIPTFILE.XML, SOLRCONFIG-SLAVE1.XML, SOLRCONFIG-QUERY-PARSER-INIT.XML, SCHEMA-SPELLCHECKER.XML, BAD-SOLRCONFIG-INVALID-SCRIPTFILE.XML, SCHEMA-XINCLUDE.XML, SCHEMA-POSTINGSHIGHLIGHT.XML, SOLRCONFIG-COLLAPSEQPARSER.XML, BAD-SCHEMA-ANALYZER-CLASS-AND-NESTED.XML, SCHEMA-TRIE.XML, SOLRCONFIG-SOLCOREPROPERTIES.XML, BAD-SCHEMA-EXTERNAL-FILEFIELD.XML, BAD-SCHEMA-CURRENCY-FT-OER-NORATES.XML, SCHEMA-ENUMS.XML, BAD-MP-SOLRCONFIG.XML, SCHEMA-ID-AND-VERSION-FIELDS-ONLY.XML, SOLRCONFIG-MASTER2.XML, MISSING.FUNCTIONS.UPDATEPROCESSOR.JS, SOLRCONFIG-DEEPPAGING.XML, BAD-SCHEMA-CURRENCY-DYNAMIC-MULTIVALUED.XML, BAD-SCHEMA-SIM-GLOBAL-VS-FT-MISMATCH.XML, SOLRCONFIG-UPDATE-PROCESSOR-CHAINS.XML, SCHEMA-DOCVALUESFACETING.XML, SOLRCONFIG-TRANSFORMERS.XML, SCHEMA-BM25.XML, HUNSPELL-TEST.DIC, SCHEMA-CHARFILTERS.XML, BAD-SCHEMA-MISPLACED-ASTERISK-COPYFIELD-DEST-SHOULD-FAIL-TEST.XML, SOLRCONFIG-TERMINDEX.XML, BAD-SOLRCONFIG-UNEXPECTED-SCHEMA-ATTRIBUTE.XML, SOLRCONFIG-LOGMERGEPOLICY.XML, SOLRCONFIG-MASTER1.XML, SCHEMA-SPATIAL.XML, SOLRCONFIG-RESPONSE-LOG-COMPONENT.XML, STOPTYPES-2.TXT, BAD-SCHEMA-CURRENCY-FT-BOGUS-DEFAULT-CODE.XML, SCHEMA-SNIPPET-TYPE.XML, SOLRCONFIG.SNIPPET.RANDOMINDEXCONFIG.XML, FREETEXTSUGGEST.TXT, SCHEMA-REVERSED.XML, SOLRCONFIG-MASTER.XML, SOLRCONFIG-LAZYWRITER.XML, BAD-SCHEMA-CURRENCY-MULTIVALUED.XML, SCHEMA-EFF.XML, SCHEMA-COLLATEFILTER.XML, SOLRCONFIG-DELPOLICY1.XML, SOLRCONFIG-DEFAULTS.XML, SOLRCONFIG-POSTINGSHIGHLIGHT.XML, SOLRCONFIG-IMPLICITPROPERTIES.XML, KEEP-2.TXT, SOLRCONFIG-COMPONENTS-NAME.XML, SCHEMA15.XML, HYPHENATION.DTD, BAD-SCHEMA-OMIT-TF-BUT-NOT-POS.XML, SCHEMA-SIM.XML, SCHEMA-BINARYFIELD.XML, BAD-SCHEMA-CURRENCY-FT-MULTIVALUED.XML, BAD-SOLRCONFIG-SCHEMA-MUTABLE-BUT-NOT-MANAGED.XML, KEEP-1.TXT, BAD-SCHEMA-UNIQUEKEY-IS-COPYFIELD-DEST.XML, SOLRCONFIG-QUERYSENDER.XML, SOLRCONFIG-EXTERNALVERSIONCONSTRAINT.XML, SCHEMA-ONE-FIELD-NO-DYNAMIC-FIELD.XML, SCHEMA-CLASS-NAME-SHORTENING-ON-SERIALIZATION.XML, DA_COMPOUNDDICTIONARY.TXT, SCHEMASURROUND.XML, SOLRCONFIG-TIEREDMERGEPOLICY.XML, SCHEMA-REPLICATION2.XML, BAD-SCHEMA-UNIQUEKEY-USES-DEFAULT.XML, BAD-SCHEMA-DUP-DYNAMICFIELD.XML, SCHEMA-LUCENEMATCHVERSION.XML, SCHEMA-TINY.XML, BAD-SCHEMA-NOT-INDEXED-BUT-POS.XML, STOP-SNOWBALL.TXT, SOLRCONFIG-INDEXCONFIG.XML, BAD-SCHEMA-MISPLACED-ASTERISK-COPYFIELD-SOURCE-SHOULD-FAIL-TEST.XML, SCHEMA-MINIMAL.XML, SOLRCONFIG-ADD-SCHEMA-FIELDS-UPDATE-PROCESSOR-CHAINS.XML, SOLRCONFIG-MANAGED-SCHEMA.XML, SCHEMA-LMJELINEKMERCER.XML, SCHEMA-COLLATE.XML, .SVN, SOLRCONFIG-SCRIPT-UPDATEPROCESSOR.XML, BAD-SCHEMA-DUP-FIELDTYPE.XML, SCHEMA-SNIPPET-FIELD.XML, BAD-SOLRCONFIG-MANAGED-SCHEMA-NAMED-SCHEMA.XML.XML, STOP-2.TXT, REGEX-BOOST-PROCESSOR-TEST.TXT, BAD-SOLRCONFIG-MULTIPLE-CFS.XML, BAD-SCHEMA-UNSUPPORTED-DOCVALUES.XML, SOLRCONFIG-BASIC-LUCENEVERSION31.XML, SOLRCONFIG-BASIC.XML, BAD-SCHEMA-DYNAMICFIELD-DEFAULT-VAL.XML, BAD-SCHEMA-SWEETSPOT-PARTIAL-NORMS.XML, SOLRCONFIG-MASTER3.XML, SOLRCONFIG-SNIPPET-PROCESSOR.XML, SCHEMA-FOLDING.XML, SCHEMA11.XML, FUZZYSUGGEST.TXT, SCHEMA-REQUIRED-FIELDS.XML, SCHEMA-SNIPPET-TYPES.INCL, SOLRCONFIG-TLOG.XML, SOLRCONFIG-SLAVE.XML, OLD_SYNONYMS.TXT, BLENDEDINFIXSUGGEST.TXT, SCHEMA-CUSTOM-FIELD.XML, SOLRCONFIG-DELPOLICY2.XML, SCHEMA-DOCVALUES.XML, SOLRCONFIG_CODEC.XML, WDFTYPES.TXT, SOLRCONFIG-SPELLCHECKCOMPONENT.XML, BAD-SOLRCONFIG-MULTIPLE-DIRFACTORY.XML, SCHEMA-IB.XML, SCHEMA-COLLATE-DV.XML, SOLRCONFIG-QUERYSENDER-NOQUERY.XML, SCHEMA-SIMPLEQPPLUGIN.XML, STOPWITHBOM.TXT, SCHEMA-NOT-REQUIRED-UNIQUE-KEY.XML, SCHEMA-REPLICATION1.XML, STOPTYPES-1.TXT, SYNONYMS.TXT, PROTWORDS.TXT, SCHEMA-DOCVALUESMULTI.XML, BAD-SOLRCONFIG-MULTIPLE-INDEXCONFIGS.XML, SOLRCONFIG-NOOPREGEN.XML, SCHEMA-STOP-KEEP.XML, SCHEMA-DOCVALUESMISSING.XML, SOLRCONFIG-NOCACHE.XML, SOLRCONFIG-WARMER.XML, BAD-SCHEMA-SWEETSPOT-PARTIAL-HYPERBOLIC.XML, SCHEMA-ADD-SCHEMA-FIELDS-UPDATE-PROCESSOR.XML, ADDFIELDS.UPDATEPROCESSOR.JS, SCHEMA-COPYFIELD-TEST.XML, SOLRCONFIG-HIGHLIGHT.XML, SCHEMA-SORTS.XML, CURRENCY.XML, BAD-SOLRCONFIG-BOGUS-SCRIPTENGINE-NAME.XML, BAD-SCHEMA-BOGUS-ANALYSIS-PARAMETERS.XML, SCHEMA-SYNONYM-TOKENIZER.XML, SCHEMA-SWEETSPOT.XML, BAD-SCHEMA-CURRENCY-FT-BOGUS-CODE-IN-XML.XML, SOLRCONFIG-TEST-MISC.XML, SOLRCONFIG-CACHING.XML, ELEVATE.XML, HUNSPELL-TEST.AFF, SOLRCONFIG-FUNCTIONQUERY.XML, BAD-CURRENCY.XML, SCHEMA-BEHAVIOR.XML, BAD-SCHEMA-NOT-INDEXED-BUT-TF.XML, SOLRCONFIG-SUGGESTERCOMPONENT.XML, TRIVIAL.UPDATEPROCESSOR0.JS, BAD-SCHEMA-DUP-FIELD.XML, BAD-SCHEMA-SWEETSPOT-PARTIAL-BASELINE.XML, FRENCHARTICLES.TXT, SOLRCONFIG-SPELLCHECKER.XML, SCHEMA-REST-LUCENE-MATCH-VERSION.XML, SOLRCONFIG-INFOSTREAM-LOGGING.XML, SCHEMA-DISTRIBUTED-MISSING-SORT.XML, SCHEMA-PHRASESUGGEST.XML, SOLRCONFIG-MERGEPOLICY-DEFAULTS.XML, SCHEMA-DFR.XML, SOLRCONFIG-MERGEPOLICY-LEGACY.XML, SCHEMA-ONE-FIELD-NO-DYNAMIC-FIELD-UNIQUE-KEY.XML, SOLRCONFIG-MINIMAL.XML, BAD-SCHEMA-NOT-INDEXED-BUT-NORMS.XML, SCHEMA-TFIDF.XML, ANALYZINGINFIXSUGGEST.TXT, COMPOUNDDICTIONARY.TXT, SOLRCONFIG-XINCLUDE.XML, XSLT, DA_UTF8.XML, BAD-SCHEMA-CODEC-GLOBAL-VS-FT-MISMATCH.XML]
   [junit4]   2> 666618 T2466 oasu.CommitTracker.<init> Hard AutoCommit: disabled
   [junit4]   2> 666618 T2466 oasu.CommitTracker.<init> Soft AutoCommit: disabled
   [junit4]   2> 666619 T2466 oasu.RandomMergePolicy.<init> RandomMergePolicy wrapping class org.apache.lucene.index.LogDocMergePolicy: [LogDocMergePolicy: minMergeSize=1000, mergeFactor=39, maxMergeSize=9223372036854775807, maxMergeSizeForForcedMerge=9223372036854775807, calibrateSizeByDeletes=false, maxMergeDocs=2147483647, maxCFSSegmentSizeMB=8.796093022207999E12, noCFSRatio=1.0]
   [junit4]   2> 666620 T2466 oasc.SolrDeletionPolicy.onInit SolrDeletionPolicy.onInit: commits: num=1
   [junit4]   2> 		commit{dir=MockDirectoryWrapper(RAMDirectory@d514631b lockFactory=org.apache.lucene.store.SingleInstanceLockFactory@7885b23d),segFN=segments_1,generation=1}
   [junit4]   2> 666620 T2466 oasc.SolrDeletionPolicy.updateCommits newest commit generation = 1
   [junit4]   2> 666621 T2466 oass.SolrIndexSearcher.<init> Opening Searcher@ff01c23d[collection1] main
   [junit4]   2> 666621 T2466 oashc.QueryElevationComponent.inform Loading QueryElevation from: /mnt/ssd/jenkins/workspace/Lucene-Solr-4.x-Linux/solr/core/src/test-files/solr/collection1/conf/elevate.xml
   [junit4]   2> 666630 T2466 oashc.QueryElevationComponent.inform Loading QueryElevation from: /mnt/ssd/jenkins/workspace/Lucene-Solr-4.x-Linux/solr/core/src/test-files/solr/collection1/conf/elevate.xml
   [junit4]   2> 666640 T2467 oasc.SolrCore.registerSearcher [collection1] Registered new searcher Searcher@ff01c23d[collection1] main{StandardDirectoryReader(segments_1:1:nrt)}
   [junit4]   2> 666642 T2466 oasc.CoreContainer.registerCore registering core: collection1
   [junit4]   2> 666643 T2420 oass.SolrDispatchFilter.init user.dir=/mnt/ssd/jenkins/workspace/Lucene-Solr-4.x-Linux/solr/build/solr-core/test/J0
   [junit4]   2> 666644 T2420 oass.SolrDispatchFilter.init SolrDispatchFilter.init() done
   [junit4]   2> ASYNC  NEW_CORE C578 name=collection1 org.apache.solr.core.SolrCore@41c10b56
   [junit4]   2> 666828 T2426 C578 oasu.DirectUpdateHandler2.deleteAll [collection1] REMOVING ALL DOCUMENTS FROM INDEX
   [junit4]   2> 666829 T2426 C578 oasup.LogUpdateProcessor.finish [collection1] webapp= path=/update params={version=2&wt=javabin} {deleteByQuery=*:*} 0 183
   [junit4]   2> ASYNC  NEW_CORE C579 name=collection1 org.apache.solr.core.SolrCore@b6e5e668
   [junit4]   2> 666890 T2439 C579 oasu.DirectUpdateHandler2.deleteAll [collection1] REMOVING ALL DOCUMENTS FROM INDEX
   [junit4]   2> 666890 T2439 C579 oasup.LogUpdateProcessor.finish [collection1] webapp= path=/update params={version=2&wt=javabin} {deleteByQuery=*:*} 0 1
   [junit4]   2> ASYNC  NEW_CORE C580 name=collection1 org.apache.solr.core.SolrCore@40d5e7b5
   [junit4]   2> 666892 T2452 C580 oasu.DirectUpdateHandler2.deleteAll [collection1] REMOVING ALL DOCUMENTS FROM INDEX
   [junit4]   2> 666893 T2452 C580 oasup.LogUpdateProcessor.finish [collection1] webapp= path=/update params={version=2&wt=javabin} {deleteByQuery=*:*} 0 1
   [junit4]   2> ASYNC  NEW_CORE C581 name=collection1 org.apache.solr.core.SolrCore@69647768
   [junit4]   2> 666895 T2464 C581 oasu.DirectUpdateHandler2.deleteAll [collection1] REMOVING ALL DOCUMENTS FROM INDEX
   [junit4]   2> 666896 T2464 C581 oasup.LogUpdateProcessor.finish [collection1] webapp= path=/update params={wt=javabin&version=2} {deleteByQuery=*:*} 0 2
   [junit4]   2> 666899 T2427 C578 oasup.LogUpdateProcessor.finish [collection1] webapp= path=/update params={wt=javabin&version=2} {add=[1]} 0 1
   [junit4]   2> 666903 T2438 C579 oasup.LogUpdateProcessor.finish [collection1] webapp= path=/update params={wt=javabin&version=2} {add=[1]} 0 2
   [junit4]   2> 666906 T2429 C578 oasup.LogUpdateProcessor.finish [collection1] webapp= path=/update params={wt=javabin&version=2} {add=[2]} 0 1
   [junit4]   2> 666910 T2453 C580 oasup.LogUpdateProcessor.finish [collection1] webapp= path=/update params={wt=javabin&version=2} {add=[2]} 0 1
   [junit4]   2> 666913 T2428 C578 oasup.LogUpdateProcessor.finish [collection1] webapp= path=/update params={version=2&wt=javabin} {add=[3]} 0 1
   [junit4]   2> 666917 T2465 C581 oasup.LogUpdateProcessor.finish [collection1] webapp= path=/update params={version=2&wt=javabin} {add=[3]} 0 1
   [junit4]   2> 666919 T2426 C578 oasup.LogUpdateProcessor.finish [collection1] webapp= path=/update params={wt=javabin&version=2} {add=[4]} 0 0
   [junit4]   2> 666922 T2440 C579 oasup.LogUpdateProcessor.finish [collection1] webapp= path=/update params={version=2&wt=javabin} {add=[4]} 0 0
   [junit4]   2> 666924 T2427 C578 oasup.LogUpdateProcessor.finish [collection1] webapp= path=/update params={wt=javabin&version=2} {add=[5]} 0 0
   [junit4]   2> 666927 T2450 C580 oasup.LogUpdateProcessor.finish [collection1] webapp= path=/update params={version=2&wt=javabin} {add=[5]} 0 0
   [junit4]   2> 666930 T2429 C578 oasup.LogUpdateProcessor.finish [collection1] webapp= path=/update params={version=2&wt=javabin} {add=[6]} 0 1
   [junit4]   2> 666932 T2462 C581 oasup.LogUpdateProcessor.finish [collection1] webapp= path=/update params={version=2&wt=javabin} {add=[6]} 0 0
   [junit4]   2> 666935 T2428 C578 oasup.LogUpdateProcessor.finish [collection1] webapp= path=/update params={wt=javabin&version=2} {add=[7]} 0 1
   [junit4]   2> 666937 T2463 C581 oasup.LogUpdateProcessor.finish [collection1] webapp= path=/update params={wt=javabin&version=2} {add=[7]} 0 0
   [junit4]   2> 666939 T2426 C578 oasu.DirectUpdateHandler2.commit start commit{,optimize=false,openSearcher=true,waitSearcher=true,expungeDeletes=false,softCommit=false,prepareCommit=false}
   [junit4]   2> 666941 T2426 C578 oasc.SolrDeletionPolicy.onCommit SolrDeletionPolicy.onCommit: commits: num=2
   [junit4]   2> 		commit{dir=MockDirectoryWrapper(RAMDirectory@1b768ad4 lockFactory=org.apache.lucene.store.SingleInstanceLockFactory@c409e279),segFN=segments_1,generation=1}
   [junit4]   2> 		commit{dir=MockDirectoryWrapper(RAMDirectory@1b768ad4 lockFactory=org.apache.lucene.store.SingleInstanceLockFactory@c409e279),segFN=segments_2,generation=2}
   [junit4]   2> 666942 T2426 C578 oasc.SolrDeletionPolicy.updateCommits newest commit generation = 2
   [junit4]   2> 666943 T2426 C578 oass.SolrIndexSearcher.<init> Opening Searcher@d604f309[collection1] main
   [junit4]   2> 666944 T2426 C578 oasu.DirectUpdateHandler2.commit end_commit_flush
   [junit4]   2> 666945 T2431 oasc.SolrCore.registerSearcher [collection1] Registered new searcher Searcher@d604f309[collection1] main{StandardDirectoryReader(segments_2:4:nrt _0(4.8):C7)}
   [junit4]   2> 666946 T2426 C578 oasup.LogUpdateProcessor.finish [collection1] webapp= path=/update params={commit=true&waitSearcher=true&wt=javabin&softCommit=false&version=2} {commit=} 0 7
   [junit4]   2> 666948 T2441 C579 oasu.DirectUpdateHandler2.commit start commit{,optimize=false,openSearcher=true,waitSearcher=true,expungeDeletes=false,softCommit=false,prepareCommit=false}
   [junit4]   2> 666949 T2441 C579 oasc.SolrDeletionPolicy.onCommit SolrDeletionPolicy.onCommit: commits: num=2
   [junit4]   2> 		commit{dir=MockDirectoryWrapper(RAMDirectory@75915485 lockFactory=org.apache.lucene.store.SingleInstanceLockFactory@2b832791),segFN=segments_1,generation=1}
   [junit4]   2> 		commit{dir=MockDirectoryWrapper(RAMDirectory@75915485 lockFactory=org.apache.lucene.store.SingleInstanceLockFactory@2b832791),segFN=segments_2,generation=2}
   [junit4]   2> 666950 T2441 C579 oasc.SolrDeletionPolicy.updateCommits newest commit generation = 2
   [junit4]   2> 667001 T2441 C579 oass.SolrIndexSearcher.<init> Opening Searcher@3b6eb944[collection1] main
   [junit4]   2> 667002 T2441 C579 oasu.DirectUpdateHandler2.commit end_commit_flush
   [junit4]   2> 667004 T2443 oasc.SolrCore.registerSearcher [collection1] Registered new searcher Searcher@3b6eb944[collection1] main{StandardDirectoryReader(segments_2:4:nrt _0(4.8):C2)}
   [junit4]   2> 667005 T2441 C579 oasup.LogUpdateProcessor.finish [collection1] webapp= path=/update params={waitSearcher=true&commit=true&wt=javabin&version=2&softCommit=false} {commit=} 0 57
   [junit4]   2> 667007 T2451 C580 oasu.DirectUpdateHandler2.commit start commit{,optimize=false,openSearcher=true,waitSearcher=true,expungeDeletes=false,softCommit=false,prepareCommit=false}
   [junit4]   2> 667009 T2451 C580 oasc.SolrDeletionPolicy.onCommit SolrDeletionPolicy.onCommit: commits: num=2
   [junit4]   2> 		commit{dir=MockDirectoryWrapper(RAMDirectory@e8b01686 lockFactory=org.apache.lucene.store.SingleInstanceLockFactory@4850549f),segFN=segments_1,generation=1}
   [junit4]   2> 		commit{dir=MockDirectoryWrapper(RAMDirectory@e8b01686 lockFactory=org.apache.lucene.store.SingleInstanceLockFactory@4850549f),segFN=segments_2,generation=2}
   [junit4]   2> 667010 T2451 C580 oasc.SolrDeletionPolicy.updateCommits newest commit generation = 2
   [junit4]   2> 667061 T2451 C580 oass.SolrIndexSearcher.<init> Opening Searcher@e4d1d116[collection1] main
   [junit4]   2> 667063 T2451 C580 oasu.DirectUpdateHandler2.commit end_commit_flush
   [junit4]   2> 667065 T2455 oasc.SolrCore.registerSearcher [collection1] Registered new searcher Searcher@e4d1d116[collection1] main{StandardDirectoryReader(segments_2:4:nrt _0(4.8):C2)}
   [junit4]   2> 667065 T2451 C580 oasup.LogUpdateProcessor.finish [collection1] webapp= path=/update params={waitSearcher=true&commit=true&wt=javabin&softCommit=false&version=2} {commit=} 0 58
   [junit4]   2> 667068 T2464 C581 oasu.DirectUpdateHandler2.commit start commit{,optimize=false,openSearcher=true,waitSearcher=true,expungeDeletes=false,softCommit=false,prepareCommit=false}
   [junit4]   2> 667070 T2464 C581 oasc.SolrDeletionPolicy.onCommit SolrDeletionPolicy.onCommit: commits: num=2
   [junit4]   2> 		commit{dir=MockDirectoryWrapper(RAMDirectory@d514631b lockFactory=org.apache.lucene.store.SingleInstanceLockFactory@7885b23d),segFN=segments_1,generation=1}
   [junit4]   2> 		commit{dir=MockDirectoryWrapper(RAMDirectory@d514631b lockFactory=org.apache.lucene.store.SingleInstanceLockFactory@7885b23d),segFN=segments_2,generation=2}
   [junit4]   2> 667071 T2464 C581 oasc.SolrDeletionPolicy.updateCommits newest commi

[...truncated too long message...]

etesByQuery=0,cumulative_errors=0,transaction_logs_total_size=1285,transaction_logs_total_number=1}
   [junit4]   2> 1300912 T2954 oasu.SolrCoreState.decrefSolrCoreState Closing SolrCoreState
   [junit4]   2> 1300912 T2954 oasu.DefaultSolrCoreState.closeIndexWriter SolrCoreState ref count has reached 0 - closing IndexWriter
   [junit4]   2> 1300913 T2954 oasu.DefaultSolrCoreState.closeIndexWriter closing IndexWriter with IndexWriterCloser
   [junit4]   2> 1300914 T2954 oasc.SolrCore.closeSearcher [collection1] Closing main searcher on request.
   [junit4]   2> 1300914 T2954 oasc.CachingDirectoryFactory.close Closing MockDirectoryFactory - 2 directories currently being tracked
   [junit4]   2> 1300915 T2954 oasc.CachingDirectoryFactory.closeCacheValue looking to close ./org.apache.solr.handler.component.TermVectorComponentDistributedTest-1393334533692/control/data/index [CachedDir<<refCount=0;path=./org.apache.solr.handler.component.TermVectorComponentDistributedTest-1393334533692/control/data/index;done=false>>]
   [junit4]   2> 1300916 T2954 oasc.CachingDirectoryFactory.close Closing directory: ./org.apache.solr.handler.component.TermVectorComponentDistributedTest-1393334533692/control/data/index
   [junit4]   2> 1300916 T2954 oasc.CachingDirectoryFactory.closeCacheValue looking to close ./org.apache.solr.handler.component.TermVectorComponentDistributedTest-1393334533692/control/data [CachedDir<<refCount=0;path=./org.apache.solr.handler.component.TermVectorComponentDistributedTest-1393334533692/control/data;done=false>>]
   [junit4]   2> 1300917 T2954 oasc.CachingDirectoryFactory.close Closing directory: ./org.apache.solr.handler.component.TermVectorComponentDistributedTest-1393334533692/control/data
   [junit4]   2> 1300918 T2954 oejsh.ContextHandler.doStop stopped o.e.j.s.ServletContextHandler{/p,null}
   [junit4]   2> 1300990 T2954 oasc.CoreContainer.shutdown Shutting down CoreContainer instance=1663559587
   [junit4]   2> 1300991 T2954 oasc.SolrCore.close [collection1]  CLOSING SolrCore org.apache.solr.core.SolrCore@9573a04c
   [junit4]   2> 1301002 T2954 oasu.DirectUpdateHandler2.close closing DirectUpdateHandler2{commits=1,autocommits=0,soft autocommits=0,optimizes=0,rollbacks=0,expungeDeletes=0,docsPending=0,adds=0,deletesById=0,deletesByQuery=0,errors=0,cumulative_adds=10,cumulative_deletesById=0,cumulative_deletesByQuery=0,cumulative_errors=0,transaction_logs_total_size=1285,transaction_logs_total_number=1}
   [junit4]   2> 1301002 T2954 oasu.SolrCoreState.decrefSolrCoreState Closing SolrCoreState
   [junit4]   2> 1301003 T2954 oasu.DefaultSolrCoreState.closeIndexWriter SolrCoreState ref count has reached 0 - closing IndexWriter
   [junit4]   2> 1301004 T2954 oasu.DefaultSolrCoreState.closeIndexWriter closing IndexWriter with IndexWriterCloser
   [junit4]   2> 1301004 T2954 oasc.SolrCore.closeSearcher [collection1] Closing main searcher on request.
   [junit4]   2> 1301005 T2954 oasc.CachingDirectoryFactory.close Closing MockDirectoryFactory - 2 directories currently being tracked
   [junit4]   2> 1301006 T2954 oasc.CachingDirectoryFactory.closeCacheValue looking to close ./org.apache.solr.handler.component.TermVectorComponentDistributedTest-1393334533692/shard0/data/index [CachedDir<<refCount=0;path=./org.apache.solr.handler.component.TermVectorComponentDistributedTest-1393334533692/shard0/data/index;done=false>>]
   [junit4]   2> 1301007 T2954 oasc.CachingDirectoryFactory.close Closing directory: ./org.apache.solr.handler.component.TermVectorComponentDistributedTest-1393334533692/shard0/data/index
   [junit4]   2> 1301008 T2954 oasc.CachingDirectoryFactory.closeCacheValue looking to close ./org.apache.solr.handler.component.TermVectorComponentDistributedTest-1393334533692/shard0/data [CachedDir<<refCount=0;path=./org.apache.solr.handler.component.TermVectorComponentDistributedTest-1393334533692/shard0/data;done=false>>]
   [junit4]   2> 1301009 T2954 oasc.CachingDirectoryFactory.close Closing directory: ./org.apache.solr.handler.component.TermVectorComponentDistributedTest-1393334533692/shard0/data
   [junit4]   2> 1301012 T2954 oejsh.ContextHandler.doStop stopped o.e.j.s.ServletContextHandler{/p,null}
   [junit4]   2> 1301070 T2954 oas.SolrTestCaseJ4.tearDown ###Ending testDistribSearch
   [junit4]   2> NOTE: reproduce with: ant test  -Dtestcase=TermVectorComponentDistributedTest -Dtests.method=testDistribSearch -Dtests.seed=B474530B20F36F2D -Dtests.multiplier=3 -Dtests.slow=true -Dtests.locale=ar_OM -Dtests.timezone=America/Indiana/Vincennes -Dtests.file.encoding=ISO-8859-1
   [junit4] FAILURE 2.14s J1 | TermVectorComponentDistributedTest.testDistribSearch <<<
   [junit4]    > Throwable #1: junit.framework.AssertionFailedError: .termVectors.0.test_basictv!=test_offtv (unordered or missing)
   [junit4]    > 	at __randomizedtesting.SeedInfo.seed([B474530B20F36F2D:3592DD1357AC0F11]:0)
   [junit4]    > 	at junit.framework.Assert.fail(Assert.java:50)
   [junit4]    > 	at org.apache.solr.BaseDistributedSearchTestCase.compareSolrResponses(BaseDistributedSearchTestCase.java:843)
   [junit4]    > 	at org.apache.solr.BaseDistributedSearchTestCase.compareResponses(BaseDistributedSearchTestCase.java:862)
   [junit4]    > 	at org.apache.solr.BaseDistributedSearchTestCase.query(BaseDistributedSearchTestCase.java:565)
   [junit4]    > 	at org.apache.solr.BaseDistributedSearchTestCase.query(BaseDistributedSearchTestCase.java:545)
   [junit4]    > 	at org.apache.solr.BaseDistributedSearchTestCase.query(BaseDistributedSearchTestCase.java:524)
   [junit4]    > 	at org.apache.solr.handler.component.TermVectorComponentDistributedTest.doTest(TermVectorComponentDistributedTest.java:127)
   [junit4]    > 	at org.apache.solr.BaseDistributedSearchTestCase.testDistribSearch(BaseDistributedSearchTestCase.java:876)
   [junit4]    > 	at java.lang.Thread.run(Thread.java:780)
   [junit4]   2> 1301081 T2954 oas.SolrTestCaseJ4.deleteCore ###deleteCore
   [junit4]   2> NOTE: test params are: codec=Asserting, sim=RandomSimilarityProvider(queryNorm=false,coord=no): {}, locale=ar_OM, timezone=America/Indiana/Vincennes
   [junit4]   2> NOTE: Linux 3.8.0-36-generic x86/IBM Corporation 1.7.0 (32-bit)/cpus=8,threads=1,free=396341600,total=493748224
   [junit4]   2> NOTE: All tests run in this JVM: [TestIBSimilarityFactory, DirectSolrConnectionTest, CursorPagingTest, HdfsUnloadDistributedZkTest, TestOverriddenPrefixQueryForCustomFieldType, MigrateRouteKeyTest, TestQueryTypes, TestCodecSupport, SimplePostToolTest, TestJmxIntegration, DistribCursorPagingTest, TestReload, DefaultValueUpdateProcessorTest, TestSolr4Spatial, TestArbitraryIndexDir, RAMDirectoryFactoryTest, HdfsLockFactoryTest, NotRequiredUniqueKeyTest, CoreContainerCoreInitFailuresTest, TestFieldResource, TestPartialUpdateDeduplication, MinimalSchemaTest, TestSchemaNameResource, EnumFieldTest, TestDefaultSimilarityFactory, DistanceFunctionTest, NoCacheHeaderTest, TestSolrDeletionPolicy2, TestDFRSimilarityFactory, TestIndexSearcher, DocumentAnalysisRequestHandlerTest, TestDistributedSearch, TestCSVResponseWriter, TestSchemaSimilarityResource, OutputWriterTest, TestZkChroot, DisMaxRequestHandlerTest, TestCoreDiscovery, DistributedQueryComponentCustomSortTest, BlockCacheTest, TestFoldingMultitermQuery, TestInitQParser, TestDynamicFieldCollectionResource, DateFieldTest, ShardRoutingCustomTest, ParsingFieldUpdateProcessorsTest, DirectUpdateHandlerTest, FullSolrCloudDistribCmdsTest, AnalysisErrorHandlingTest, TestNonNRTOpen, TestFastLRUCache, TestQuerySenderNoQuery, TestPhraseSuggestions, TestSchemaResource, TestStressLucene, SignatureUpdateProcessorFactoryTest, ConvertedLegacyTest, HdfsChaosMonkeySafeLeaderTest, TestSolrQueryParserResource, TestFastOutputStream, TestStressReorder, LeaderElectionIntegrationTest, TestRangeQuery, TestDistribDocBasedVersion, HdfsCollectionsAPIDistributedZkTest, SortByFunctionTest, TestSchemaVersionResource, BadCopyFieldTest, TestHighlightDedupGrouping, AlternateDirectoryTest, TestRandomFaceting, SolrCoreCheckLockOnStartupTest, JSONWriterTest, TestIndexingPerformance, TestXIncludeConfig, MultiTermTest, RequestHandlersTest, TestUpdate, TestRecovery, PreAnalyzedFieldTest, TestBinaryResponseWriter, TestSolrCoreProperties, HdfsBasicDistributedZk2Test, TestAnalyzeInfixSuggestions, StatsComponentTest, TestFiltering, TestRandomMergePolicy, BlockDirectoryTest, OpenCloseCoreStressTest, OverseerTest, ZkSolrClientTest, ZkCLITest, SliceStateUpdateTest, TestDistributedGrouping, TermVectorComponentDistributedTest]
   [junit4] Completed on J1 in 2.17s, 1 test, 1 failure <<< FAILURES!

[...truncated 518 lines...]
BUILD FAILED
/mnt/ssd/jenkins/workspace/Lucene-Solr-4.x-Linux/build.xml:471: The following error occurred while executing this line:
/mnt/ssd/jenkins/workspace/Lucene-Solr-4.x-Linux/build.xml:464: The following error occurred while executing this line:
/mnt/ssd/jenkins/workspace/Lucene-Solr-4.x-Linux/build.xml:39: The following error occurred while executing this line:
/mnt/ssd/jenkins/workspace/Lucene-Solr-4.x-Linux/extra-targets.xml:37: The following error occurred while executing this line:
/mnt/ssd/jenkins/workspace/Lucene-Solr-4.x-Linux/solr/build.xml:189: The following error occurred while executing this line:
/mnt/ssd/jenkins/workspace/Lucene-Solr-4.x-Linux/solr/common-build.xml:490: The following error occurred while executing this line:
/mnt/ssd/jenkins/workspace/Lucene-Solr-4.x-Linux/lucene/common-build.xml:1278: The following error occurred while executing this line:
/mnt/ssd/jenkins/workspace/Lucene-Solr-4.x-Linux/lucene/common-build.xml:911: There were test failures: 363 suites, 1565 tests, 4 failures, 35 ignored (7 assumptions)

Total time: 56 minutes 54 seconds
Build step 'Invoke Ant' marked build as failure
Description set: Java: 32bit/ibm-j9-jdk7 -Xjit:exclude={org/apache/lucene/util/fst/FST.pack(IIF)Lorg/apache/lucene/util/fst/FST;}
Archiving artifacts
Recording test results
Email was triggered for: Failure
Sending email for trigger: Failure



Mime
View raw message