lucene-dev mailing list archives

Site index · List index
Message view « Date » · « Thread »
Top « Date » · « Thread »
From Policeman Jenkins Server <jenk...@thetaphi.de>
Subject [JENKINS] Lucene-Solr-trunk-Linux (32bit/jdk1.7.0_51) - Build # 9364 - Still Failing!
Date Wed, 05 Feb 2014 07:46:20 GMT
Build: http://jenkins.thetaphi.de/job/Lucene-Solr-trunk-Linux/9364/
Java: 32bit/jdk1.7.0_51 -client -XX:+UseParallelGC

6 tests failed.
FAILED:  org.apache.solr.BasicFunctionalityTest.testClientErrorOnMalformedNumbers

Error Message:
not an (update) client error on field: malformed_ti : org.apache.solr.common.SolrException: Exception writing document id 100 to the index; possible analysis error.

Stack Trace:
java.lang.AssertionError: not an (update) client error on field: malformed_ti : org.apache.solr.common.SolrException: Exception writing document id 100 to the index; possible analysis error.
	at __randomizedtesting.SeedInfo.seed([EB6CFCEB849F6A6C:864B7C396F26D8CB]:0)
	at org.junit.Assert.fail(Assert.java:93)
	at org.junit.Assert.assertTrue(Assert.java:43)
	at org.apache.solr.BasicFunctionalityTest.testClientErrorOnMalformedNumbers(BasicFunctionalityTest.java:366)
	at sun.reflect.NativeMethodAccessorImpl.invoke0(Native Method)
	at sun.reflect.NativeMethodAccessorImpl.invoke(NativeMethodAccessorImpl.java:57)
	at sun.reflect.DelegatingMethodAccessorImpl.invoke(DelegatingMethodAccessorImpl.java:43)
	at java.lang.reflect.Method.invoke(Method.java:606)
	at com.carrotsearch.randomizedtesting.RandomizedRunner.invoke(RandomizedRunner.java:1559)
	at com.carrotsearch.randomizedtesting.RandomizedRunner.access$600(RandomizedRunner.java:79)
	at com.carrotsearch.randomizedtesting.RandomizedRunner$6.evaluate(RandomizedRunner.java:737)
	at com.carrotsearch.randomizedtesting.RandomizedRunner$7.evaluate(RandomizedRunner.java:773)
	at com.carrotsearch.randomizedtesting.RandomizedRunner$8.evaluate(RandomizedRunner.java:787)
	at com.carrotsearch.randomizedtesting.rules.SystemPropertiesRestoreRule$1.evaluate(SystemPropertiesRestoreRule.java:53)
	at org.apache.lucene.util.TestRuleSetupTeardownChained$1.evaluate(TestRuleSetupTeardownChained.java:50)
	at org.apache.lucene.util.TestRuleFieldCacheSanity$1.evaluate(TestRuleFieldCacheSanity.java:51)
	at org.apache.lucene.util.AbstractBeforeAfterRule$1.evaluate(AbstractBeforeAfterRule.java:46)
	at com.carrotsearch.randomizedtesting.rules.SystemPropertiesInvariantRule$1.evaluate(SystemPropertiesInvariantRule.java:55)
	at org.apache.lucene.util.TestRuleThreadAndTestName$1.evaluate(TestRuleThreadAndTestName.java:49)
	at org.apache.lucene.util.TestRuleIgnoreAfterMaxFailures$1.evaluate(TestRuleIgnoreAfterMaxFailures.java:70)
	at org.apache.lucene.util.TestRuleMarkFailure$1.evaluate(TestRuleMarkFailure.java:48)
	at com.carrotsearch.randomizedtesting.rules.StatementAdapter.evaluate(StatementAdapter.java:36)
	at com.carrotsearch.randomizedtesting.ThreadLeakControl$StatementRunner.run(ThreadLeakControl.java:358)
	at com.carrotsearch.randomizedtesting.ThreadLeakControl.forkTimeoutingTask(ThreadLeakControl.java:782)
	at com.carrotsearch.randomizedtesting.ThreadLeakControl$3.evaluate(ThreadLeakControl.java:442)
	at com.carrotsearch.randomizedtesting.RandomizedRunner.runSingleTest(RandomizedRunner.java:746)
	at com.carrotsearch.randomizedtesting.RandomizedRunner$3.evaluate(RandomizedRunner.java:648)
	at com.carrotsearch.randomizedtesting.RandomizedRunner$4.evaluate(RandomizedRunner.java:682)
	at com.carrotsearch.randomizedtesting.RandomizedRunner$5.evaluate(RandomizedRunner.java:693)
	at com.carrotsearch.randomizedtesting.rules.StatementAdapter.evaluate(StatementAdapter.java:36)
	at com.carrotsearch.randomizedtesting.rules.SystemPropertiesRestoreRule$1.evaluate(SystemPropertiesRestoreRule.java:53)
	at org.apache.lucene.util.AbstractBeforeAfterRule$1.evaluate(AbstractBeforeAfterRule.java:46)
	at org.apache.lucene.util.TestRuleStoreClassName$1.evaluate(TestRuleStoreClassName.java:42)
	at com.carrotsearch.randomizedtesting.rules.SystemPropertiesInvariantRule$1.evaluate(SystemPropertiesInvariantRule.java:55)
	at com.carrotsearch.randomizedtesting.rules.NoShadowingOrOverridesOnMethodsRule$1.evaluate(NoShadowingOrOverridesOnMethodsRule.java:39)
	at com.carrotsearch.randomizedtesting.rules.NoShadowingOrOverridesOnMethodsRule$1.evaluate(NoShadowingOrOverridesOnMethodsRule.java:39)
	at com.carrotsearch.randomizedtesting.rules.StatementAdapter.evaluate(StatementAdapter.java:36)
	at org.apache.lucene.util.TestRuleAssertionsRequired$1.evaluate(TestRuleAssertionsRequired.java:43)
	at org.apache.lucene.util.TestRuleMarkFailure$1.evaluate(TestRuleMarkFailure.java:48)
	at org.apache.lucene.util.TestRuleIgnoreAfterMaxFailures$1.evaluate(TestRuleIgnoreAfterMaxFailures.java:70)
	at org.apache.lucene.util.TestRuleIgnoreTestSuites$1.evaluate(TestRuleIgnoreTestSuites.java:55)
	at com.carrotsearch.randomizedtesting.rules.StatementAdapter.evaluate(StatementAdapter.java:36)
	at com.carrotsearch.randomizedtesting.ThreadLeakControl$StatementRunner.run(ThreadLeakControl.java:358)
	at java.lang.Thread.run(Thread.java:744)


FAILED:  org.apache.solr.handler.JsonLoaderTest.testAddBigIntegerValueToTrieField

Error Message:
Exception writing document id 1 to the index; possible analysis error.

Stack Trace:
org.apache.solr.common.SolrException: Exception writing document id 1 to the index; possible analysis error.
	at __randomizedtesting.SeedInfo.seed([EB6CFCEB849F6A6C:84B07B36F27B52C]:0)
	at org.apache.solr.update.DirectUpdateHandler2.addDoc(DirectUpdateHandler2.java:162)
	at org.apache.solr.update.processor.RunUpdateProcessor.processAdd(RunUpdateProcessorFactory.java:69)
	at org.apache.solr.update.processor.UpdateRequestProcessor.processAdd(UpdateRequestProcessor.java:51)
	at org.apache.solr.update.processor.DistributedUpdateProcessor.doLocalAdd(DistributedUpdateProcessor.java:683)
	at org.apache.solr.update.processor.DistributedUpdateProcessor.versionAdd(DistributedUpdateProcessor.java:837)
	at org.apache.solr.update.processor.DistributedUpdateProcessor.processAdd(DistributedUpdateProcessor.java:536)
	at org.apache.solr.update.processor.LogUpdateProcessor.processAdd(LogUpdateProcessorFactory.java:100)
	at org.apache.solr.handler.loader.JsonLoader$SingleThreadedJsonLoader.handleAdds(JsonLoader.java:392)
	at org.apache.solr.handler.loader.JsonLoader$SingleThreadedJsonLoader.processUpdate(JsonLoader.java:117)
	at org.apache.solr.handler.loader.JsonLoader$SingleThreadedJsonLoader.load(JsonLoader.java:101)
	at org.apache.solr.handler.loader.JsonLoader.load(JsonLoader.java:65)
	at org.apache.solr.handler.UpdateRequestHandler$1.load(UpdateRequestHandler.java:92)
	at org.apache.solr.handler.ContentStreamHandlerBase.handleRequestBody(ContentStreamHandlerBase.java:74)
	at org.apache.solr.handler.RequestHandlerBase.handleRequest(RequestHandlerBase.java:135)
	at org.apache.solr.core.SolrCore.execute(SolrCore.java:1915)
	at org.apache.solr.servlet.DirectSolrConnection.request(DirectSolrConnection.java:131)
	at org.apache.solr.SolrTestCaseJ4.updateJ(SolrTestCaseJ4.java:989)
	at org.apache.solr.handler.JsonLoaderTest.testAddBigIntegerValueToTrieField(JsonLoaderTest.java:402)
	at sun.reflect.NativeMethodAccessorImpl.invoke0(Native Method)
	at sun.reflect.NativeMethodAccessorImpl.invoke(NativeMethodAccessorImpl.java:57)
	at sun.reflect.DelegatingMethodAccessorImpl.invoke(DelegatingMethodAccessorImpl.java:43)
	at java.lang.reflect.Method.invoke(Method.java:606)
	at com.carrotsearch.randomizedtesting.RandomizedRunner.invoke(RandomizedRunner.java:1559)
	at com.carrotsearch.randomizedtesting.RandomizedRunner.access$600(RandomizedRunner.java:79)
	at com.carrotsearch.randomizedtesting.RandomizedRunner$6.evaluate(RandomizedRunner.java:737)
	at com.carrotsearch.randomizedtesting.RandomizedRunner$7.evaluate(RandomizedRunner.java:773)
	at com.carrotsearch.randomizedtesting.RandomizedRunner$8.evaluate(RandomizedRunner.java:787)
	at com.carrotsearch.randomizedtesting.rules.SystemPropertiesRestoreRule$1.evaluate(SystemPropertiesRestoreRule.java:53)
	at org.apache.lucene.util.TestRuleSetupTeardownChained$1.evaluate(TestRuleSetupTeardownChained.java:50)
	at org.apache.lucene.util.TestRuleFieldCacheSanity$1.evaluate(TestRuleFieldCacheSanity.java:51)
	at org.apache.lucene.util.AbstractBeforeAfterRule$1.evaluate(AbstractBeforeAfterRule.java:46)
	at com.carrotsearch.randomizedtesting.rules.SystemPropertiesInvariantRule$1.evaluate(SystemPropertiesInvariantRule.java:55)
	at org.apache.lucene.util.TestRuleThreadAndTestName$1.evaluate(TestRuleThreadAndTestName.java:49)
	at org.apache.lucene.util.TestRuleIgnoreAfterMaxFailures$1.evaluate(TestRuleIgnoreAfterMaxFailures.java:70)
	at org.apache.lucene.util.TestRuleMarkFailure$1.evaluate(TestRuleMarkFailure.java:48)
	at com.carrotsearch.randomizedtesting.rules.StatementAdapter.evaluate(StatementAdapter.java:36)
	at com.carrotsearch.randomizedtesting.ThreadLeakControl$StatementRunner.run(ThreadLeakControl.java:358)
	at com.carrotsearch.randomizedtesting.ThreadLeakControl.forkTimeoutingTask(ThreadLeakControl.java:782)
	at com.carrotsearch.randomizedtesting.ThreadLeakControl$3.evaluate(ThreadLeakControl.java:442)
	at com.carrotsearch.randomizedtesting.RandomizedRunner.runSingleTest(RandomizedRunner.java:746)
	at com.carrotsearch.randomizedtesting.RandomizedRunner$3.evaluate(RandomizedRunner.java:648)
	at com.carrotsearch.randomizedtesting.RandomizedRunner$4.evaluate(RandomizedRunner.java:682)
	at com.carrotsearch.randomizedtesting.RandomizedRunner$5.evaluate(RandomizedRunner.java:693)
	at com.carrotsearch.randomizedtesting.rules.StatementAdapter.evaluate(StatementAdapter.java:36)
	at com.carrotsearch.randomizedtesting.rules.SystemPropertiesRestoreRule$1.evaluate(SystemPropertiesRestoreRule.java:53)
	at org.apache.lucene.util.AbstractBeforeAfterRule$1.evaluate(AbstractBeforeAfterRule.java:46)
	at org.apache.lucene.util.TestRuleStoreClassName$1.evaluate(TestRuleStoreClassName.java:42)
	at com.carrotsearch.randomizedtesting.rules.SystemPropertiesInvariantRule$1.evaluate(SystemPropertiesInvariantRule.java:55)
	at com.carrotsearch.randomizedtesting.rules.NoShadowingOrOverridesOnMethodsRule$1.evaluate(NoShadowingOrOverridesOnMethodsRule.java:39)
	at com.carrotsearch.randomizedtesting.rules.NoShadowingOrOverridesOnMethodsRule$1.evaluate(NoShadowingOrOverridesOnMethodsRule.java:39)
	at com.carrotsearch.randomizedtesting.rules.StatementAdapter.evaluate(StatementAdapter.java:36)
	at org.apache.lucene.util.TestRuleAssertionsRequired$1.evaluate(TestRuleAssertionsRequired.java:43)
	at org.apache.lucene.util.TestRuleMarkFailure$1.evaluate(TestRuleMarkFailure.java:48)
	at org.apache.lucene.util.TestRuleIgnoreAfterMaxFailures$1.evaluate(TestRuleIgnoreAfterMaxFailures.java:70)
	at org.apache.lucene.util.TestRuleIgnoreTestSuites$1.evaluate(TestRuleIgnoreTestSuites.java:55)
	at com.carrotsearch.randomizedtesting.rules.StatementAdapter.evaluate(StatementAdapter.java:36)
	at com.carrotsearch.randomizedtesting.ThreadLeakControl$StatementRunner.run(ThreadLeakControl.java:358)
	at java.lang.Thread.run(Thread.java:744)
Caused by: org.apache.solr.common.SolrException: ERROR: [doc=1] Error adding field 'big_integer_tl'='12345678901234567890' msg=For input string: "12345678901234567890"
	at org.apache.solr.update.DocumentBuilder.toDocument(DocumentBuilder.java:165)
	at org.apache.solr.update.AddUpdateCommand.getLuceneDocument(AddUpdateCommand.java:78)
	at org.apache.solr.update.DirectUpdateHandler2.addDoc0(DirectUpdateHandler2.java:232)
	at org.apache.solr.update.DirectUpdateHandler2.addDoc(DirectUpdateHandler2.java:159)
	... 57 more
Caused by: java.lang.NumberFormatException: For input string: "12345678901234567890"
	at java.lang.NumberFormatException.forInputString(NumberFormatException.java:65)
	at java.lang.Long.parseLong(Long.java:444)
	at java.lang.Long.parseLong(Long.java:483)
	at org.apache.solr.schema.TrieField.createField(TrieField.java:609)
	at org.apache.solr.schema.TrieField.createFields(TrieField.java:660)
	at org.apache.solr.update.DocumentBuilder.addField(DocumentBuilder.java:45)
	at org.apache.solr.update.DocumentBuilder.toDocument(DocumentBuilder.java:116)
	... 60 more


FAILED:  org.apache.solr.search.TestSolr4Spatial.testBadShapeParse400 {p0=srpt_geohash}

Error Message:
expected:<400> but was:<500>

Stack Trace:
java.lang.AssertionError: expected:<400> but was:<500>
	at __randomizedtesting.SeedInfo.seed([EB6CFCEB849F6A6C:49B06A404C78F983]:0)
	at org.junit.Assert.fail(Assert.java:93)
	at org.junit.Assert.failNotEquals(Assert.java:647)
	at org.junit.Assert.assertEquals(Assert.java:128)
	at org.junit.Assert.assertEquals(Assert.java:472)
	at org.junit.Assert.assertEquals(Assert.java:456)
	at org.apache.solr.search.TestSolr4Spatial.testBadShapeParse400(TestSolr4Spatial.java:91)
	at sun.reflect.NativeMethodAccessorImpl.invoke0(Native Method)
	at sun.reflect.NativeMethodAccessorImpl.invoke(NativeMethodAccessorImpl.java:57)
	at sun.reflect.DelegatingMethodAccessorImpl.invoke(DelegatingMethodAccessorImpl.java:43)
	at java.lang.reflect.Method.invoke(Method.java:606)
	at com.carrotsearch.randomizedtesting.RandomizedRunner.invoke(RandomizedRunner.java:1559)
	at com.carrotsearch.randomizedtesting.RandomizedRunner.access$600(RandomizedRunner.java:79)
	at com.carrotsearch.randomizedtesting.RandomizedRunner$6.evaluate(RandomizedRunner.java:737)
	at com.carrotsearch.randomizedtesting.RandomizedRunner$7.evaluate(RandomizedRunner.java:773)
	at com.carrotsearch.randomizedtesting.RandomizedRunner$8.evaluate(RandomizedRunner.java:787)
	at com.carrotsearch.randomizedtesting.rules.SystemPropertiesRestoreRule$1.evaluate(SystemPropertiesRestoreRule.java:53)
	at org.apache.lucene.util.TestRuleSetupTeardownChained$1.evaluate(TestRuleSetupTeardownChained.java:50)
	at org.apache.lucene.util.TestRuleFieldCacheSanity$1.evaluate(TestRuleFieldCacheSanity.java:51)
	at org.apache.lucene.util.AbstractBeforeAfterRule$1.evaluate(AbstractBeforeAfterRule.java:46)
	at com.carrotsearch.randomizedtesting.rules.SystemPropertiesInvariantRule$1.evaluate(SystemPropertiesInvariantRule.java:55)
	at org.apache.lucene.util.TestRuleThreadAndTestName$1.evaluate(TestRuleThreadAndTestName.java:49)
	at org.apache.lucene.util.TestRuleIgnoreAfterMaxFailures$1.evaluate(TestRuleIgnoreAfterMaxFailures.java:70)
	at org.apache.lucene.util.TestRuleMarkFailure$1.evaluate(TestRuleMarkFailure.java:48)
	at com.carrotsearch.randomizedtesting.rules.StatementAdapter.evaluate(StatementAdapter.java:36)
	at com.carrotsearch.randomizedtesting.ThreadLeakControl$StatementRunner.run(ThreadLeakControl.java:358)
	at com.carrotsearch.randomizedtesting.ThreadLeakControl.forkTimeoutingTask(ThreadLeakControl.java:782)
	at com.carrotsearch.randomizedtesting.ThreadLeakControl$3.evaluate(ThreadLeakControl.java:442)
	at com.carrotsearch.randomizedtesting.RandomizedRunner.runSingleTest(RandomizedRunner.java:746)
	at com.carrotsearch.randomizedtesting.RandomizedRunner$3.evaluate(RandomizedRunner.java:648)
	at com.carrotsearch.randomizedtesting.RandomizedRunner$4.evaluate(RandomizedRunner.java:682)
	at com.carrotsearch.randomizedtesting.RandomizedRunner$5.evaluate(RandomizedRunner.java:693)
	at com.carrotsearch.randomizedtesting.rules.StatementAdapter.evaluate(StatementAdapter.java:36)
	at com.carrotsearch.randomizedtesting.rules.SystemPropertiesRestoreRule$1.evaluate(SystemPropertiesRestoreRule.java:53)
	at org.apache.lucene.util.AbstractBeforeAfterRule$1.evaluate(AbstractBeforeAfterRule.java:46)
	at org.apache.lucene.util.TestRuleStoreClassName$1.evaluate(TestRuleStoreClassName.java:42)
	at com.carrotsearch.randomizedtesting.rules.SystemPropertiesInvariantRule$1.evaluate(SystemPropertiesInvariantRule.java:55)
	at com.carrotsearch.randomizedtesting.rules.NoShadowingOrOverridesOnMethodsRule$1.evaluate(NoShadowingOrOverridesOnMethodsRule.java:39)
	at com.carrotsearch.randomizedtesting.rules.NoShadowingOrOverridesOnMethodsRule$1.evaluate(NoShadowingOrOverridesOnMethodsRule.java:39)
	at com.carrotsearch.randomizedtesting.rules.StatementAdapter.evaluate(StatementAdapter.java:36)
	at org.apache.lucene.util.TestRuleAssertionsRequired$1.evaluate(TestRuleAssertionsRequired.java:43)
	at org.apache.lucene.util.TestRuleMarkFailure$1.evaluate(TestRuleMarkFailure.java:48)
	at org.apache.lucene.util.TestRuleIgnoreAfterMaxFailures$1.evaluate(TestRuleIgnoreAfterMaxFailures.java:70)
	at org.apache.lucene.util.TestRuleIgnoreTestSuites$1.evaluate(TestRuleIgnoreTestSuites.java:55)
	at com.carrotsearch.randomizedtesting.rules.StatementAdapter.evaluate(StatementAdapter.java:36)
	at com.carrotsearch.randomizedtesting.ThreadLeakControl$StatementRunner.run(ThreadLeakControl.java:358)
	at java.lang.Thread.run(Thread.java:744)


FAILED:  org.apache.solr.search.TestSolr4Spatial.testBadShapeParse400 {p0=srpt_quad}

Error Message:
expected:<400> but was:<500>

Stack Trace:
java.lang.AssertionError: expected:<400> but was:<500>
	at __randomizedtesting.SeedInfo.seed([EB6CFCEB849F6A6C:49B06A404C78F983]:0)
	at org.junit.Assert.fail(Assert.java:93)
	at org.junit.Assert.failNotEquals(Assert.java:647)
	at org.junit.Assert.assertEquals(Assert.java:128)
	at org.junit.Assert.assertEquals(Assert.java:472)
	at org.junit.Assert.assertEquals(Assert.java:456)
	at org.apache.solr.search.TestSolr4Spatial.testBadShapeParse400(TestSolr4Spatial.java:91)
	at sun.reflect.NativeMethodAccessorImpl.invoke0(Native Method)
	at sun.reflect.NativeMethodAccessorImpl.invoke(NativeMethodAccessorImpl.java:57)
	at sun.reflect.DelegatingMethodAccessorImpl.invoke(DelegatingMethodAccessorImpl.java:43)
	at java.lang.reflect.Method.invoke(Method.java:606)
	at com.carrotsearch.randomizedtesting.RandomizedRunner.invoke(RandomizedRunner.java:1559)
	at com.carrotsearch.randomizedtesting.RandomizedRunner.access$600(RandomizedRunner.java:79)
	at com.carrotsearch.randomizedtesting.RandomizedRunner$6.evaluate(RandomizedRunner.java:737)
	at com.carrotsearch.randomizedtesting.RandomizedRunner$7.evaluate(RandomizedRunner.java:773)
	at com.carrotsearch.randomizedtesting.RandomizedRunner$8.evaluate(RandomizedRunner.java:787)
	at com.carrotsearch.randomizedtesting.rules.SystemPropertiesRestoreRule$1.evaluate(SystemPropertiesRestoreRule.java:53)
	at org.apache.lucene.util.TestRuleSetupTeardownChained$1.evaluate(TestRuleSetupTeardownChained.java:50)
	at org.apache.lucene.util.TestRuleFieldCacheSanity$1.evaluate(TestRuleFieldCacheSanity.java:51)
	at org.apache.lucene.util.AbstractBeforeAfterRule$1.evaluate(AbstractBeforeAfterRule.java:46)
	at com.carrotsearch.randomizedtesting.rules.SystemPropertiesInvariantRule$1.evaluate(SystemPropertiesInvariantRule.java:55)
	at org.apache.lucene.util.TestRuleThreadAndTestName$1.evaluate(TestRuleThreadAndTestName.java:49)
	at org.apache.lucene.util.TestRuleIgnoreAfterMaxFailures$1.evaluate(TestRuleIgnoreAfterMaxFailures.java:70)
	at org.apache.lucene.util.TestRuleMarkFailure$1.evaluate(TestRuleMarkFailure.java:48)
	at com.carrotsearch.randomizedtesting.rules.StatementAdapter.evaluate(StatementAdapter.java:36)
	at com.carrotsearch.randomizedtesting.ThreadLeakControl$StatementRunner.run(ThreadLeakControl.java:358)
	at com.carrotsearch.randomizedtesting.ThreadLeakControl.forkTimeoutingTask(ThreadLeakControl.java:782)
	at com.carrotsearch.randomizedtesting.ThreadLeakControl$3.evaluate(ThreadLeakControl.java:442)
	at com.carrotsearch.randomizedtesting.RandomizedRunner.runSingleTest(RandomizedRunner.java:746)
	at com.carrotsearch.randomizedtesting.RandomizedRunner$3.evaluate(RandomizedRunner.java:648)
	at com.carrotsearch.randomizedtesting.RandomizedRunner$4.evaluate(RandomizedRunner.java:682)
	at com.carrotsearch.randomizedtesting.RandomizedRunner$5.evaluate(RandomizedRunner.java:693)
	at com.carrotsearch.randomizedtesting.rules.StatementAdapter.evaluate(StatementAdapter.java:36)
	at com.carrotsearch.randomizedtesting.rules.SystemPropertiesRestoreRule$1.evaluate(SystemPropertiesRestoreRule.java:53)
	at org.apache.lucene.util.AbstractBeforeAfterRule$1.evaluate(AbstractBeforeAfterRule.java:46)
	at org.apache.lucene.util.TestRuleStoreClassName$1.evaluate(TestRuleStoreClassName.java:42)
	at com.carrotsearch.randomizedtesting.rules.SystemPropertiesInvariantRule$1.evaluate(SystemPropertiesInvariantRule.java:55)
	at com.carrotsearch.randomizedtesting.rules.NoShadowingOrOverridesOnMethodsRule$1.evaluate(NoShadowingOrOverridesOnMethodsRule.java:39)
	at com.carrotsearch.randomizedtesting.rules.NoShadowingOrOverridesOnMethodsRule$1.evaluate(NoShadowingOrOverridesOnMethodsRule.java:39)
	at com.carrotsearch.randomizedtesting.rules.StatementAdapter.evaluate(StatementAdapter.java:36)
	at org.apache.lucene.util.TestRuleAssertionsRequired$1.evaluate(TestRuleAssertionsRequired.java:43)
	at org.apache.lucene.util.TestRuleMarkFailure$1.evaluate(TestRuleMarkFailure.java:48)
	at org.apache.lucene.util.TestRuleIgnoreAfterMaxFailures$1.evaluate(TestRuleIgnoreAfterMaxFailures.java:70)
	at org.apache.lucene.util.TestRuleIgnoreTestSuites$1.evaluate(TestRuleIgnoreTestSuites.java:55)
	at com.carrotsearch.randomizedtesting.rules.StatementAdapter.evaluate(StatementAdapter.java:36)
	at com.carrotsearch.randomizedtesting.ThreadLeakControl$StatementRunner.run(ThreadLeakControl.java:358)
	at java.lang.Thread.run(Thread.java:744)


FAILED:  org.apache.solr.search.TestSolr4Spatial.testBadShapeParse400 {p0=stqpt_geohash}

Error Message:
expected:<400> but was:<500>

Stack Trace:
java.lang.AssertionError: expected:<400> but was:<500>
	at __randomizedtesting.SeedInfo.seed([EB6CFCEB849F6A6C:49B06A404C78F983]:0)
	at org.junit.Assert.fail(Assert.java:93)
	at org.junit.Assert.failNotEquals(Assert.java:647)
	at org.junit.Assert.assertEquals(Assert.java:128)
	at org.junit.Assert.assertEquals(Assert.java:472)
	at org.junit.Assert.assertEquals(Assert.java:456)
	at org.apache.solr.search.TestSolr4Spatial.testBadShapeParse400(TestSolr4Spatial.java:91)
	at sun.reflect.NativeMethodAccessorImpl.invoke0(Native Method)
	at sun.reflect.NativeMethodAccessorImpl.invoke(NativeMethodAccessorImpl.java:57)
	at sun.reflect.DelegatingMethodAccessorImpl.invoke(DelegatingMethodAccessorImpl.java:43)
	at java.lang.reflect.Method.invoke(Method.java:606)
	at com.carrotsearch.randomizedtesting.RandomizedRunner.invoke(RandomizedRunner.java:1559)
	at com.carrotsearch.randomizedtesting.RandomizedRunner.access$600(RandomizedRunner.java:79)
	at com.carrotsearch.randomizedtesting.RandomizedRunner$6.evaluate(RandomizedRunner.java:737)
	at com.carrotsearch.randomizedtesting.RandomizedRunner$7.evaluate(RandomizedRunner.java:773)
	at com.carrotsearch.randomizedtesting.RandomizedRunner$8.evaluate(RandomizedRunner.java:787)
	at com.carrotsearch.randomizedtesting.rules.SystemPropertiesRestoreRule$1.evaluate(SystemPropertiesRestoreRule.java:53)
	at org.apache.lucene.util.TestRuleSetupTeardownChained$1.evaluate(TestRuleSetupTeardownChained.java:50)
	at org.apache.lucene.util.TestRuleFieldCacheSanity$1.evaluate(TestRuleFieldCacheSanity.java:51)
	at org.apache.lucene.util.AbstractBeforeAfterRule$1.evaluate(AbstractBeforeAfterRule.java:46)
	at com.carrotsearch.randomizedtesting.rules.SystemPropertiesInvariantRule$1.evaluate(SystemPropertiesInvariantRule.java:55)
	at org.apache.lucene.util.TestRuleThreadAndTestName$1.evaluate(TestRuleThreadAndTestName.java:49)
	at org.apache.lucene.util.TestRuleIgnoreAfterMaxFailures$1.evaluate(TestRuleIgnoreAfterMaxFailures.java:70)
	at org.apache.lucene.util.TestRuleMarkFailure$1.evaluate(TestRuleMarkFailure.java:48)
	at com.carrotsearch.randomizedtesting.rules.StatementAdapter.evaluate(StatementAdapter.java:36)
	at com.carrotsearch.randomizedtesting.ThreadLeakControl$StatementRunner.run(ThreadLeakControl.java:358)
	at com.carrotsearch.randomizedtesting.ThreadLeakControl.forkTimeoutingTask(ThreadLeakControl.java:782)
	at com.carrotsearch.randomizedtesting.ThreadLeakControl$3.evaluate(ThreadLeakControl.java:442)
	at com.carrotsearch.randomizedtesting.RandomizedRunner.runSingleTest(RandomizedRunner.java:746)
	at com.carrotsearch.randomizedtesting.RandomizedRunner$3.evaluate(RandomizedRunner.java:648)
	at com.carrotsearch.randomizedtesting.RandomizedRunner$4.evaluate(RandomizedRunner.java:682)
	at com.carrotsearch.randomizedtesting.RandomizedRunner$5.evaluate(RandomizedRunner.java:693)
	at com.carrotsearch.randomizedtesting.rules.StatementAdapter.evaluate(StatementAdapter.java:36)
	at com.carrotsearch.randomizedtesting.rules.SystemPropertiesRestoreRule$1.evaluate(SystemPropertiesRestoreRule.java:53)
	at org.apache.lucene.util.AbstractBeforeAfterRule$1.evaluate(AbstractBeforeAfterRule.java:46)
	at org.apache.lucene.util.TestRuleStoreClassName$1.evaluate(TestRuleStoreClassName.java:42)
	at com.carrotsearch.randomizedtesting.rules.SystemPropertiesInvariantRule$1.evaluate(SystemPropertiesInvariantRule.java:55)
	at com.carrotsearch.randomizedtesting.rules.NoShadowingOrOverridesOnMethodsRule$1.evaluate(NoShadowingOrOverridesOnMethodsRule.java:39)
	at com.carrotsearch.randomizedtesting.rules.NoShadowingOrOverridesOnMethodsRule$1.evaluate(NoShadowingOrOverridesOnMethodsRule.java:39)
	at com.carrotsearch.randomizedtesting.rules.StatementAdapter.evaluate(StatementAdapter.java:36)
	at org.apache.lucene.util.TestRuleAssertionsRequired$1.evaluate(TestRuleAssertionsRequired.java:43)
	at org.apache.lucene.util.TestRuleMarkFailure$1.evaluate(TestRuleMarkFailure.java:48)
	at org.apache.lucene.util.TestRuleIgnoreAfterMaxFailures$1.evaluate(TestRuleIgnoreAfterMaxFailures.java:70)
	at org.apache.lucene.util.TestRuleIgnoreTestSuites$1.evaluate(TestRuleIgnoreTestSuites.java:55)
	at com.carrotsearch.randomizedtesting.rules.StatementAdapter.evaluate(StatementAdapter.java:36)
	at com.carrotsearch.randomizedtesting.ThreadLeakControl$StatementRunner.run(ThreadLeakControl.java:358)
	at java.lang.Thread.run(Thread.java:744)


FAILED:  org.apache.solr.search.TestSolr4Spatial.testBadShapeParse400 {p0=pointvector}

Error Message:
expected:<400> but was:<500>

Stack Trace:
java.lang.AssertionError: expected:<400> but was:<500>
	at __randomizedtesting.SeedInfo.seed([EB6CFCEB849F6A6C:49B06A404C78F983]:0)
	at org.junit.Assert.fail(Assert.java:93)
	at org.junit.Assert.failNotEquals(Assert.java:647)
	at org.junit.Assert.assertEquals(Assert.java:128)
	at org.junit.Assert.assertEquals(Assert.java:472)
	at org.junit.Assert.assertEquals(Assert.java:456)
	at org.apache.solr.search.TestSolr4Spatial.testBadShapeParse400(TestSolr4Spatial.java:91)
	at sun.reflect.NativeMethodAccessorImpl.invoke0(Native Method)
	at sun.reflect.NativeMethodAccessorImpl.invoke(NativeMethodAccessorImpl.java:57)
	at sun.reflect.DelegatingMethodAccessorImpl.invoke(DelegatingMethodAccessorImpl.java:43)
	at java.lang.reflect.Method.invoke(Method.java:606)
	at com.carrotsearch.randomizedtesting.RandomizedRunner.invoke(RandomizedRunner.java:1559)
	at com.carrotsearch.randomizedtesting.RandomizedRunner.access$600(RandomizedRunner.java:79)
	at com.carrotsearch.randomizedtesting.RandomizedRunner$6.evaluate(RandomizedRunner.java:737)
	at com.carrotsearch.randomizedtesting.RandomizedRunner$7.evaluate(RandomizedRunner.java:773)
	at com.carrotsearch.randomizedtesting.RandomizedRunner$8.evaluate(RandomizedRunner.java:787)
	at com.carrotsearch.randomizedtesting.rules.SystemPropertiesRestoreRule$1.evaluate(SystemPropertiesRestoreRule.java:53)
	at org.apache.lucene.util.TestRuleSetupTeardownChained$1.evaluate(TestRuleSetupTeardownChained.java:50)
	at org.apache.lucene.util.TestRuleFieldCacheSanity$1.evaluate(TestRuleFieldCacheSanity.java:51)
	at org.apache.lucene.util.AbstractBeforeAfterRule$1.evaluate(AbstractBeforeAfterRule.java:46)
	at com.carrotsearch.randomizedtesting.rules.SystemPropertiesInvariantRule$1.evaluate(SystemPropertiesInvariantRule.java:55)
	at org.apache.lucene.util.TestRuleThreadAndTestName$1.evaluate(TestRuleThreadAndTestName.java:49)
	at org.apache.lucene.util.TestRuleIgnoreAfterMaxFailures$1.evaluate(TestRuleIgnoreAfterMaxFailures.java:70)
	at org.apache.lucene.util.TestRuleMarkFailure$1.evaluate(TestRuleMarkFailure.java:48)
	at com.carrotsearch.randomizedtesting.rules.StatementAdapter.evaluate(StatementAdapter.java:36)
	at com.carrotsearch.randomizedtesting.ThreadLeakControl$StatementRunner.run(ThreadLeakControl.java:358)
	at com.carrotsearch.randomizedtesting.ThreadLeakControl.forkTimeoutingTask(ThreadLeakControl.java:782)
	at com.carrotsearch.randomizedtesting.ThreadLeakControl$3.evaluate(ThreadLeakControl.java:442)
	at com.carrotsearch.randomizedtesting.RandomizedRunner.runSingleTest(RandomizedRunner.java:746)
	at com.carrotsearch.randomizedtesting.RandomizedRunner$3.evaluate(RandomizedRunner.java:648)
	at com.carrotsearch.randomizedtesting.RandomizedRunner$4.evaluate(RandomizedRunner.java:682)
	at com.carrotsearch.randomizedtesting.RandomizedRunner$5.evaluate(RandomizedRunner.java:693)
	at com.carrotsearch.randomizedtesting.rules.StatementAdapter.evaluate(StatementAdapter.java:36)
	at com.carrotsearch.randomizedtesting.rules.SystemPropertiesRestoreRule$1.evaluate(SystemPropertiesRestoreRule.java:53)
	at org.apache.lucene.util.AbstractBeforeAfterRule$1.evaluate(AbstractBeforeAfterRule.java:46)
	at org.apache.lucene.util.TestRuleStoreClassName$1.evaluate(TestRuleStoreClassName.java:42)
	at com.carrotsearch.randomizedtesting.rules.SystemPropertiesInvariantRule$1.evaluate(SystemPropertiesInvariantRule.java:55)
	at com.carrotsearch.randomizedtesting.rules.NoShadowingOrOverridesOnMethodsRule$1.evaluate(NoShadowingOrOverridesOnMethodsRule.java:39)
	at com.carrotsearch.randomizedtesting.rules.NoShadowingOrOverridesOnMethodsRule$1.evaluate(NoShadowingOrOverridesOnMethodsRule.java:39)
	at com.carrotsearch.randomizedtesting.rules.StatementAdapter.evaluate(StatementAdapter.java:36)
	at org.apache.lucene.util.TestRuleAssertionsRequired$1.evaluate(TestRuleAssertionsRequired.java:43)
	at org.apache.lucene.util.TestRuleMarkFailure$1.evaluate(TestRuleMarkFailure.java:48)
	at org.apache.lucene.util.TestRuleIgnoreAfterMaxFailures$1.evaluate(TestRuleIgnoreAfterMaxFailures.java:70)
	at org.apache.lucene.util.TestRuleIgnoreTestSuites$1.evaluate(TestRuleIgnoreTestSuites.java:55)
	at com.carrotsearch.randomizedtesting.rules.StatementAdapter.evaluate(StatementAdapter.java:36)
	at com.carrotsearch.randomizedtesting.ThreadLeakControl$StatementRunner.run(ThreadLeakControl.java:358)
	at java.lang.Thread.run(Thread.java:744)




Build Log:
[...truncated 9991 lines...]
   [junit4] Suite: org.apache.solr.search.TestSolr4Spatial
   [junit4]   2> 231414 T1187 oas.SolrTestCaseJ4.initCore ####initCore
   [junit4]   2> Creating dataDir: /mnt/ssd/jenkins/workspace/Lucene-Solr-trunk-Linux/solr/build/solr-core/test/J1/./solrtest-TestSolr4Spatial-1391585064734
   [junit4]   2> 231414 T1187 oasc.SolrResourceLoader.<init> new SolrResourceLoader for directory: '/mnt/ssd/jenkins/workspace/Lucene-Solr-trunk-Linux/solr/build/solr-core/test-files/solr/collection1/'
   [junit4]   2> 231415 T1187 oasc.SolrResourceLoader.replaceClassLoader Adding 'file:/mnt/ssd/jenkins/workspace/Lucene-Solr-trunk-Linux/solr/build/solr-core/test-files/solr/collection1/lib/classes/' to classloader
   [junit4]   2> 231415 T1187 oasc.SolrResourceLoader.replaceClassLoader Adding 'file:/mnt/ssd/jenkins/workspace/Lucene-Solr-trunk-Linux/solr/build/solr-core/test-files/solr/collection1/lib/README' to classloader
   [junit4]   2> 231455 T1187 oasc.SolrConfig.<init> Using Lucene MatchVersion: LUCENE_50
   [junit4]   2> 231499 T1187 oasc.SolrConfig.<init> Loaded SolrConfig: solrconfig-basic.xml
   [junit4]   2> 231499 T1187 oass.IndexSchema.readSchema Reading Solr Schema from schema-spatial.xml
   [junit4]   2> 231503 T1187 oass.IndexSchema.readSchema [null] Schema name=test
   [junit4]   2> 231556 T1187 oass.AbstractSpatialFieldType.init WARN Using old worldBounds format? Should use ENVELOPE(xMin, xMax, yMax, yMin).
   [junit4]   2> 231561 T1187 oass.IndexSchema.readSchema unique key field: id
   [junit4]   2> 231562 T1187 oasc.SolrResourceLoader.locateSolrHome JNDI not configured for solr (NoInitialContextEx)
   [junit4]   2> 231562 T1187 oasc.SolrResourceLoader.locateSolrHome using system property solr.solr.home: /mnt/ssd/jenkins/workspace/Lucene-Solr-trunk-Linux/solr/build/solr-core/test-files/solr
   [junit4]   2> 231563 T1187 oasc.SolrResourceLoader.<init> new SolrResourceLoader for directory: '/mnt/ssd/jenkins/workspace/Lucene-Solr-trunk-Linux/solr/build/solr-core/test-files/solr/'
   [junit4]   2> 231574 T1187 oasc.SolrResourceLoader.locateSolrHome JNDI not configured for solr (NoInitialContextEx)
   [junit4]   2> 231575 T1187 oasc.SolrResourceLoader.locateSolrHome using system property solr.solr.home: /mnt/ssd/jenkins/workspace/Lucene-Solr-trunk-Linux/solr/build/solr-core/test-files/solr
   [junit4]   2> 231575 T1187 oasc.SolrResourceLoader.<init> new SolrResourceLoader for deduced Solr Home: '/mnt/ssd/jenkins/workspace/Lucene-Solr-trunk-Linux/solr/build/solr-core/test-files/solr/'
   [junit4]   2> 231625 T1187 oasc.CoreContainer.<init> New CoreContainer 5801960
   [junit4]   2> 231626 T1187 oasc.CoreContainer.load Loading cores into CoreContainer [instanceDir=/mnt/ssd/jenkins/workspace/Lucene-Solr-trunk-Linux/solr/build/solr-core/test-files/solr/]
   [junit4]   2> 231627 T1187 oashc.HttpShardHandlerFactory.getParameter Setting socketTimeout to: 0
   [junit4]   2> 231627 T1187 oashc.HttpShardHandlerFactory.getParameter Setting urlScheme to: http://
   [junit4]   2> 231627 T1187 oashc.HttpShardHandlerFactory.getParameter Setting connTimeout to: 0
   [junit4]   2> 231627 T1187 oashc.HttpShardHandlerFactory.getParameter Setting maxConnectionsPerHost to: 20
   [junit4]   2> 231628 T1187 oashc.HttpShardHandlerFactory.getParameter Setting corePoolSize to: 0
   [junit4]   2> 231628 T1187 oashc.HttpShardHandlerFactory.getParameter Setting maximumPoolSize to: 2147483647
   [junit4]   2> 231628 T1187 oashc.HttpShardHandlerFactory.getParameter Setting maxThreadIdleTime to: 5
   [junit4]   2> 231628 T1187 oashc.HttpShardHandlerFactory.getParameter Setting sizeOfQueue to: -1
   [junit4]   2> 231628 T1187 oashc.HttpShardHandlerFactory.getParameter Setting fairnessPolicy to: false
   [junit4]   2> 231630 T1187 oasl.LogWatcher.createWatcher SLF4J impl is org.slf4j.impl.Log4jLoggerFactory
   [junit4]   2> 231631 T1187 oasl.LogWatcher.newRegisteredLogWatcher Registering Log Listener [Log4j (org.slf4j.impl.Log4jLoggerFactory)]
   [junit4]   2> 231631 T1187 oasc.CoreContainer.load Host Name: 
   [junit4]   2> 231634 T1188 oasc.CoreContainer.create Creating SolrCore 'collection1' using instanceDir: /mnt/ssd/jenkins/workspace/Lucene-Solr-trunk-Linux/solr/build/solr-core/test-files/solr/collection1
   [junit4]   2> 231635 T1188 oasc.SolrResourceLoader.<init> new SolrResourceLoader for directory: '/mnt/ssd/jenkins/workspace/Lucene-Solr-trunk-Linux/solr/build/solr-core/test-files/solr/collection1/'
   [junit4]   2> 231635 T1188 oasc.SolrResourceLoader.replaceClassLoader Adding 'file:/mnt/ssd/jenkins/workspace/Lucene-Solr-trunk-Linux/solr/build/solr-core/test-files/solr/collection1/lib/classes/' to classloader
   [junit4]   2> 231636 T1188 oasc.SolrResourceLoader.replaceClassLoader Adding 'file:/mnt/ssd/jenkins/workspace/Lucene-Solr-trunk-Linux/solr/build/solr-core/test-files/solr/collection1/lib/README' to classloader
   [junit4]   2> 231669 T1188 oasc.SolrConfig.<init> Using Lucene MatchVersion: LUCENE_50
   [junit4]   2> 231713 T1188 oasc.SolrConfig.<init> Loaded SolrConfig: solrconfig-basic.xml
   [junit4]   2> 231713 T1188 oass.IndexSchema.readSchema Reading Solr Schema from schema-spatial.xml
   [junit4]   2> 231717 T1188 oass.IndexSchema.readSchema [collection1] Schema name=test
   [junit4]   2> 231757 T1188 oass.AbstractSpatialFieldType.init WARN Using old worldBounds format? Should use ENVELOPE(xMin, xMax, yMax, yMin).
   [junit4]   2> 231761 T1188 oass.IndexSchema.readSchema unique key field: id
   [junit4]   2> 231762 T1188 oasc.SolrCore.initDirectoryFactory org.apache.solr.core.MockDirectoryFactory
   [junit4]   2> 231762 T1188 oasc.SolrCore.<init> [collection1] Opening new SolrCore at /mnt/ssd/jenkins/workspace/Lucene-Solr-trunk-Linux/solr/build/solr-core/test-files/solr/collection1/, dataDir=/mnt/ssd/jenkins/workspace/Lucene-Solr-trunk-Linux/solr/build/solr-core/test/J1/./solrtest-TestSolr4Spatial-1391585064734/
   [junit4]   2> 231762 T1188 oasc.SolrCore.<init> JMX monitoring not detected for core: collection1
   [junit4]   2> 231763 T1188 oasc.CachingDirectoryFactory.get return new directory for /mnt/ssd/jenkins/workspace/Lucene-Solr-trunk-Linux/solr/build/solr-core/test/J1/./solrtest-TestSolr4Spatial-1391585064734
   [junit4]   2> 231763 T1188 oasc.SolrCore.getNewIndexDir New index directory detected: old=null new=/mnt/ssd/jenkins/workspace/Lucene-Solr-trunk-Linux/solr/build/solr-core/test/J1/./solrtest-TestSolr4Spatial-1391585064734/index/
   [junit4]   2> 231763 T1188 oasc.SolrCore.initIndex WARN [collection1] Solr index directory '/mnt/ssd/jenkins/workspace/Lucene-Solr-trunk-Linux/solr/build/solr-core/test/J1/./solrtest-TestSolr4Spatial-1391585064734/index' doesn't exist. Creating new index...
   [junit4]   2> 231763 T1188 oasc.CachingDirectoryFactory.get return new directory for /mnt/ssd/jenkins/workspace/Lucene-Solr-trunk-Linux/solr/build/solr-core/test/J1/./solrtest-TestSolr4Spatial-1391585064734/index
   [junit4]   2> 231764 T1188 oasu.RandomMergePolicy.<init> RandomMergePolicy wrapping class org.apache.lucene.index.LogByteSizeMergePolicy: [LogByteSizeMergePolicy: minMergeSize=1677721, mergeFactor=3, maxMergeSize=2147483648, maxMergeSizeForForcedMerge=9223372036854775807, calibrateSizeByDeletes=true, maxMergeDocs=2147483647, maxCFSSegmentSizeMB=8.796093022207999E12, noCFSRatio=1.0]
   [junit4]   2> 231764 T1188 oasc.SolrDeletionPolicy.onCommit SolrDeletionPolicy.onCommit: commits: num=1
   [junit4]   2> 		commit{dir=MockDirectoryWrapper(RAMDirectory@1decc12 lockFactory=org.apache.lucene.store.SingleInstanceLockFactory@183bc2f),segFN=segments_1,generation=1}
   [junit4]   2> 231765 T1188 oasc.SolrDeletionPolicy.updateCommits newest commit generation = 1
   [junit4]   2> 231765 T1188 oasc.SolrCore.loadUpdateProcessorChains no updateRequestProcessorChain defined as default, creating implicit default
   [junit4]   2> 231766 T1188 oasc.RequestHandlers.initHandlersFromConfig created standard: solr.StandardRequestHandler
   [junit4]   2> 231766 T1188 oasc.RequestHandlers.initHandlersFromConfig created /update: solr.UpdateRequestHandler
   [junit4]   2> 231768 T1188 oashl.XMLLoader.init xsltCacheLifetimeSeconds=60
   [junit4]   2> 231770 T1188 oasu.CommitTracker.<init> Hard AutoCommit: disabled
   [junit4]   2> 231771 T1188 oasu.CommitTracker.<init> Soft AutoCommit: disabled
   [junit4]   2> 231771 T1188 oasu.RandomMergePolicy.<init> RandomMergePolicy wrapping class org.apache.lucene.index.TieredMergePolicy: [TieredMergePolicy: maxMergeAtOnce=48, maxMergeAtOnceExplicit=48, maxMergedSegmentMB=25.5869140625, floorSegmentMB=2.029296875, forceMergeDeletesPctAllowed=21.696036973709525, segmentsPerTier=45.0, maxCFSSegmentSizeMB=8.796093022207999E12, noCFSRatio=0.480100808431727
   [junit4]   2> 231771 T1188 oasc.SolrDeletionPolicy.onInit SolrDeletionPolicy.onInit: commits: num=1
   [junit4]   2> 		commit{dir=MockDirectoryWrapper(RAMDirectory@1decc12 lockFactory=org.apache.lucene.store.SingleInstanceLockFactory@183bc2f),segFN=segments_1,generation=1}
   [junit4]   2> 231771 T1188 oasc.SolrDeletionPolicy.updateCommits newest commit generation = 1
   [junit4]   2> 231772 T1188 oass.SolrIndexSearcher.<init> Opening Searcher@3cc532 main
   [junit4]   2> 231772 T1189 oasc.SolrCore.registerSearcher [collection1] Registered new searcher Searcher@3cc532 main{StandardDirectoryReader(segments_1:1:nrt)}
   [junit4]   2> 231772 T1188 oasc.CoreContainer.registerCore registering core: collection1
   [junit4]   2> 231774 T1187 oas.SolrTestCaseJ4.initCore ####initCore end
   [junit4]   2> 231777 T1187 oas.SolrTestCaseJ4.setUp ###Starting testSortMultiVal {p0=srpt_geohash}
   [junit4]   2> ASYNC  NEW_CORE C273 name=collection1 org.apache.solr.core.SolrCore@32817e
   [junit4]   2> 231777 T1187 C273 oasu.DirectUpdateHandler2.deleteAll [collection1] REMOVING ALL DOCUMENTS FROM INDEX
   [junit4]   2> 231778 T1187 C273 oasup.LogUpdateProcessor.finish [collection1] webapp=null path=null params={} {deleteByQuery=*:*} 0 1
   [junit4]   2> 231780 T1187 C273 oasu.DirectUpdateHandler2.commit start commit{,optimize=false,openSearcher=true,waitSearcher=true,expungeDeletes=false,softCommit=false,prepareCommit=false}
   [junit4]   2> 231781 T1187 C273 oasc.SolrDeletionPolicy.onCommit SolrDeletionPolicy.onCommit: commits: num=2
   [junit4]   2> 		commit{dir=MockDirectoryWrapper(RAMDirectory@1decc12 lockFactory=org.apache.lucene.store.SingleInstanceLockFactory@183bc2f),segFN=segments_1,generation=1}
   [junit4]   2> 		commit{dir=MockDirectoryWrapper(RAMDirectory@1decc12 lockFactory=org.apache.lucene.store.SingleInstanceLockFactory@183bc2f),segFN=segments_2,generation=2}
   [junit4]   2> 231782 T1187 C273 oasc.SolrDeletionPolicy.updateCommits newest commit generation = 2
   [junit4]   2> 231782 T1187 C273 oass.SolrIndexSearcher.<init> Opening Searcher@ba3481 main
   [junit4]   2> 231782 T1187 C273 oasu.DirectUpdateHandler2.commit end_commit_flush
   [junit4]   2> 231782 T1189 oasc.SolrCore.registerSearcher [collection1] Registered new searcher Searcher@ba3481 main{StandardDirectoryReader(segments_2:2:nrt)}
   [junit4]   2> 231783 T1187 C273 oasup.LogUpdateProcessor.finish [collection1] webapp=null path=null params={} {commit=} 0 3
   [junit4]   2> 231810 T1187 C273 oass.AbstractSpatialPrefixTreeFieldType.newSpatialStrategy srpt_geohash{class=org.apache.solr.schema.SpatialRecursivePrefixTreeFieldType,analyzer=org.apache.solr.schema.FieldType$DefaultAnalyzer,args={units=degrees, class=solr.SpatialRecursivePrefixTreeFieldType, prefixTree=geohash}} strat: RecursivePrefixTreeStrategy(prefixGridScanLevel:7,SPG:(GeohashPrefixTree(maxLevels:11,ctx:SpatialContext{geo=true, calculator=Haversine, worldBounds=Rect(minX=-180.0,maxX=180.0,minY=-90.0,maxY=90.0)}))) maxLevels: 11
   [junit4]   2> 231814 T1187 C273 oasup.LogUpdateProcessor.finish [collection1] webapp=null path=null params={} {add=[100]} 0 29
   [junit4]   2> 231816 T1187 C273 oasup.LogUpdateProcessor.finish [collection1] webapp=null path=null params={} {add=[101]} 0 0
   [junit4]   2> 231817 T1187 C273 oasu.DirectUpdateHandler2.commit start commit{,optimize=false,openSearcher=true,waitSearcher=true,expungeDeletes=false,softCommit=false,prepareCommit=false}
   [junit4]   2> 231819 T1187 C273 oasc.SolrDeletionPolicy.onCommit SolrDeletionPolicy.onCommit: commits: num=2
   [junit4]   2> 		commit{dir=MockDirectoryWrapper(RAMDirectory@1decc12 lockFactory=org.apache.lucene.store.SingleInstanceLockFactory@183bc2f),segFN=segments_2,generation=2}
   [junit4]   2> 		commit{dir=MockDirectoryWrapper(RAMDirectory@1decc12 lockFactory=org.apache.lucene.store.SingleInstanceLockFactory@183bc2f),segFN=segments_3,generation=3}
   [junit4]   2> 231819 T1187 C273 oasc.SolrDeletionPolicy.updateCommits newest commit generation = 3
   [junit4]   2> 231820 T1187 C273 oass.SolrIndexSearcher.<init> Opening Searcher@1694102 main
   [junit4]   2> 231820 T1187 C273 oasu.DirectUpdateHandler2.commit end_commit_flush
   [junit4]   2> 231820 T1189 oasc.SolrCore.registerSearcher [collection1] Registered new searcher Searcher@1694102 main{StandardDirectoryReader(segments_3:4:nrt _0(5.0):C2)}
   [junit4]   2> 231821 T1187 C273 oasup.LogUpdateProcessor.finish [collection1] webapp=null path=null params={} {commit=} 0 4
   [junit4]   2> 231844 T1187 C273 oasc.SolrCore.execute [collection1] webapp=null path=null params={sort=score+asc&fl=id,score&q={!+score%3Ddistance++}srpt_geohash:"Intersects(BUFFER(POINT(4.0+3.0),9.0))"} hits=2 status=0 QTime=22 
   [junit4]   2> 231847 T1187 oas.SolrTestCaseJ4.tearDown ###Ending testSortMultiVal {p0=srpt_geohash}
   [junit4]   2> 231851 T1187 oas.SolrTestCaseJ4.setUp ###Starting testIntersectFilter {p0=srpt_geohash}
   [junit4]   2> 231851 T1187 C273 oasu.DirectUpdateHandler2.deleteAll [collection1] REMOVING ALL DOCUMENTS FROM INDEX
   [junit4]   2> 231852 T1187 C273 oasup.LogUpdateProcessor.finish [collection1] webapp=null path=null params={} {deleteByQuery=*:*} 0 1
   [junit4]   2> 231853 T1187 C273 oasu.DirectUpdateHandler2.commit start commit{,optimize=false,openSearcher=true,waitSearcher=true,expungeDeletes=false,softCommit=false,prepareCommit=false}
   [junit4]   2> 231853 T1187 C273 oasc.SolrDeletionPolicy.onCommit SolrDeletionPolicy.onCommit: commits: num=2
   [junit4]   2> 		commit{dir=MockDirectoryWrapper(RAMDirectory@1decc12 lockFactory=org.apache.lucene.store.SingleInstanceLockFactory@183bc2f),segFN=segments_3,generation=3}
   [junit4]   2> 		commit{dir=MockDirectoryWrapper(RAMDirectory@1decc12 lockFactory=org.apache.lucene.store.SingleInstanceLockFactory@183bc2f),segFN=segments_4,generation=4}
   [junit4]   2> 231854 T1187 C273 oasc.SolrDeletionPolicy.updateCommits newest commit generation = 4
   [junit4]   2> 231854 T1187 C273 oass.SolrIndexSearcher.<init> Opening Searcher@1ceb35d main
   [junit4]   2> 231855 T1187 C273 oasu.DirectUpdateHandler2.commit end_commit_flush
   [junit4]   2> 231855 T1189 oasc.SolrCore.registerSearcher [collection1] Registered new searcher Searcher@1ceb35d main{StandardDirectoryReader(segments_4:5:nrt)}
   [junit4]   2> 231855 T1187 C273 oasup.LogUpdateProcessor.finish [collection1] webapp=null path=null params={} {commit=} 0 2
   [junit4]   2> 231857 T1187 C273 oasup.LogUpdateProcessor.finish [collection1] webapp=null path=null params={} {add=[1]} 0 0
   [junit4]   2> 231859 T1187 C273 oasup.LogUpdateProcessor.finish [collection1] webapp=null path=null params={} {add=[2]} 0 1
   [junit4]   2> 231860 T1187 C273 oasup.LogUpdateProcessor.finish [collection1] webapp=null path=null params={} {add=[3]} 0 0
   [junit4]   2> 231861 T1187 C273 oasup.LogUpdateProcessor.finish [collection1] webapp=null path=null params={} {add=[4]} 0 0
   [junit4]   2> 231863 T1187 C273 oasup.LogUpdateProcessor.finish [collection1] webapp=null path=null params={} {add=[5]} 0 1
   [junit4]   2> 231864 T1187 C273 oasup.LogUpdateProcessor.finish [collection1] webapp=null path=null params={} {add=[6]} 0 0
   [junit4]   2> 231865 T1187 C273 oasup.LogUpdateProcessor.finish [collection1] webapp=null path=null params={} {add=[7]} 0 0
   [junit4]   2> 231867 T1187 C273 oasup.LogUpdateProcessor.finish [collection1] webapp=null path=null params={} {add=[8]} 0 0
   [junit4]   2> 231868 T1187 C273 oasup.LogUpdateProcessor.finish [collection1] webapp=null path=null params={} {add=[9]} 0 0
   [junit4]   2> 231870 T1187 C273 oasup.LogUpdateProcessor.finish [collection1] webapp=null path=null params={} {add=[10]} 0 0
   [junit4]   2> 231871 T1187 C273 oasup.LogUpdateProcessor.finish [collection1] webapp=null path=null params={} {add=[11]} 0 0
   [junit4]   2> 231872 T1187 C273 oasup.LogUpdateProcessor.finish [collection1] webapp=null path=null params={} {add=[12]} 0 0
   [junit4]   2> 231874 T1187 C273 oasup.LogUpdateProcessor.finish [collection1] webapp=null path=null params={} {add=[13]} 0 0
   [junit4]   2> 231875 T1187 C273 oasu.DirectUpdateHandler2.commit start commit{,optimize=false,openSearcher=true,waitSearcher=true,expungeDeletes=false,softCommit=false,prepareCommit=false}
   [junit4]   2> 231877 T1187 C273 oasc.SolrDeletionPolicy.onCommit SolrDeletionPolicy.onCommit: commits: num=2
   [junit4]   2> 		commit{dir=MockDirectoryWrapper(RAMDirectory@1decc12 lockFactory=org.apache.lucene.store.SingleInstanceLockFactory@183bc2f),segFN=segments_4,generation=4}
   [junit4]   2> 		commit{dir=MockDirectoryWrapper(RAMDirectory@1decc12 lockFactory=org.apache.lucene.store.SingleInstanceLockFactory@183bc2f),segFN=segments_5,generation=5}
   [junit4]   2> 231877 T1187 C273 oasc.SolrDeletionPolicy.updateCommits newest commit generation = 5
   [junit4]   2> 231878 T1187 C273 oass.SolrIndexSearcher.<init> Opening Searcher@4bf8bd main
   [junit4]   2> 231878 T1187 C273 oasu.DirectUpdateHandler2.commit end_commit_flush
   [junit4]   2> 231878 T1189 oasc.SolrCore.registerSearcher [collection1] Registered new searcher Searcher@4bf8bd main{StandardDirectoryReader(segments_5:7:nrt _1(5.0):C13)}
   [junit4]   2> 231879 T1187 C273 oasup.LogUpdateProcessor.finish [collection1] webapp=null path=null params={} {commit=} 0 4
   [junit4]   2> 231883 T1187 C273 oasc.SolrCore.execute [collection1] webapp=null path=null params={fl=id&q=*:*&fq={!field+f%3Dsrpt_geohash}Intersects(BUFFER(POINT(1.0+1.0),1.5738106435829113))&rows=1000} hits=3 status=0 QTime=2 
   [junit4]   2> 231890 T1187 C273 oasc.SolrCore.execute [collection1] webapp=null path=null params={fl=id&q=*:*&fq={!geofilt+sfield%3Dsrpt_geohash+pt%3D'1,1'+d%3D175.0}&rows=1000} hits=3 status=0 QTime=3 
   [junit4]   2> 231896 T1187 C273 oasc.SolrCore.execute [collection1] webapp=null path=null params={fl=id&q=*:*&fq={!field+f%3Dsrpt_geohash}Intersects(BUFFER(POINT(179.8+0.0),1.798640735523327))&rows=1000} hits=2 status=0 QTime=2 
   [junit4]   2> 231902 T1187 C273 oasc.SolrCore.execute [collection1] webapp=null path=null params={fl=id&q=*:*&fq={!geofilt+sfield%3Dsrpt_geohash+pt%3D'0,179.8'+d%3D200.0}&rows=1000} hits=2 status=0 QTime=3 
   [junit4]   2> 231907 T1187 C273 oasc.SolrCore.execute [collection1] webapp=null path=null params={fl=id&q=*:*&fq={!field+f%3Dsrpt_geohash+score%3Ddistance}Intersects(BUFFER(POINT(50.0+89.8),1.798640735523327))&rows=1000} hits=2 status=0 QTime=2 
   [junit4]   2> 231911 T1187 C273 oasc.SolrCore.execute [collection1] webapp=null path=null params={fl=id&q=*:*&fq={!geofilt+sfield%3Dsrpt_geohash+pt%3D'89.8,+50'+d%3D200.0}&rows=1000} hits=2 status=0 QTime=1 
   [junit4]   2> 231916 T1187 C273 oasc.SolrCore.execute [collection1] webapp=null path=null params={fl=id&q=*:*&fq={!field+f%3Dsrpt_geohash+score%3Ddistance}Intersects(BUFFER(POINT(50.0+-89.8),1.798640735523327))&rows=1000} hits=2 status=0 QTime=2 
   [junit4]   2> 231920 T1187 C273 oasc.SolrCore.execute [collection1] webapp=null path=null params={fl=id&q=*:*&fq={!geofilt+sfield%3Dsrpt_geohash+pt%3D'-89.8,+50'+d%3D200.0}&rows=1000} hits=2 status=0 QTime=1 
   [junit4]   2> 231924 T1187 C273 oasc.SolrCore.execute [collection1] webapp=null path=null params={fl=id&q=*:*&fq={!field+f%3Dsrpt_geohash+score%3Ddistance}Intersects(BUFFER(POINT(-80.0+33.0),2.6979611032849906))&rows=1000} hits=2 status=0 QTime=1 
   [junit4]   2> 231926 T1187 C273 oasc.SolrCore.execute [collection1] webapp=null path=null params={fl=id&q=*:*&fq={!geofilt+sfield%3Dsrpt_geohash+pt%3D'33.0,-80.0'+d%3D300.0}&rows=1000} hits=2 status=0 QTime=0 
   [junit4]   2> 231929 T1187 C273 oasc.SolrCore.execute [collection1] webapp=null path=null params={fl=id&q=*:*&fq={!field+f%3Dsrpt_geohash+score%3Ddistance}Intersects(BUFFER(POINT(1.0+1.0),44.96601838808318))&rows=1000} hits=3 status=0 QTime=1 
   [junit4]   2> 231934 T1187 C273 oasc.SolrCore.execute [collection1] webapp=null path=null params={fl=id&q=*:*&fq={!geofilt+sfield%3Dsrpt_geohash+pt%3D'1,1'+d%3D5000.0}&rows=1000} hits=3 status=0 QTime=1 
   [junit4]   2> 231940 T1187 C273 oasc.SolrCore.execute [collection1] webapp=null path=null params={fl=id&q=*:*&fq={!field+f%3Dsrpt_geohash+score%3DrecipDistance}Intersects(ENVELOPE(-0.034898260626377464,+0.23489826062637748,+0.23489805516424955,+-0.03489805516424954))&rows=1000} hits=2 status=0 QTime=2 
   [junit4]   2> 231945 T1187 C273 oasc.SolrCore.execute [collection1] webapp=null path=null params={fl=id&q=*:*&fq={!bbox+sfield%3Dsrpt_geohash+pt%3D'0.1,0.1'+d%3D15.0}&rows=1000} hits=2 status=0 QTime=1 
   [junit4]   2> 231948 T1187 C273 oasu.DirectUpdateHandler2.deleteAll [collection1] REMOVING ALL DOCUMENTS FROM INDEX
   [junit4]   2> 231948 T1187 C273 oasup.LogUpdateProcessor.finish [collection1] webapp=null path=null params={} {deleteByQuery=*:*} 0 0
   [junit4]   2> 231950 T1187 C273 oasup.LogUpdateProcessor.finish [collection1] webapp=null path=null params={} {add=[14]} 0 0
   [junit4]   2> 231951 T1187 C273 oasup.LogUpdateProcessor.finish [collection1] webapp=null path=null params={} {add=[15]} 0 0
   [junit4]   2> 231953 T1187 C273 oasup.LogUpdateProcessor.finish [collection1] webapp=null path=null params={} {add=[16]} 0 0
   [junit4]   2> 231954 T1187 C273 oasup.LogUpdateProcessor.finish [collection1] webapp=null path=null params={} {add=[17]} 0 0
   [junit4]   2> 231956 T1187 C273 oasu.DirectUpdateHandler2.commit start commit{,optimize=false,openSearcher=true,waitSearcher=true,expungeDeletes=false,softCommit=false,prepareCommit=false}
   [junit4]   2> 231957 T1187 C273 oasc.SolrDeletionPolicy.onCommit SolrDeletionPolicy.onCommit: commits: num=2
   [junit4]   2> 		commit{dir=MockDirectoryWrapper(RAMDirectory@1decc12 lockFactory=org.apache.lucene.store.SingleInstanceLockFactory@183bc2f),segFN=segments_5,generation=5}
   [junit4]   2> 		commit{dir=MockDirectoryWrapper(RAMDirectory@1decc12 lockFactory=org.apache.lucene.store.SingleInstanceLockFactory@183bc2f),segFN=segments_6,generation=6}
   [junit4]   2> 231957 T1187 C273 oasc.SolrDeletionPolicy.updateCommits newest commit generation = 6
   [junit4]   2> 231958 T1187 C273 oass.SolrIndexSearcher.<init> Opening Searcher@1095f95 main
   [junit4]   2> 231959 T1187 C273 oasu.DirectUpdateHandler2.commit end_commit_flush
   [junit4]   2> 231959 T1189 oasc.SolrCore.registerSearcher [collection1] Registered new searcher Searcher@1095f95 main{StandardDirectoryReader(segments_6:10:nrt _2(5.0):C4)}
   [junit4]   2> 231959 T1187 C273 oasup.LogUpdateProcessor.finish [collection1] webapp=null path=null params={} {commit=} 0 4
   [junit4]   2> 231961 T1187 C273 oasc.SolrCore.execute [collection1] webapp=null path=null params={fl=id&q=*:*&fq={!field+f%3Dsrpt_geohash}Intersects(BUFFER(POINT(0.0+0.0),8.993203677616636))&rows=1000} hits=1 status=0 QTime=0 
   [junit4]   2> 231964 T1187 C273 oasc.SolrCore.execute [collection1] webapp=null path=null params={fl=id&q=*:*&fq={!geofilt+sfield%3Dsrpt_geohash+pt%3D'0,0'+d%3D1000.0}&rows=1000} hits=1 status=0 QTime=1 
   [junit4]   2> 231968 T1187 C273 oasc.SolrCore.execute [collection1] webapp=null path=null params={fl=id&q=*:*&fq={!field+f%3Dsrpt_geohash}Intersects(BUFFER(POINT(0.0+0.0),17.986407355233272))&rows=1000} hits=2 status=0 QTime=1 
   [junit4]   2> 231973 T1187 C273 oasc.SolrCore.execute [collection1] webapp=null path=null params={fl=id&q=*:*&fq={!geofilt+sfield%3Dsrpt_geohash+pt%3D'0,0'+d%3D2000.0}&rows=1000} hits=2 status=0 QTime=1 
   [junit4]   2> 231977 T1187 C273 oasc.SolrCore.execute [collection1] webapp=null path=null params={fl=id&q=*:*&fq={!field+f%3Dsrpt_geohash+score%3Dnone}Intersects(ENVELOPE(-26.979611032849906,+26.979611032849906,+26.979611032849906,+-26.979611032849906))&rows=1000} hits=3 status=0 QTime=1 
   [junit4]   2> 231981 T1187 C273 oasc.SolrCore.execute [collection1] webapp=null path=null params={fl=id&q=*:*&fq={!bbox+sfield%3Dsrpt_geohash+pt%3D'0,0'+d%3D3000.0}&rows=1000} hits=3 status=0 QTime=0 
   [junit4]   2> 231987 T1187 C273 oasc.SolrCore.execute [collection1] webapp=null path=null params={fl=id&q=*:*&fq={!field+f%3Dsrpt_geohash}Intersects(BUFFER(POINT(0.0+0.0),26.98860423652752))&rows=1000} hits=3 status=0 QTime=1 
   [junit4]   2> 231991 T1187 C273 oasc.SolrCore.execute [collection1] webapp=null path=null params={fl=id&q=*:*&fq={!geofilt+sfield%3Dsrpt_geohash+pt%3D'0,0'+d%3D3001.0}&rows=1000} hits=3 status=0 QTime=1 
   [junit4]   2> 231996 T1187 C273 oasc.SolrCore.execute [collection1] webapp=null path=null params={fl=id&q=*:*&fq={!field+f%3Dsrpt_geohash}Intersects(BUFFER(POINT(0.0+0.0),26.980510353217664))&rows=1000} hits=3 status=0 QTime=1 
   [junit4]   2> 232001 T1187 C273 oasc.SolrCore.execute [collection1] webapp=null path=null params={fl=id&q=*:*&fq={!geofilt+sfield%3Dsrpt_geohash+pt%3D'0,0'+d%3D3000.1}&rows=1000} hits=3 status=0 QTime=1 
   [junit4]   2> 232006 T1187 C273 oasc.SolrCore.execute [collection1] webapp=null path=null params={fl=id&q=*:*&fq={!field+f%3Dsrpt_geohash+score%3Dnone}Intersects(BUFFER(POINT(-96.789603+43.51703),0.9802592008602133))&rows=1000} hits=0 status=0 QTime=1 
   [junit4]   2> 232007 T1187 C273 oasc.SolrCore.execute [collection1] webapp=null path=null params={fl=id&q=*:*&fq={!geofilt+sfield%3Dsrpt_geohash+pt%3D'43.517030,-96.789603'+d%3D109.0}&rows=1000} hits=0 status=0 QTime=0 
   [junit4]   2> 232009 T1187 C273 oasc.SolrCore.execute [collection1] webapp=null path=null params={fl=id&q=*:*&fq={!field+f%3Dsrpt_geohash+score%3Dnone}Intersects(BUFFER(POINT(-96.789603+43.51703),0.9892524045378299))&rows=1000} hits=0 status=0 QTime=0 
   [junit4]   2> 232011 T1187 C273 oasc.SolrCore.execute [collection1] webapp=null path=null params={fl=id&q=*:*&fq={!geofilt+sfield%3Dsrpt_geohash+pt%3D'43.517030,-96.789603'+d%3D110.0}&rows=1000} hits=0 status=0 QTime=1 
   [junit4]   2> 232013 T1187 C273 oasc.SolrCore.execute [collection1] webapp=null path=null params={fl=id&q=*:*&fq={!field+f%3Dsrpt_geohash+score%3DrecipDistance}Intersects(ENVELOPE(-98.15383081481679,+-95.42537518518321,+44.50628240453783,+42.52777759546217))&rows=1000} hits=1 status=0 QTime=1 
   [junit4]   2> 232016 T1187 C273 oasc.SolrCore.execute [collection1] webapp=null path=null params={fl=id&q=*:*&fq={!bbox+sfield%3Dsrpt_geohash+pt%3D'43.517030,-96.789603'+d%3D110.0}&rows=1000} hits=1 status=0 QTime=1 
   [junit4]   2> 232018 T1187 oas.SolrTestCaseJ4.tearDown ###Ending testIntersectFilter {p0=srpt_geohash}
   [junit4]   2> 232022 T1187 oas.SolrTestCaseJ4.setUp ###Starting checkQueryEmptyIndex {p0=srpt_geohash}
   [junit4]   2> 232023 T1187 C273 oasu.DirectUpdateHandler2.deleteAll [collection1] REMOVING ALL DOCUMENTS FROM INDEX
   [junit4]   2> 232023 T1187 C273 oasup.LogUpdateProcessor.finish [collection1] webapp=null path=null params={} {deleteByQuery=*:*} 0 1
   [junit4]   2> 232024 T1187 C273 oasu.DirectUpdateHandler2.commit start commit{,optimize=false,openSearcher=true,waitSearcher=true,expungeDeletes=false,softCommit=false,prepareCommit=false}
   [junit4]   2> 232025 T1187 C273 oasc.SolrDeletionPolicy.onCommit SolrDeletionPolicy.onCommit: commits: num=2
   [junit4]   2> 		commit{dir=MockDirectoryWrapper(RAMDirectory@1decc12 lockFactory=org.apache.lucene.store.SingleInstanceLockFactory@183bc2f),segFN=segments_6,generation=6}
   [junit4]   2> 		commit{dir=MockDirectoryWrapper(RAMDirectory@1decc12 lockFactory=org.apache.lucene.store.SingleInstanceLockFactory@183bc2f),segFN=segments_7,generation=7}
   [junit4]   2> 232025 T1187 C273 oasc.SolrDeletionPolicy.updateCommits newest commit generation = 7
   [junit4]   2> 232026 T1187 C273 oass.SolrIndexSearcher.<init> Opening Searcher@28d5bb main
   [junit4]   2> 232026 T1187 C273 oasu.DirectUpdateHandler2.commit end_commit_flush
   [junit4]   2> 232026 T1189 oasc.SolrCore.registerSearcher [collection1] Registered new searcher Searcher@28d5bb main{StandardDirectoryReader(segments_7:11:nrt)}
   [junit4]   2> 232027 T1187 C273 oasup.LogUpdateProcessor.finish [collection1] webapp=null path=null params={} {commit=} 0 3
   [junit4]   2> 232028 T1187 C273 oasc.SolrCore.execute [collection1] webapp=null path=null params={fl=id&q=*:*&fq={!field+f%3Dsrpt_geohash+score%3Ddistance}Intersects(BUFFER(POINT(0.0+0.0),0.8993203677616635))&rows=1000} hits=0 status=0 QTime=0 
   [junit4]   2> 232030 T1187 C273 oasc.SolrCore.execute [collection1] webapp=null path=null params={fl=id&q=*:*&fq={!geofilt+sfield%3Dsrpt_geohash+pt%3D'0,0'+d%3D100.0}&rows=1000} hits=0 status=0 QTime=1 
   [junit4]   2> 232031 T1187 oas.SolrTestCaseJ4.tearDown ###Ending checkQueryEmptyIndex {p0=srpt_geohash}
   [junit4]   2> 232035 T1187 oas.SolrTestCaseJ4.setUp ###Starting solr4OldShapeSyntax {p0=srpt_geohash}
   [junit4]   2> 232035 T1187 C273 oasu.DirectUpdateHandler2.deleteAll [collection1] REMOVING ALL DOCUMENTS FROM INDEX
   [junit4]   2> 232035 T1187 C273 oasup.LogUpdateProcessor.finish [collection1] webapp=null path=null params={} {deleteByQuery=*:*} 0 0
   [junit4]   2> 232037 T1187 C273 oasu.DirectUpdateHandler2.commit start commit{,optimize=false,openSearcher=true,waitSearcher=true,expungeDeletes=false,softCommit=false,prepareCommit=false}
   [junit4]   2> 232037 T1187 C273 oasc.SolrDeletionPolicy.onCommit SolrDeletionPolicy.onCommit: commits: num=2
   [junit4]   2> 		commit{dir=MockDirectoryWrapper(RAMDirectory@1decc12 lockFactory=org.apache.lucene.store.SingleInstanceLockFactory@183bc2f),segFN=segments_7,generation=7}
   [junit4]   2> 		commit{dir=MockDirectoryWrapper(RAMDirectory@1decc12 lockFactory=org.apache.lucene.store.SingleInstanceLockFactory@183bc2f),segFN=segments_8,generation=8}
   [junit4]   2> 232038 T1187 C273 oasc.SolrDeletionPolicy.updateCommits newest commit generation = 8
   [junit4]   2> 232038 T1187 C273 oass.SolrIndexSearcher.<init> Opening Searcher@1d4fae8 main
   [junit4]   2> 232039 T1187 C273 oasu.DirectUpdateHandler2.commit end_commit_flush
   [junit4]   2> 232039 T1189 oasc.SolrCore.registerSearcher [collection1] Registered new searcher Searcher@1d4fae8 main{StandardDirectoryReader(segments_8:12:nrt)}
   [junit4]   2> 232039 T1187 C273 oasup.LogUpdateProcessor.finish [collection1] webapp=null path=null params={} {commit=} 0 2
   [junit4]   2> 232042 T1187 oass.AbstractSpatialPrefixTreeFieldType.newSpatialStrategy stqpt_u_oldworldbounds{class=org.apache.solr.schema.SpatialTermQueryPrefixTreeFieldType,analyzer=org.apache.solr.schema.FieldType$DefaultAnalyzer,args={units=degrees, class=solr.SpatialTermQueryPrefixTreeFieldType, distCalculator=cartesian^2, geo=false, worldBounds=0 0 1000 1000}} strat: TermQueryPrefixTreeStrategy field:foo ctx=SpatialContext{geo=false, calculator=CartesianDistCalc, worldBounds=Rect(minX=0.0,maxX=1000.0,minY=0.0,maxY=1000.0)} maxLevels: 50
   [junit4]   2> 232049 T1187 C273 oasup.LogUpdateProcessor.finish [collection1] webapp=null path=null params={} {add=[rect]} 0 7
   [junit4]   2> 232059 T1187 C273 oasup.LogUpdateProcessor.finish [collection1] webapp=null path=null params={} {add=[circ]} 0 9
   [junit4]   2> 232060 T1187 C273 oasu.DirectUpdateHandler2.commit start commit{,optimize=false,openSearcher=true,waitSearcher=true,expungeDeletes=false,softCommit=false,prepareCommit=false}
   [junit4]   2> 232078 T1187 C273 oasc.SolrDeletionPolicy.onCommit SolrDeletionPolicy.onCommit: commits: num=2
   [junit4]   2> 		commit{dir=MockDirectoryWrapper(RAMDirectory@1decc12 lockFactory=org.apache.lucene.store.SingleInstanceLockFactory@183bc2f),segFN=segments_8,generation=8}
   [junit4]   2> 		commit{dir=MockDirectoryWrapper(RAMDirectory@1decc12 lockFactory=org.apache.lucene.store.SingleInstanceLockFactory@183bc2f),segFN=segments_9,generation=9}
   [junit4]   2> 232079 T1187 C273 oasc.SolrDeletionPolicy.updateCommits newest commit generation = 9
   [junit4]   2> 232080 T1187 C273 oass.SolrIndexSearcher.<init> Opening Searcher@18f383f main
   [junit4]   2> 232080 T1187 C273 oasu.DirectUpdateHandler2.commit end_commit_flush
   [junit4]   2> 232080 T1189 oasc.SolrCore.registerSearcher [collection1] Registered new searcher Searcher@18f383f main{StandardDirectoryReader(segments_9:14:nrt _3(5.0):C2)}
   [junit4]   2> 232081 T1187 C273 oasup.LogUpdateProcessor.finish [collection1] webapp=null path=null params={} {commit=} 0 21
   [junit4]   2> 232098 T1187 C273 oasc.SolrCore.execute [collection1] webapp=null path=null params={q={!field+f%3Dsrpt_geohash}Intersects(-74.093+41.042+-69.347+44.558)} hits=1 status=0 QTime=16 
   [junit4]   2> 232106 T1187 C273 oasc.SolrCore.execute [collection1] webapp=null path=null params={q={!field+f%3Dsrpt_geohash}Intersects(Circle(4.56,1.23+d%3D0.0710))} hits=1 status=0 QTime=8 
   [junit4]   2> 232107 T1187 oas.SolrTestCaseJ4.tearDown ###Ending solr4OldShapeSyntax {p0=srpt_geohash}
   [junit4]   2> 232111 T1187 oas.SolrTestCaseJ4.setUp ###Starting testBadShapeParse400 {p0=srpt_geohash}
   [junit4]   2> 232111 T1187 C273 oasu.DirectUpdateHandler2.deleteAll [collection1] REMOVING ALL DOCUMENTS FROM INDEX
   [junit4]   2> 232112 T1187 C273 oasup.LogUpdateProcessor.finish [collection1] webapp=null path=null params={} {deleteByQuery=*:*} 0 1
   [junit4]   2> 232113 T1187 C273 oasu.DirectUpdateHandler2.commit start commit{,optimize=false,openSearcher=true,waitSearcher=true,expungeDeletes=false,softCommit=false,prepareCommit=false}
   [junit4]   2> 232114 T1187 C273 oasc.SolrDeletionPolicy.onCommit SolrDeletionPolicy.onCommit: commits: num=2
   [junit4]   2> 		commit{dir=MockDirectoryWrapper(RAMDirectory@1decc12 lockFactory=org.apache.lucene.store.SingleInstanceLockFactory@183bc2f),segFN=segments_9,generation=9}
   [junit4]   2> 		commit{dir=MockDirectoryWrapper(RAMDirectory@1decc12 lockFactory=org.apache.lucene.store.SingleInstanceLockFactory@183bc2f),segFN=segments_a,generation=10}
   [junit4]   2> 232114 T1187 C273 oasc.SolrDeletionPolicy.updateCommits newest commit generation = 10
   [junit4]   2> 232115 T1187 C273 oass.SolrIndexSearcher.<init> Opening Searcher@d365b5 main
   [junit4]   2> 232115 T1187 C273 oasu.DirectUpdateHandler2.commit end_commit_flush
   [junit4]   2> 232115 T1189 oasc.SolrCore.registerSearcher [collection1] Registered new searcher Searcher@d365b5 main{StandardDirectoryReader(segments_a:15:nrt)}
   [junit4]   2> 232116 T1187 C273 oasup.LogUpdateProcessor.finish [collection1] webapp=null path=null params={} {commit=} 0 3
   [junit4]   2> 232118 T1187 C273 oasc.SolrException.log Ignoring exception matching .
   [junit4]   2> 232118 T1187 C273 oasc.SolrCore.execute [collection1] webapp=null path=null params={fl=id,srpt_geohash&q=*:*&fq={!field+f%3Dsrpt_geohash}Intersects(NonexistentShape(89.9,-130+d%3D9))&rows=1000} status=400 QTime=1 
   [junit4]   2> 232119 T1187 C273 oasc.SolrException.log Ignoring exception matching .
   [junit4]   2> 232119 T1187 C273 oasc.SolrCore.execute [collection1] webapp=null path=null params={fl=id,srpt_geohash&q=*:*&fq={!field+f%3Dsrpt_geohash}Intersects(NonexistentShape(89.9,-130+d%3D9&rows=1000} status=400 QTime=1 
   [junit4]   2> 232120 T1187 C273 oasc.SolrException.log Ignoring exception matching .
   [junit4]   2> 232121 T1187 C273 oasc.SolrCore.execute [collection1] webapp=null path=null params={fl=id,srpt_geohash&q=*:*&fq={!field+f%3Dsrpt_geohash}Intersectssss&rows=1000} status=400 QTime=2 
   [junit4]   2> 232122 T1187 C273 oasup.LogUpdateProcessor.finish [collection1] webapp=null path=null params={} {} 0 1
   [junit4]   2> 232124 T1187 C273 oasc.SolrException.log Ignoring exception matching NonexistentShape
   [junit4]   2> 232124 T1187 oas.SolrTestCaseJ4.tearDown ###Ending testBadShapeParse400 {p0=srpt_geohash}
   [junit4]   2> NOTE: reproduce with: ant test  -Dtestcase=TestSolr4Spatial -Dtests.method=testBadShapeParse400 -Dtests.seed=EB6CFCEB849F6A6C -Dtests.multiplier=3 -Dtests.slow=true -Dtests.locale=fr_LU -Dtests.timezone=Etc/Greenwich -Dtests.file.encoding=UTF-8
   [junit4] FAILURE 0.02s J1 | TestSolr4Spatial.testBadShapeParse400 {p0=srpt_geohash} <<<
   [junit4]    > Throwable #1: java.lang.AssertionError: expected:<400> but was:<500>
   [junit4]    > 	at __randomizedtesting.SeedInfo.seed([EB6CFCEB849F6A6C:49B06A404C78F983]:0)
   [junit4]    > 	at org.apache.solr.search.TestSolr4Spatial.testBadShapeParse400(TestSolr4Spatial.java:91)
   [junit4]    > 	at java.lang.Thread.run(Thread.java:744)
   [junit4]   2> 232133 T1187 oas.SolrTestCaseJ4.setUp ###Starting testSort {p0=srpt_geohash}
   [junit4]   2> 232133 T1187 C273 oasu.DirectUpdateHandler2.deleteAll [collection1] REMOVING ALL DOCUMENTS FROM INDEX
   [junit4]   2> 232134 T1187 C273 oasup.LogUpdateProcessor.finish [collection1] webapp=null path=null params={} {deleteByQuery=*:*} 0 1
   [junit4]   2> 232135 T1187 C273 oasu.DirectUpdateHandler2.commit start commit{,optimize=false,openSearcher=true,waitSearcher=true,expungeDeletes=false,softCommit=false,prepareCommit=false}
   [junit4]   2> 232136 T1187 C273 oasc.SolrDeletionPolicy.onCommit SolrDeletionPolicy.onCommit: commits: num=2
   [junit4]   2> 		commit{dir=MockDirectoryWrapper(RAMDirectory@1decc12 lockFactory=org.apache.lucene.store.SingleInstanceLockFactory@183bc2f),segFN=segments_a,generation=10}
   [junit4]   2> 		commit{dir=MockDirectoryWrapper(RAMDirectory@1decc12 lockFactory=org.apache.lucene.store.SingleInstanceLockFactory@183bc2f),segFN=segments_b,generation=11}
   [junit4]   2> 232136 T1187 C273 oasc.SolrDeletionPolicy.updateCommits newest commit generation = 11
   [junit4]   2> 232137 T1187 C273 oass.SolrIndexSearcher.<init> Opening Searcher@2c1d96 main
   [junit4]   2> 232137 T1187 C273 oasu.DirectUpdateHandler2.commit end_commit_flush
   [junit4]   2> 232137 T1189 oasc.SolrCore.registerSearcher [collection1] Registered new searcher Searcher@2c1d96 main{StandardDirectoryReader(segments_b:16:nrt)}
   [junit4]   2> 232138 T1187 C273 oasup.LogUpdateProcessor.finish [collection1] webapp=null path=null params={} {commit=} 0 3
   [junit4]   2> 232140 T1187 C273 oasup.LogUpdateProcessor.finish [collection1] webapp=null path=null params={} {add=[100]} 0 0
   [junit4]   2> 232142 T1187 C273 oasup.LogUpdateProcessor.finish [collection1] webapp=null path=null params={} {add=[101]} 0 1
   [junit4]   2> 232143 T1187 C273 oasup.LogUpdateProcessor.finish [collection1] webapp=null path=null params={} {add=[999]} 0 0
   [junit4]   2> 232145 T1187 C273 oasu.DirectUpdateHandler2.commit start commit{,optimize=false,openSearcher=true,waitSearcher=true,expungeDeletes=false,softCommit=false,prepareCommit=false}
   [junit4]   2> 232147 T1187 C273 oasc.SolrDeletionPolicy.onCommit SolrDeletionPolicy.onCommit: commits: num=2
   [junit4]   2> 		commit{dir=MockDirectoryWrapper(RAMDirectory@1decc12 lockFactory=org.apache.lucene.store.SingleInstanceLockFactory@183bc2f),segFN=segments_b,generation=11}
   [junit4]   2> 		commit{dir=MockDirectoryWrapper(RAMDirectory@1decc12 lockFactory=org.apache.lucene.store.SingleInstanceLockFactory@183bc2f),segFN=segments_c,generation=12}
   [junit4]   2> 232147 T1187 C273 oasc.SolrDeletionPolicy.updateCommits newest commit generation = 12
   [junit4]   2> 232148 T1187 C273 oass.SolrIndexSearcher.<init> Opening Searcher@112ca62 main
   [junit4]   2> 232149 T1187 C273 oasu.DirectUpdateHandler2.commit end_commit_flush
   [junit4]   2> 232152 T1189 oasc.SolrCore.registerSearcher [collection1] Registered new searcher Searcher@112ca62 main{StandardDirectoryReader(segments_c:18:nrt _4(5.0):C3)}
   [junit4]   2> 232152 T1187 C273 oasup.LogUpdateProcessor.finish [collection1] webapp=null path=null params={} {commit=} 0 7
   [junit4]   2> 232155 T1187 C273 oasc.SolrCore.execute [collection1] webapp=null path=null params={fl=id,score&q={!geofilt+sfield%3Dsrpt_geohash+++pt%3D3.0,4.0+d%3D1000.7557176093187}} hits=2 status=0 QTime=1 
   [junit4]   2> 232157 T1187 C273 oasc.SolrCore.execute [collection1] webapp=null path=null params={sort=score+asc&fl=id,score&q={!geofilt+sfield%3Dsrpt_geohash+score%3Ddistance++pt%3D3.0,4.0+d%3D1000.7557176093187}} hits=2 status=0 QTime=1 
   [junit4]   2> 232158 T1187 C273 oasc.SolrCore.execute [collection1] webapp=null path=null params={sort=score+desc&fl=id,score&q={!+score%3DrecipDistance++}srpt_geohash:"Intersects(BUFFER(POINT(4.0+3.0),9.0))"} hits=2 status=0 QTime=1 
   [junit4]   2> 232159 T1187 C273 oasc.SolrCore.execute [collection1] webapp=null path=null params={sort=score+asc&fl=id,score&q={!+score%3Ddistance+filter%3Dfalse+}srpt_geohash:"Intersects(BUFFER(POINT(4.0+3.0),1.0E-6))"} hits=3 status=0 QTime=1 
   [junit4]   2> 232160 T1187 C273 oasc.SolrCore.execute [collection1] webapp=null path=null params={sort=score+asc&fl=id,score&q={!geofilt+sfield%3Dsrpt_geohash+score%3Ddistance++pt%3D4.0,0.0+d%3D1000.7557176093187}} hits=2 status=0 QTime=1 
   [junit4]   2> 232164 T1187 C273 oasc.SolrCore.execute [collection1] webapp=null path=null params={sort=query($sortQuery)+asc&fl=id,score&sortQuery={!geofilt+sfield%3Dsrpt_geohash+score%3Ddistance++pt%3D3.0,4.0+d%3D1000.7557176093187}&q=-id:999} hits=2 status=0 QTime=4 
   [junit4]   2> 232165 T1187 C273 oasc.SolrCore.execute [collection1] webapp=null path=null params={sort=query($sortQuery)+asc&fl=id,score&sortQuery={!+score%3Ddistance++}srpt_geohash:"Intersects(BUFFER(POINT(0.0+4.0),9.0))"&q=-id:999} hits=2 status=0 QTime=0 
   [junit4]   2> 232166 T1187 oas.SolrTestCaseJ4.tearDown ###Ending testSort {p0=srpt_geohash}
   [junit4]   2> 232170 T1187 oas.SolrTestCaseJ4.setUp ###Starting testRangeSyntax {p0=srpt_geohash}
   [junit4]   2> 232170 T1187 C273 oasu.DirectUpdateHandler2.deleteAll [collection1] REMOVING ALL DOCUMENTS FROM INDEX
   [junit4]   2> 232171 T1187 C273 oasup.LogUpdateProcessor.finish [collection1] webapp=null path=null params={} {deleteByQuery=*:*} 0 1
   [junit4]   2> 232172 T1187 C273 oasu.DirectUpdateHandler2.commit start commit{,optimize=false,openSearcher=true,waitSearcher=true,expungeDeletes=false,softCommit=false,prepareCommit=false}
   [junit4]   2> 232173 T1187 C273 oasc.SolrDeletionPolicy.onCommit SolrDeletionPolicy.onCommit: commits: num=2
   [junit4]   2> 		commit{dir=MockDirectoryWrapper(RAMDirectory@1decc12 lockFactory=org.apache.lucene.store.SingleInstanceLockFactory@183bc2f),segFN=segments_c,generation=12}
   [junit4]   2> 		commit{dir=MockDirectoryWrapper(RAMDirectory@1decc12 lockFactory=org.apache.lucene.store.SingleInstanceLockFactory@183bc2f),segFN=segments_d,generation=13}
   [junit4]   2> 232173 T1187 C273 oasc.SolrDeletionPolicy.updateCommits newest commit generation = 13
   [junit4]   2> 232173 T1187 C273 oass.SolrIndexSearcher.<init> Opening Searcher@199ad14 main
   [junit4]   2> 232174 T1187 C273 oasu.DirectUpdateHandler2.commit end_commit_flush
   [junit4]   2> 232174 T1189 oasc.SolrCore.registerSearcher [collection1] Registered new searcher Searcher@199ad14 main{StandardDirectoryReader(segments_d:19:nrt)}
   [junit4]   2> 232174 T1187 C273 oasup.LogUpdateProcessor.finish [collection1] webapp=null path=null params={} {commit=} 0 2
   [junit4]   2> 232176 T1187 C273 oasup.LogUpdateProcessor.finish [collection1] webapp=null path=null params={} {add=[1]} 0 0
   [junit4]   2> 232178 T1187 C273 oasup.LogUpdateProcessor.finish [collection1] webapp=null path=null params={} {add=[2]} 0 1
   [junit4]   2> 232179 T1187 C273 oasup.LogUpdateProcessor.finish [collection1] webapp=null path=null params={} {add=[3]} 0 0
   [junit4]   2> 232180 T1187 C273 oasup.LogUpdateProcessor.finish [collection1] webapp=null path=null params={} {add=[4]} 0 0
   [junit4]   2> 232182 T1187 C273 oasup.LogUpdateProcessor.finish [collection1] webapp=null path=null params={} {add=[5]} 0 0
   [junit4]   2> 232183 T1187 C273 oasup.LogUpdateProcessor.finish [collection1] webapp=null path=null params={} {add=[6]} 0 0
   [junit4]   2> 232185 T1187 C273 oasup.LogUpdateProcessor.finish [collection1] webapp=null path=null params={} {add=[7]} 0 1
   [junit4]   2> 232186 T1187 C273 oasup.LogUpdateProcessor.finish [collection1] webapp=null path=null params={} {add=[8]} 0 0
   [junit4]   2> 232187 T1187 C273 oasup.LogUpdateProcessor.finish [collection1] webapp=null path=null params={} {add=[9]} 0 0
   [junit4]   2> 232189 T1187 C273 oasup.LogUpdateProcessor.finish [collection1] webapp=null path=null params={} {add=[10]} 0 0
   [junit4]   2> 232190 T1187 C273 oasup.LogUpdateProcessor.finish [collection1] webapp=null path=null params={} {add=[11]} 0 0
   [junit4]   2> 232191 T1187 C273 oasup.LogUpdateProcessor.finish [collection1] webapp=null path=null params={} {add=[12]} 0 0
   [junit4]   2> 232193 T1187 C273 oasup.LogUpdateProcessor.finish [collection1] webapp=null path=null params={} {add=[13]} 0 0
   [junit4]   2> 232194 T1187 C273 oasu.DirectUpdateHandler2.commit start commit{,optimize=false,openSearcher=true,waitSearcher=true,expungeDeletes=false,softCommit=false,prepareCommit=false}
   [junit4]   2> 232195 T1187 C273 oasc.SolrDeletionPolicy.onCommit SolrDeletionPolicy.onCommit: commits: num=2
   [junit4]   2> 		commit{dir=MockDirectoryWrapper(RAMDirectory@1decc12 lockFactory=org.apache.lucene.store.SingleInstanceLockFactory@183bc2f),segFN=segments_d,generation=13}
   [junit4]   2> 		commit{dir=MockDirectoryWrapper(RAMDirectory@1decc12 lockFactory=org.apache.lucene.store.SingleInstanceLockFactory@183bc2f),segFN=segments_e,generation=14}
   [junit4]   2> 232196 T1187 C273 oasc.SolrDeletionPolicy.updateCommits newest commit generation = 14
   [junit4]   2> 232197 T1187 C273 oass.SolrIndexSearcher.<init> Opening Searcher@15e481c main
   [junit4]   2> 232197 T1187 C273 oasu.DirectUpdateHandler2.commit end_commit_flush
   [junit4]   2> 232197 T1189 oasc.SolrCore.registerSearcher [collection1] Registered new searcher Searcher@15e481c main{StandardDirectoryReader(segments_e:21:nrt _5(5.0):C13)}
   [junit4]   2> 232198 T1187 C273 oasup.LogUpdateProcessor.finish [collection1] webapp=null path=null params={} {commit=} 0 4
   [junit4]   2> 232200 T1187 C273 oasc.SolrCore.execute [collection1] webapp=null path=null params={fl=id&q=*:*&fq={!+score%3Ddistance+df%3Dsrpt_geohash}[32,-80+TO+"33+,+-79"]&rows=1000} hits=1 status=0 QTime=1 
   [junit4]   2> 232202 T1187 oas.SolrTestCaseJ4.tearDown ###Ending testRangeSyntax {p0=srpt_geohash}
   [junit4]   2> 232206 T1187 oas.SolrTestCaseJ4.setUp ###Starting checkResultFormat {p0=srpt_geohash}
   [junit4]   2> 232206 T1187 C273 oasu.DirectUpdateHandler2.deleteAll [collection1] REMOVING ALL DOCUMENTS FROM INDEX
   [junit4]   2> 232207 T1187 C273 oasup.LogUpdateProcessor.finish [collection1] webapp=null path=null params={} {deleteByQuery=*:*} 0 1
   [junit4]   2> 232208 T1187 C273 oasu.DirectUpdateHandler2.commit start commit{,optimize=false,openSearcher=true,waitSearcher=true,expungeDeletes=false,softCommit=false,prepareCommit=false}
   [junit4]   2> 232209 T1187 C273 oasc.SolrDeletionPolicy.onCommit SolrDeletionPolicy.onCommit: commits: num=2
   [junit4]   2> 		commit{dir=MockDirectoryWrapper(RAMDirectory@1decc12 lockFactory=org.apache.lucene.store.SingleInstanceLockFactory@183bc2f),segFN=segments_e,generation=14}
   [junit4]   2> 		commit{dir=MockDirectoryWrapper(RAMDirectory@1decc12 lockFactory=org.apache.lucene.store.SingleInstanceLockFactory@183bc2f),segFN=segments_f,generation=15}
   [junit4]   2> 232209 T1187 C273 oasc.SolrDeletionPolicy.updateCommits newest commit generation = 15
   [junit4]   2> 232210 T1187 C273 oass.SolrIndexSearcher.<init> Opening Searcher@e05a90 main
   [junit4]   2> 232210 T1187 C273 oasu.DirectUpdateHandler2.commit end_commit_flush
   [junit4]   2> 232210 T1189 oasc.SolrCore.registerSearcher [collection1] Registered new searcher Searcher@e05a90 main{StandardDirectoryReader(segments_f:22:nrt)}
   [junit4]   2> 232211 T1187 C273 oasup.LogUpdateProcessor.finish [collection1] webapp=null path=null params={} {commit=} 0 3
   [junit4]   2> ASYNC  NEW_CORE C274 name=collection1 org.apache.solr.core.SolrCore@32817e
   [junit4]   2> 232217 T1187 C274 oasup.LogUpdateProcessor.finish [collection1] webapp=null path=null params={} {add=[11]} 0 0
   [junit4]   2> 232219 T1187 C274 oasu.DirectUpdateHandler2.commit start commit{,optimize=false,openSearcher=true,waitSearcher=true,expungeDeletes=false,softCommit=false,prepareCommit=false}
   [junit4]   2> 232221 T1187 C274 oasc.SolrDeletionPolicy.onCommit SolrDeletionPolicy.onCommit: commits: num=2
   [junit4]   2> 		commit{dir=MockDirectoryWrapper(RAMDirectory@1decc12 lockFactory=org.apache.lucene.store.SingleInstanceLockFactory@183bc2f),segFN=segments_f,generation=15}
   [junit4]   2> 		commit{dir=MockDirectoryWrapper(RAMDirectory@1decc12 lockFactory=org.apache.lucene.store.SingleInstanceLockFactory@183bc2f),segFN=segments_g,generation=16}
   [junit4]   2> 232222 T1187 C274 oasc.SolrDeletionPolicy.updateCommits newest commit generation = 16
   [junit4]   2> 232223 T1187 C274 oass.SolrIndexSearcher.<init> Opening Searcher@1387a42 main
   [junit4]   2> 232223 T1187 C274 oasu.DirectUpdateHandler2.commit end_commit_flush
   [junit4]   2> 232223 T1189 oasc.SolrCore.registerSearcher [collection1] Registered new searcher Searcher@1387a42 main{StandardDirectoryReader(segments_g:24:nrt _6(5.0):C1)}
   [junit4]   2> 232224 T1187 C274 oasup.LogUpdateProcessor.finish [collection1] webapp=null path=null params={} {commit=} 0 5
   [junit4]   2> 232227 T1187 C274 oasc.SolrCore.execute [collection1] webapp=null path=null params={fl=id,srpt_geohash&q=*:*&fq={!geofilt+sfield%3Dsrpt_geohash+pt%3D89.9,-130+d%3D9}&rows=1000} hits=1 status=0 QTime=1 
   [junit4]   2> 232229 T1187 oas.SolrTestCaseJ4.tearDown ###Ending checkResultFormat {p0=srpt_geohash}
   [junit4]   2> 232235 T1187 oas.SolrTestCaseJ4.setUp ###Starting testSortMultiVal {p0=srpt_quad}
   [junit4]   2> 232236 T1187 C274 oasu.DirectUpdateHandler2.deleteAll [collection1] REMOVING ALL DOCUMENTS FROM INDEX
   [junit4]   2> 232237 T1187 C274 oasup.LogUpdateProcessor.finish [collection1] webapp=null path=null params={} {deleteByQuery=*:*} 0 1
   [junit4]   2> 232239 T1187 C274 oasu.DirectUpdateHandler2.commit start commit{,optimize=false,openSearcher=true,waitSearcher=true,expungeDeletes=false,softCommit=false,prepareCommit=false}
   [junit4]   2> 232239 T1187 C274 oasc.SolrDeletionPolicy.onCommit SolrDeletionPolicy.onCommit: commits: num=2
   [junit4]   2> 		commit{dir=MockDirectoryWrapper(RAMDirectory@1decc12 lockFactory=org.apache.lucene.store.SingleInstanceLockFactory@183bc2f),segFN=segments_g,generation=16}
   [junit4]   2> 		commit{dir=MockDirectoryWrapper(RAMDirectory@1decc12 lockFactory=org.apache.lucene.store.SingleInstanceLockFactory@183bc2f),segFN=segments_h,generation=17}
   [junit4]   2> 232240 T1187 C274 oasc.SolrDeletionPolicy.updateCommits newest commit generation = 17
   [junit4]   2> 232240 T1187 C274 oass.SolrIndexSearcher.<init> Opening Searcher@8dc322 main
   [junit4]   2> 232241 T1187 C274 oasu.DirectUpdateHandler2.commit end_commit_flush
   [junit4]   2> 232241 T1189 oasc.SolrCore.registerSearcher [collection1] Registered new searcher Searcher@8dc322 main{StandardDirectoryReader(segments_h:25:nrt)}
   [junit4]   2> 232242 T1187 C274 oasup.LogUpdateProcessor.finish [collection1] webapp=null path=null params={} {commit=} 0 3
   [junit4]   2> 232244 T1187 C274 oass.AbstractSpatialPrefixTreeFieldType.newSpatialStrategy srpt_quad{class=org.apache.solr.schema.SpatialRecursivePrefixTreeFieldType,analyzer=org.apache.solr.schema.FieldType$DefaultAnalyzer,args={units=degrees, class=solr.SpatialRecursivePrefixTreeFieldType, prefixTree=quad}} strat: RecursivePrefixTreeStrategy(prefixGridScanLevel:22,SPG:(QuadPrefixTree(maxLevels:26,ctx:SpatialContext{geo=true, calculator=Haversine, worldBounds=Rect(minX=-180.0,maxX=180.0,minY=-90.0,maxY=90.0)}))) maxLevels: 26
   [junit4]   2> 232246 T1187 C274 oasup.LogUpdateProcessor.finish [collection1] webapp=null path=null params={} {add=[100]} 0 2
   [junit4]   2> 232248 T1187 C274 oasup.LogUpdateProcessor.finish [collection1] webapp=null path=null params={} {add=[101]} 0 1
   [junit4]   2> 232250 T1187 C274 oasu.DirectUpdateHandler2.commit start commit{,optimize=false,openSearcher=true,waitSearcher=true,expungeDeletes=false,softCommit=false,prepareCommit=false}
   [junit4]   2> 232252 T1187 C274 oasc.SolrDeletionPolicy.onCommit SolrDeletionPolicy.onCommit: commits: num=2
   [junit4]   2> 		commit{dir=MockDirectoryWrapper(RAMDirectory@1decc12 lockFactory=org.apache.lucene.store.SingleInstanceLockFactory@183bc2f),segFN=segments_h,generation=17}
   [junit4]   2> 		commit{dir=MockDirectoryWrapper(RAMDirectory@1decc12 lockFactory=org.apache.lucene.store.SingleInstanceLockFactory@183bc2f),segFN=segments_i,generation=18}
   [junit4]   2> 232253 T1187 C274 oasc.SolrDeletionPolicy.updateCommits newest commit generation = 18
   [junit4]   2> 232254 T1187 C274 oass.SolrIndexSearcher.<init> Opening Searcher@9331dc main
   [junit4]   2> 232255 T1187 C274 oasu.DirectUpdateHandler2.commit end_commit_flush
   [junit4]   2> 232255 T1189 oasc.SolrCore.registerSearcher [collection1] Registered new searcher Searcher@9331dc main{StandardDirectoryReader(segments_i:27:nrt _7(5.0):C2)}
   [junit4]   2> 232255 T1187 C274 oasup.LogUpdateProcessor.finish [collection1] webapp=null path=null params={} {commit=} 0 5
   [junit4]   2> 232258 T1187 C274 oasc.SolrCore.execute [collection1] webapp=null path=null params={sort=score+asc&fl=id,score&q={!+score%3Ddistance++}srpt_quad:"Intersects(BUFFER(POINT(4.0+3.0),9.0))"} hits=2 status=0 QTime=1 
   [junit4]   2> 232259 T1187 oas.SolrTestCaseJ4.tearDown ###Ending testSortMultiVal {p0=srpt_quad}
   [junit4]   2> 232265 T1187 oas.SolrTestCaseJ4.setUp ###Starting testIntersectFilter {p0=srpt_quad}
   [junit4]   2> 232266 T1187 C274 oasu.DirectUpdateHandler2.deleteAll [collection1] REMOVING ALL DOCUMENTS FROM INDEX
   [junit4]   2> 232266 T1187 C274 oasup.LogUpdateProcessor.finish [collection1] webapp=null path=null params={} {deleteByQuery=*:*} 0 1
   [junit4]   2> 232268 T1187 C274 oasu.DirectUpdateHandler2.commit start commit{,optimize=false,openSearcher=true,waitSearcher=true,expungeDeletes=false,softCommit=false,prepareCommit=false}
   [junit4]   2> 232269 T1187 C274 oasc.SolrDeletionPolicy.onCommit SolrDeletionPolicy.onCommit: commits: num=2
   [junit4]   2> 		commit{dir=MockDirectoryWrapper(RAMDirectory@1decc12 lockFactory=org.apache.lucene.store.SingleInstanceLockFactory@183bc2f),segFN=segments_i,generation=18}
   [junit4]   2> 		commit{dir=MockDirectoryWrapper(RAMDirectory@1decc12 lockFactory=org.apache.lucene.store.SingleInstanceLockFactory@183bc2f),segFN=segments_j,generation=19}
   [junit4]   2> 232269 T1187 C274 oasc.SolrDeletionPolicy.updateCommits newest commit generation = 19
   [junit4]   2> 232270 T1187 C274 oass.SolrIndexSearcher.<init> Opening Searcher@1809f74 main
   [junit4]   2> 232270 T1187 C274 oasu.DirectUpdateHandler2.commit end_commit_flush
   [junit4]   2> 232270 T1189 oasc.SolrCore.registerSearcher [collection1] Registered new searcher Searcher@1809f74 main{StandardDirectoryReader(segments_j:28:nrt)}
   [junit4]   2> 232271 T1187 C274 oasup.LogUpdateProcessor.finish [collection1] webapp=null path=null params={} {commit=} 0 3
   [junit4]   2> 232272 T1187 C274 oasup.LogUpdateProcessor.finish [collection1] webapp=null path=null params={} {add=[1]} 0 0
   [junit4]   2> 232274 T1187 C274 oasup.LogUpdateProcessor.finish [collection1] webapp=null path=null params={} {add=[2]} 0 0
   [junit4]   2> 232275 T1187 C274 oasup.LogUpdateProcessor.finish [collection1] webapp=null path=null params={} {add=[3]} 0 0
   [junit4]   2> 232277 T1187 C274 oasup.LogUpdateProcessor.finish [collection1] webapp=null path=null params={} {add=[4]} 0 0
   [junit4]   2> 232279 T1187 C274 oasup.LogUpdateProcessor.finish [collection1] webapp=null path=null params={} {add=[5]} 0 1
   [junit4]   2> 232280 T1187 C274 oasup.LogUpdateProcessor.finish [collection1] webapp=null path=null params={} {add=[6]} 0 0
   [junit4]   2> 232282 T1187 C274 oasup.LogUpdateProcessor.finish [collection1] webapp=null path=null params={} {add=[7]} 0 0
   [junit4]   2> 232283 T1187 C274 oasup.LogUpdateProcessor.finish [collection1] webapp=null path=null params={} {add=[8]} 0 0
   [junit4]   2> 232285 T1187 C274 oasup.LogUpdateProcessor.finish [collection1] webapp=null path=null params={} {add=[9]} 0 0
   [junit4]   2> 232287 T1187 C274 oasup.LogUpdateProcessor.finish [collection1] webapp=null path=null params={} {add=[10]} 0 1
   [junit4]   2> 232289 T1187 C274 oasup.LogUpdateProcessor.finish [collection1] webapp=null path=null params={} {add=[11]} 0 1
   [junit4]   2> 232290 T1187 C274 oasup.LogUpdateProcessor.finish [collection1] webapp=null path=null params={} {add=[12]} 0 0
   [junit4]   2> 232292 T1187 C274 oasup.LogUpdateProcessor.finish [collection1] webapp=null path=null params={} {add=[13]} 0 1
   [junit4]   2> 232293 T1187 C274 oasu.DirectUpdateHandler2.commit start commit{,optimize=false,openSearcher=true,waitSearcher=true,expungeDeletes=false,softCommit=false,prepareCommit=false}
   [junit4]   2> 232296 T1187 C274 oasc.SolrDeletionPolicy.onCommit SolrDeletionPolicy.onCommit: commits: num=2
   [junit4]   2> 		commit{dir=MockDirectoryWrapper(RAMDirectory@1decc12 lockFactory=org.apache.lucene.store.SingleInstanceLockFactory@183bc2f),segFN=segments_j,generation=19}
   [junit4]   2> 		commit{dir=MockDirectoryWrapper(RAMDirectory@1decc12 lockFactory=org.apache.lucene.store.SingleInstanceLockFactory@183bc2f),segFN=segments_k,generation=20}
   [junit4]   2> 232297 T1187 C274 oasc.SolrDeletionPolicy.updateCommits newest commit generation = 20
   [junit4]   2> 232298 T1187 C274 oass.SolrIndexSearcher.<init> Opening Searcher@b8f08c main
   [junit4]   2> 232299 T1187 C274 oasu.DirectUpdateHandler2.commit end_commit_flush
   [junit4]   2> 232299 T1189 oasc.SolrCore.registerSearcher [collection1] Registered new searcher Searcher@b8f08c main{StandardDirectoryReader(segments_k:30:nrt _8(5.0):C13)}
   [junit4]   2> 232299 T1187 C274 oasup.LogUpdateProcessor.finish [collection1] webapp=null path=null params={} {commit=} 0 6
   [junit4]   2> 232302 T1187 C274 oasc.SolrCore.execute [collection1] webapp=null path=null params={fl=id&q=*:*&fq={!field+f%3Dsrpt_quad}Intersects(BUFFER(POINT(1.0+1.0),1.5738106435829113))&rows=1000} hits=3 status=0 QTime=1 
   [junit4]   2> 232306 T1187 C274 oasc.SolrCore.execute [collection1] webapp=null path=null params={fl=id&q=*:*&fq={!geofilt+sfield%3Dsrpt_quad+pt%3D'1,1'+d%3D175.0}&rows=1000} hits=3 status=0 QTime=0 
   [junit4]   2> 232311 T1187 C274 oasc.SolrCore.execute [collection1] webapp=null path=null params={fl=id&q=*:*&fq={!field+f%3Dsrpt_quad}Intersects(BUFFER(POINT(179.8+0.0),1.798640735523327))&rows=1000} hits=2 status=0 QTime=1 
   [junit4]   2> 232315 T1187 C274 oasc.SolrCore.execute [collection1] webapp=null path=null params={fl=id&q=*:*&fq={!geofilt+sfield%3Dsrpt_quad+pt%3D'0,179.8'+d%3D200.0}&rows=1000} hits=2 status=0 QTime=1 
   [junit4]   2> 232319 T1187 C274 oasc.SolrCore.execute [collection1] webapp=null path=null params={fl=id&q=*:*&fq={!field+f%3Dsrpt_quad+score%3Ddistance}Intersects(BUFFER(POINT(50.0+89.8),1.798640735523327))&rows=1000} hits=2 status=0 QTime=1 
   [junit4]   2> 232322 T1187 C274 oasc.SolrCore.execute [collection1] webapp=null path=null params={fl=id&q=*:*&fq={!geofilt+sfield%3Dsrpt_quad+pt%3D'89.8,+50'+d%3D200.0}&rows=1000} hits=2 status=0 QTime=0 
   [junit4]   2> 232326 T1187 C274 oasc.SolrCore.execute [collection1] webapp=null path

[...truncated too long message...]

(Thread.java:744)
   [junit4]    > Caused by: org.apache.solr.common.SolrException: ERROR: [doc=1] Error adding field 'big_integer_tl'='12345678901234567890' msg=For input string: "12345678901234567890"
   [junit4]    > 	at org.apache.solr.update.DocumentBuilder.toDocument(DocumentBuilder.java:165)
   [junit4]    > 	at org.apache.solr.update.AddUpdateCommand.getLuceneDocument(AddUpdateCommand.java:78)
   [junit4]    > 	at org.apache.solr.update.DirectUpdateHandler2.addDoc0(DirectUpdateHandler2.java:232)
   [junit4]    > 	at org.apache.solr.update.DirectUpdateHandler2.addDoc(DirectUpdateHandler2.java:159)
   [junit4]    > 	... 57 more
   [junit4]    > Caused by: java.lang.NumberFormatException: For input string: "12345678901234567890"
   [junit4]    > 	at java.lang.NumberFormatException.forInputString(NumberFormatException.java:65)
   [junit4]    > 	at java.lang.Long.parseLong(Long.java:444)
   [junit4]    > 	at java.lang.Long.parseLong(Long.java:483)
   [junit4]    > 	at org.apache.solr.schema.TrieField.createField(TrieField.java:609)
   [junit4]    > 	at org.apache.solr.schema.TrieField.createFields(TrieField.java:660)
   [junit4]    > 	at org.apache.solr.update.DocumentBuilder.addField(DocumentBuilder.java:45)
   [junit4]    > 	at org.apache.solr.update.DocumentBuilder.toDocument(DocumentBuilder.java:116)
   [junit4]    > 	... 60 more
   [junit4]   2> 1305862 T6179 oas.SolrTestCaseJ4.setUp ###Starting testExtendedFieldValues
   [junit4]   2> 1305862 T6179 oas.SolrTestCaseJ4.tearDown ###Ending testExtendedFieldValues
   [junit4]   2> 1305866 T6179 oas.SolrTestCaseJ4.setUp ###Starting testBooleanValuesInAdd
   [junit4]   2> 1305866 T6179 oas.SolrTestCaseJ4.tearDown ###Ending testBooleanValuesInAdd
   [junit4]   2> 1305870 T6179 oas.SolrTestCaseJ4.setUp ###Starting testDecimalValuesInAdd
   [junit4]   2> 1305871 T6179 oas.SolrTestCaseJ4.tearDown ###Ending testDecimalValuesInAdd
   [junit4]   2> 1305876 T6179 oas.SolrTestCaseJ4.setUp ###Starting testBigDecimalValuesInAdd
   [junit4]   2> 1305876 T6179 oas.SolrTestCaseJ4.tearDown ###Ending testBigDecimalValuesInAdd
   [junit4]   2> 1305878 T6179 oas.SolrTestCaseJ4.deleteCore ###deleteCore
   [junit4]   2> 1305878 T6179 oasc.CoreContainer.shutdown Shutting down CoreContainer instance=7560621
   [junit4]   2> 1305879 T6179 oasc.SolrCore.close [collection1]  CLOSING SolrCore org.apache.solr.core.SolrCore@1620a3c
   [junit4]   2> 1305899 T6179 oasu.DirectUpdateHandler2.close closing DirectUpdateHandler2{commits=4,autocommits=0,soft autocommits=0,optimizes=0,rollbacks=0,expungeDeletes=0,docsPending=0,adds=1,deletesById=0,deletesByQuery=0,errors=1,cumulative_adds=5,cumulative_deletesById=0,cumulative_deletesByQuery=0,cumulative_errors=1,transaction_logs_total_size=668,transaction_logs_total_number=4}
   [junit4]   2> 1305900 T6179 oasu.SolrCoreState.decrefSolrCoreState Closing SolrCoreState
   [junit4]   2> 1305900 T6179 oasu.DefaultSolrCoreState.closeIndexWriter SolrCoreState ref count has reached 0 - closing IndexWriter
   [junit4]   2> 1305900 T6179 oasu.DefaultSolrCoreState.closeIndexWriter closing IndexWriter with IndexWriterCloser
   [junit4]   2> 1305901 T6179 oasc.SolrCore.closeSearcher [collection1] Closing main searcher on request.
   [junit4]   2> 1305901 T6179 oasc.CachingDirectoryFactory.close Closing MockDirectoryFactory - 2 directories currently being tracked
   [junit4]   2> 1305901 T6179 oasc.CachingDirectoryFactory.closeCacheValue looking to close /mnt/ssd/jenkins/workspace/Lucene-Solr-trunk-Linux/solr/build/solr-core/test/J0/./solrtest-JsonLoaderTest-1391586137124 [CachedDir<<refCount=0;path=/mnt/ssd/jenkins/workspace/Lucene-Solr-trunk-Linux/solr/build/solr-core/test/J0/./solrtest-JsonLoaderTest-1391586137124;done=false>>]
   [junit4]   2> 1305902 T6179 oasc.CachingDirectoryFactory.close Closing directory: /mnt/ssd/jenkins/workspace/Lucene-Solr-trunk-Linux/solr/build/solr-core/test/J0/./solrtest-JsonLoaderTest-1391586137124
   [junit4]   2> 1305902 T6179 oasc.CachingDirectoryFactory.closeCacheValue looking to close /mnt/ssd/jenkins/workspace/Lucene-Solr-trunk-Linux/solr/build/solr-core/test/J0/./solrtest-JsonLoaderTest-1391586137124/index [CachedDir<<refCount=0;path=/mnt/ssd/jenkins/workspace/Lucene-Solr-trunk-Linux/solr/build/solr-core/test/J0/./solrtest-JsonLoaderTest-1391586137124/index;done=false>>]
   [junit4]   2> 1305902 T6179 oasc.CachingDirectoryFactory.close Closing directory: /mnt/ssd/jenkins/workspace/Lucene-Solr-trunk-Linux/solr/build/solr-core/test/J0/./solrtest-JsonLoaderTest-1391586137124/index
   [junit4]   2> NOTE: test params are: codec=Lucene40, sim=RandomSimilarityProvider(queryNorm=true,coord=yes): {}, locale=sr_RS_#Latn, timezone=America/Argentina/Mendoza
   [junit4]   2> NOTE: Linux 3.8.0-35-generic i386/Oracle Corporation 1.7.0_51 (32-bit)/cpus=8,threads=1,free=157795600,total=319291392
   [junit4]   2> NOTE: All tests run in this JVM: [TestStressVersions, TestSolrXmlPersistence, MBeansHandlerTest, TestCopyFieldCollectionResource, SpatialFilterTest, TestCloudManagedSchema, TriLevelCompositeIdRoutingTest, TestSolrQueryParserResource, FileBasedSpellCheckerTest, OverseerTest, ResourceLoaderTest, OverseerCollectionProcessorTest, TestReversedWildcardFilterFactory, RegexBoostProcessorTest, CustomCollectionTest, TestAddFieldRealTimeGet, TestCustomSort, CSVRequestHandlerTest, SimpleFacetsTest, UpdateParamsTest, TestMaxScoreQueryParser, TestSort, TestBM25SimilarityFactory, TestLuceneMatchVersion, SynonymTokenizerTest, DistributedQueryElevationComponentTest, AnalysisAfterCoreReloadTest, SliceStateTest, AbstractAnalyticsStatsTest, TestConfig, CoreAdminHandlerTest, TestRandomDVFaceting, TestJmxMonitoredMap, TestSerializedLuceneMatchVersion, TermsComponentTest, ClusterStateUpdateTest, ExternalFileFieldSortTest, TermVectorComponentTest, SpellPossibilityIteratorTest, TestRealTimeGet, TestSolrXmlPersistor, CircularListTest, LoggingHandlerTest, TestSolrQueryParser, QueryResultKeyTest, TestManagedSchema, TestFieldCollectionResource, QueryFacetTest, UUIDFieldTest, TestStressUserVersions, TestPostingsSolrHighlighter, SystemInfoHandlerTest, TestDocumentBuilder, TestFunctionQuery, SoftAutoCommitTest, LegacyHTMLStripCharFilterTest, DocumentBuilderTest, LeaderElectionTest, WordBreakSolrSpellCheckerTest, ClusterStateTest, ResponseLogComponentTest, TestRandomMergePolicy, TestInitQParser, TestSolrXMLSerializer, TestCharFilters, TestClassNameShortening, TestExtendedDismaxParser, BinaryUpdateRequestHandlerTest, LukeRequestHandlerTest, DirectUpdateHandlerOptimizeTest, DistributedTermsComponentTest, TestLFUCache, BasicFunctionalityTest, TestDocSet, FastVectorHighlighterTest, SampleTest, IndexSchemaTest, TestGroupingSearch, QueryParsingTest, MigrateRouteKeyTest, MoreLikeThisHandlerTest, TestSchemaNameResource, SOLR749Test, EchoParamsTest, TestDynamicFieldResource, TestSearchPerf, DistributedDebugComponentTest, BasicDistributedZkTest, BasicDistributedZk2Test, UnloadDistributedZkTest, SyncSliceTest, ShardRoutingTest, BasicZkTest, RecoveryZkTest, TestReplicationHandler, ZkSolrClientTest, TestZkChroot, ZkCLITest, ShardRoutingCustomTest, SliceStateUpdateTest, AutoCommitTest, TestDistributedGrouping, TestFaceting, TestRecovery, TestHashPartitioner, DistributedSpellCheckComponentTest, ZkControllerTest, TestJoin, HardAutoCommitTest, TestRangeQuery, TestCoreContainer, SolrCoreTest, SpellCheckComponentTest, QueryElevationComponentTest, PeerSyncTest, TestBadConfig, ShowFileRequestHandlerTest, SolrIndexSplitterTest, SimplePostToolTest, TestCoreDiscovery, SignatureUpdateProcessorFactoryTest, SpellCheckCollatorTest, SuggesterFSTTest, SolrRequestParserTest, DocValuesTest, SuggesterTSTTest, SuggesterTest, TestStressLucene, TestTrie, SuggesterWFSTTest, PolyFieldTest, SchemaVersionSpecificBehaviorTest, SolrCoreCheckLockOnStartupTest, TestPseudoReturnFields, TestUpdate, FieldMutatingUpdateProcessorTest, TestAtomicUpdateErrorCases, TestWordDelimiterFilterFactory, QueryEqualityTest, DefaultValueUpdateProcessorTest, StatelessScriptUpdateProcessorFactoryTest, SortByFunctionTest, TestRemoteStreaming, DocValuesMultiTest, TestSolrDeletionPolicy1, SolrInfoMBeanTest, DebugComponentTest, CacheHeaderTest, IndexBasedSpellCheckerTest, TestSurroundQueryParser, TestQueryUtils, StandardRequestHandlerTest, TestWriterPerf, PrimitiveFieldTypeTest, XmlUpdateRequestHandlerTest, RequestHandlersTest, TestValueSourceCache, TestArbitraryIndexDir, SolrPluginUtilsTest, ReturnFieldsTest, UpdateRequestProcessorFactoryTest, TestCSVResponseWriter, TestAnalyzedSuggestions, JsonLoaderTest]
   [junit4] Completed on J0 in 1.68s, 14 tests, 1 error <<< FAILURES!

[...truncated 366 lines...]
BUILD FAILED
/mnt/ssd/jenkins/workspace/Lucene-Solr-trunk-Linux/build.xml:453: The following error occurred while executing this line:
/mnt/ssd/jenkins/workspace/Lucene-Solr-trunk-Linux/build.xml:433: The following error occurred while executing this line:
/mnt/ssd/jenkins/workspace/Lucene-Solr-trunk-Linux/build.xml:39: The following error occurred while executing this line:
/mnt/ssd/jenkins/workspace/Lucene-Solr-trunk-Linux/extra-targets.xml:37: The following error occurred while executing this line:
/mnt/ssd/jenkins/workspace/Lucene-Solr-trunk-Linux/solr/build.xml:189: The following error occurred while executing this line:
/mnt/ssd/jenkins/workspace/Lucene-Solr-trunk-Linux/solr/common-build.xml:491: The following error occurred while executing this line:
/mnt/ssd/jenkins/workspace/Lucene-Solr-trunk-Linux/lucene/common-build.xml:1268: The following error occurred while executing this line:
/mnt/ssd/jenkins/workspace/Lucene-Solr-trunk-Linux/lucene/common-build.xml:901: There were test failures: 368 suites, 1593 tests, 1 error, 5 failures, 35 ignored (7 assumptions)

Total time: 48 minutes 37 seconds
Build step 'Invoke Ant' marked build as failure
Description set: Java: 32bit/jdk1.7.0_51 -client -XX:+UseParallelGC
Archiving artifacts
Recording test results
Email was triggered for: Failure
Sending email for trigger: Failure



Mime
View raw message