lucene-dev mailing list archives

Site index · List index
Message view « Date » · « Thread »
Top « Date » · « Thread »
From Michael McCandless <luc...@mikemccandless.com>
Subject Re: [JENKINS] Lucene-4x-Linux-Java6-64-test-only - Build # 11503 - Failure!
Date Thu, 30 Jan 2014 10:36:32 GMT
I'll fix.

Mike McCandless

http://blog.mikemccandless.com


On Thu, Jan 30, 2014 at 1:35 AM,  <builder@flonkings.com> wrote:
> Build: builds.flonkings.com/job/Lucene-4x-Linux-Java6-64-test-only/11503/
>
> 1 tests failed.
> REGRESSION:  org.apache.lucene.index.TestIndexWriterReader.testNoTermsIndex
>
> Error Message:
> should have failed to seek since terms index was not loaded.
>
> Stack Trace:
> java.lang.AssertionError: should have failed to seek since terms index was not loaded.
>         at __randomizedtesting.SeedInfo.seed([9CE6A84339D41DE3:107F46CCDEE31B19]:0)
>         at org.junit.Assert.fail(Assert.java:93)
>         at org.apache.lucene.index.TestIndexWriterReader.testNoTermsIndex(TestIndexWriterReader.java:1043)
>         at sun.reflect.NativeMethodAccessorImpl.invoke0(Native Method)
>         at sun.reflect.NativeMethodAccessorImpl.invoke(NativeMethodAccessorImpl.java:39)
>         at sun.reflect.DelegatingMethodAccessorImpl.invoke(DelegatingMethodAccessorImpl.java:25)
>         at java.lang.reflect.Method.invoke(Method.java:597)
>         at com.carrotsearch.randomizedtesting.RandomizedRunner.invoke(RandomizedRunner.java:1559)
>         at com.carrotsearch.randomizedtesting.RandomizedRunner.access$600(RandomizedRunner.java:79)
>         at com.carrotsearch.randomizedtesting.RandomizedRunner$6.evaluate(RandomizedRunner.java:737)
>         at com.carrotsearch.randomizedtesting.RandomizedRunner$7.evaluate(RandomizedRunner.java:773)
>         at com.carrotsearch.randomizedtesting.RandomizedRunner$8.evaluate(RandomizedRunner.java:787)
>         at org.apache.lucene.util.TestRuleSetupTeardownChained$1.evaluate(TestRuleSetupTeardownChained.java:50)
>         at org.apache.lucene.util.TestRuleFieldCacheSanity$1.evaluate(TestRuleFieldCacheSanity.java:51)
>         at org.apache.lucene.util.AbstractBeforeAfterRule$1.evaluate(AbstractBeforeAfterRule.java:46)
>         at com.carrotsearch.randomizedtesting.rules.SystemPropertiesInvariantRule$1.evaluate(SystemPropertiesInvariantRule.java:55)
>         at org.apache.lucene.util.TestRuleThreadAndTestName$1.evaluate(TestRuleThreadAndTestName.java:49)
>         at org.apache.lucene.util.TestRuleIgnoreAfterMaxFailures$1.evaluate(TestRuleIgnoreAfterMaxFailures.java:70)
>         at org.apache.lucene.util.TestRuleMarkFailure$1.evaluate(TestRuleMarkFailure.java:48)
>         at com.carrotsearch.randomizedtesting.rules.StatementAdapter.evaluate(StatementAdapter.java:36)
>         at com.carrotsearch.randomizedtesting.ThreadLeakControl$StatementRunner.run(ThreadLeakControl.java:358)
>         at com.carrotsearch.randomizedtesting.ThreadLeakControl.forkTimeoutingTask(ThreadLeakControl.java:782)
>         at com.carrotsearch.randomizedtesting.ThreadLeakControl$3.evaluate(ThreadLeakControl.java:442)
>         at com.carrotsearch.randomizedtesting.RandomizedRunner.runSingleTest(RandomizedRunner.java:746)
>         at com.carrotsearch.randomizedtesting.RandomizedRunner$3.evaluate(RandomizedRunner.java:648)
>         at com.carrotsearch.randomizedtesting.RandomizedRunner$4.evaluate(RandomizedRunner.java:682)
>         at com.carrotsearch.randomizedtesting.RandomizedRunner$5.evaluate(RandomizedRunner.java:693)
>         at org.apache.lucene.util.AbstractBeforeAfterRule$1.evaluate(AbstractBeforeAfterRule.java:46)
>         at org.apache.lucene.util.TestRuleStoreClassName$1.evaluate(TestRuleStoreClassName.java:42)
>         at com.carrotsearch.randomizedtesting.rules.SystemPropertiesInvariantRule$1.evaluate(SystemPropertiesInvariantRule.java:55)
>         at com.carrotsearch.randomizedtesting.rules.NoShadowingOrOverridesOnMethodsRule$1.evaluate(NoShadowingOrOverridesOnMethodsRule.java:39)
>         at com.carrotsearch.randomizedtesting.rules.NoShadowingOrOverridesOnMethodsRule$1.evaluate(NoShadowingOrOverridesOnMethodsRule.java:39)
>         at com.carrotsearch.randomizedtesting.rules.StatementAdapter.evaluate(StatementAdapter.java:36)
>         at org.apache.lucene.util.TestRuleAssertionsRequired$1.evaluate(TestRuleAssertionsRequired.java:43)
>         at org.apache.lucene.util.TestRuleMarkFailure$1.evaluate(TestRuleMarkFailure.java:48)
>         at org.apache.lucene.util.TestRuleIgnoreAfterMaxFailures$1.evaluate(TestRuleIgnoreAfterMaxFailures.java:70)
>         at org.apache.lucene.util.TestRuleIgnoreTestSuites$1.evaluate(TestRuleIgnoreTestSuites.java:55)
>         at com.carrotsearch.randomizedtesting.rules.StatementAdapter.evaluate(StatementAdapter.java:36)
>         at com.carrotsearch.randomizedtesting.ThreadLeakControl$StatementRunner.run(ThreadLeakControl.java:358)
>         at java.lang.Thread.run(Thread.java:662)
>
>
>
>
> Build Log:
> [...truncated 641 lines...]
>    [junit4] Suite: org.apache.lucene.index.TestIndexWriterReader
>    [junit4]   2> NOTE: reproduce with: ant test  -Dtestcase=TestIndexWriterReader
-Dtests.method=testNoTermsIndex -Dtests.seed=9CE6A84339D41DE3 -Dtests.slow=true -Dtests.locale=es
-Dtests.timezone=Etc/GMT+11 -Dtests.file.encoding=UTF-8
>    [junit4] FAILURE 0.10s J2 | TestIndexWriterReader.testNoTermsIndex <<<
>    [junit4]    > Throwable #1: java.lang.AssertionError: should have failed to seek
since terms index was not loaded.
>    [junit4]    >        at __randomizedtesting.SeedInfo.seed([9CE6A84339D41DE3:107F46CCDEE31B19]:0)
>    [junit4]    >        at org.apache.lucene.index.TestIndexWriterReader.testNoTermsIndex(TestIndexWriterReader.java:1043)
>    [junit4]    >        at java.lang.Thread.run(Thread.java:662)
>    [junit4]   2> NOTE: test params are: codec=Lucene46: {field=PostingsFormat(name=MockRandom),
f=PostingsFormat(name=MockRandom), field5=PostingsFormat(name=NestedPulsing), id=MockFixedIntBlock(blockSize=890),
field4=PostingsFormat(name=MockRandom), field3=MockFixedIntBlock(blockSize=890), field2=PostingsFormat(name=TestBloomFilteredLucene41Postings),
foo=PostingsFormat(name=MockRandom), field1=PostingsFormat(name=NestedPulsing), indexname=MockFixedIntBlock(blockSize=890)},
docValues:{}, sim=RandomSimilarityProvider(queryNorm=false,coord=crazy): {field=IB SPL-D3(800.0),
f=LM Jelinek-Mercer(0.700000), field5=IB LL-L1, field4=DFR I(ne)L1, field3=DFR GL3(800.0),
field2=DFR I(n)L1, foo=DFR I(F)LZ(0.3), field1=DFR I(n)BZ(0.3), indexname=DFR GL3(800.0)},
locale=es, timezone=Etc/GMT+11
>    [junit4]   2> NOTE: Linux 3.2.0-26-generic amd64/Sun Microsystems Inc. 1.6.0_45
(64-bit)/cpus=8,threads=1,free=67075032,total=262668288
>    [junit4]   2> NOTE: All tests run in this JVM: [TestSloppyPhraseQuery2, TestDocValuesFormat,
TestSimpleExplanations, TestSurrogates, TestFlushByRamOrCountsPolicy, TestNRTThreads, TestMathUtil,
NestedSetupChain, NestedTeardownChain, TestPayloadSpans, TestHugeRamFile, TestImpersonation,
TestBagOfPositions, TestLucene3xPostingsFormat, TestBasicOperations, TestOmitPositions, TestSegmentReader,
TestTopFieldCollector, TestInPlaceMergeSorter, TestCharsRef, TestRecyclingByteBlockAllocator,
TestPayloadTermQuery, TestForTooMuchCloning, TestIdentityHashSet, TestPhrasePrefixQuery, TestIndexWriterReader]
>    [junit4] Completed on J2 in 51.06s, 23 tests, 1 failure <<< FAILURES!
>
> [...truncated 769 lines...]
> BUILD FAILED
> /var/lib/jenkins/workspace/Lucene-4x-Linux-Java6-64-test-only/checkout/lucene/build.xml:49:
The following error occurred while executing this line:
> /var/lib/jenkins/workspace/Lucene-4x-Linux-Java6-64-test-only/checkout/lucene/common-build.xml:1308:
The following error occurred while executing this line:
> /var/lib/jenkins/workspace/Lucene-4x-Linux-Java6-64-test-only/checkout/lucene/common-build.xml:941:
There were test failures: 379 suites, 2766 tests, 1 failure, 77 ignored (64 assumptions)
>
> Total time: 5 minutes 29 seconds
> Build step 'Invoke Ant' marked build as failure
> Recording test results
> Email was triggered for: Failure
> Sending email for trigger: Failure
>
>
>
>
> ---------------------------------------------------------------------
> To unsubscribe, e-mail: dev-unsubscribe@lucene.apache.org
> For additional commands, e-mail: dev-help@lucene.apache.org

---------------------------------------------------------------------
To unsubscribe, e-mail: dev-unsubscribe@lucene.apache.org
For additional commands, e-mail: dev-help@lucene.apache.org


Mime
View raw message