lucene-dev mailing list archives

Site index · List index
Message view « Date » · « Thread »
Top « Date » · « Thread »
From Apache Jenkins Server <jenk...@builds.apache.org>
Subject [JENKINS] Lucene-Solr-NightlyTests-4.x - Build # 489 - Still Failing
Date Fri, 17 Jan 2014 07:43:18 GMT
Build: https://builds.apache.org/job/Lucene-Solr-NightlyTests-4.x/489/

1 tests failed.
FAILED:  org.apache.solr.morphlines.cell.SolrCellMorphlineTest.testSolrCellDocumentTypes2

Error Message:
key:ignored_creation_date expected:<[2007-10-01T16:13:56Z]> but was:<[]>

Stack Trace:
java.lang.AssertionError: key:ignored_creation_date expected:<[2007-10-01T16:13:56Z]> but was:<[]>
	at __randomizedtesting.SeedInfo.seed([3335AFF825A799E4:B8B5141822510A1A]:0)
	at org.junit.Assert.fail(Assert.java:93)
	at org.junit.Assert.failNotEquals(Assert.java:647)
	at org.junit.Assert.assertEquals(Assert.java:128)
	at org.apache.solr.morphlines.solr.AbstractSolrMorphlineTestBase.testDocumentTypesInternal(AbstractSolrMorphlineTestBase.java:165)
	at org.apache.solr.morphlines.cell.SolrCellMorphlineTest.testSolrCellDocumentTypes2(SolrCellMorphlineTest.java:255)
	at sun.reflect.NativeMethodAccessorImpl.invoke0(Native Method)
	at sun.reflect.NativeMethodAccessorImpl.invoke(NativeMethodAccessorImpl.java:57)
	at sun.reflect.DelegatingMethodAccessorImpl.invoke(DelegatingMethodAccessorImpl.java:43)
	at java.lang.reflect.Method.invoke(Method.java:616)
	at com.carrotsearch.randomizedtesting.RandomizedRunner.invoke(RandomizedRunner.java:1559)
	at com.carrotsearch.randomizedtesting.RandomizedRunner.access$600(RandomizedRunner.java:79)
	at com.carrotsearch.randomizedtesting.RandomizedRunner$6.evaluate(RandomizedRunner.java:737)
	at com.carrotsearch.randomizedtesting.RandomizedRunner$7.evaluate(RandomizedRunner.java:773)
	at com.carrotsearch.randomizedtesting.RandomizedRunner$8.evaluate(RandomizedRunner.java:787)
	at com.carrotsearch.randomizedtesting.rules.SystemPropertiesRestoreRule$1.evaluate(SystemPropertiesRestoreRule.java:53)
	at org.apache.lucene.util.TestRuleSetupTeardownChained$1.evaluate(TestRuleSetupTeardownChained.java:50)
	at org.apache.lucene.util.TestRuleFieldCacheSanity$1.evaluate(TestRuleFieldCacheSanity.java:51)
	at org.apache.lucene.util.AbstractBeforeAfterRule$1.evaluate(AbstractBeforeAfterRule.java:46)
	at com.carrotsearch.randomizedtesting.rules.SystemPropertiesInvariantRule$1.evaluate(SystemPropertiesInvariantRule.java:55)
	at org.apache.lucene.util.TestRuleThreadAndTestName$1.evaluate(TestRuleThreadAndTestName.java:49)
	at org.apache.lucene.util.TestRuleIgnoreAfterMaxFailures$1.evaluate(TestRuleIgnoreAfterMaxFailures.java:70)
	at org.apache.lucene.util.TestRuleMarkFailure$1.evaluate(TestRuleMarkFailure.java:48)
	at com.carrotsearch.randomizedtesting.rules.StatementAdapter.evaluate(StatementAdapter.java:36)
	at com.carrotsearch.randomizedtesting.ThreadLeakControl$StatementRunner.run(ThreadLeakControl.java:358)
	at com.carrotsearch.randomizedtesting.ThreadLeakControl.forkTimeoutingTask(ThreadLeakControl.java:782)
	at com.carrotsearch.randomizedtesting.ThreadLeakControl$3.evaluate(ThreadLeakControl.java:442)
	at com.carrotsearch.randomizedtesting.RandomizedRunner.runSingleTest(RandomizedRunner.java:746)
	at com.carrotsearch.randomizedtesting.RandomizedRunner$3.evaluate(RandomizedRunner.java:648)
	at com.carrotsearch.randomizedtesting.RandomizedRunner$4.evaluate(RandomizedRunner.java:682)
	at com.carrotsearch.randomizedtesting.RandomizedRunner$5.evaluate(RandomizedRunner.java:693)
	at com.carrotsearch.randomizedtesting.rules.StatementAdapter.evaluate(StatementAdapter.java:36)
	at com.carrotsearch.randomizedtesting.rules.SystemPropertiesRestoreRule$1.evaluate(SystemPropertiesRestoreRule.java:53)
	at org.apache.lucene.util.AbstractBeforeAfterRule$1.evaluate(AbstractBeforeAfterRule.java:46)
	at org.apache.lucene.util.TestRuleStoreClassName$1.evaluate(TestRuleStoreClassName.java:42)
	at com.carrotsearch.randomizedtesting.rules.SystemPropertiesInvariantRule$1.evaluate(SystemPropertiesInvariantRule.java:55)
	at com.carrotsearch.randomizedtesting.rules.NoShadowingOrOverridesOnMethodsRule$1.evaluate(NoShadowingOrOverridesOnMethodsRule.java:39)
	at com.carrotsearch.randomizedtesting.rules.NoShadowingOrOverridesOnMethodsRule$1.evaluate(NoShadowingOrOverridesOnMethodsRule.java:39)
	at com.carrotsearch.randomizedtesting.rules.StatementAdapter.evaluate(StatementAdapter.java:36)
	at org.apache.lucene.util.TestRuleAssertionsRequired$1.evaluate(TestRuleAssertionsRequired.java:43)
	at org.apache.lucene.util.TestRuleMarkFailure$1.evaluate(TestRuleMarkFailure.java:48)
	at org.apache.lucene.util.TestRuleIgnoreAfterMaxFailures$1.evaluate(TestRuleIgnoreAfterMaxFailures.java:70)
	at org.apache.lucene.util.TestRuleIgnoreTestSuites$1.evaluate(TestRuleIgnoreTestSuites.java:55)
	at com.carrotsearch.randomizedtesting.rules.StatementAdapter.evaluate(StatementAdapter.java:36)
	at com.carrotsearch.randomizedtesting.ThreadLeakControl$StatementRunner.run(ThreadLeakControl.java:358)
	at java.lang.Thread.run(Thread.java:679)




Build Log:
[...truncated 17766 lines...]
   [junit4] Suite: org.apache.solr.morphlines.cell.SolrCellMorphlineTest
   [junit4]   1> 2014-01-17 07:41:58,452 INFO  [SUITE-SolrCellMorphlineTest-seed#[3335AFF825A799E4]-worker] solr.SolrTestCaseJ4 (SolrTestCaseJ4.java:initCore(454)) - ####initCore
   [junit4]   1> 2014-01-17 07:41:58,581 INFO  [SUITE-SolrCellMorphlineTest-seed#[3335AFF825A799E4]-worker] core.SolrResourceLoader (SolrResourceLoader.java:<init>(116)) - new SolrResourceLoader for directory: '/usr/home/hudson/hudson-slave/workspace/Lucene-Solr-NightlyTests-4.x/solr/contrib/map-reduce/src/test-files/solr/collection1/'
   [junit4]   1> 2014-01-17 07:42:00,575 INFO  [SUITE-SolrCellMorphlineTest-seed#[3335AFF825A799E4]-worker] core.SolrConfig (SolrConfig.java:initLibs(529)) - Adding specified lib dirs to ClassLoader
   [junit4]   1> 2014-01-17 07:42:00,580 WARN  [SUITE-SolrCellMorphlineTest-seed#[3335AFF825A799E4]-worker] core.SolrResourceLoader (SolrResourceLoader.java:addToClassLoader(170)) - Can't find (or read) directory to add to classloader: ../../../contrib/extraction/lib (resolved as: /usr/home/hudson/hudson-slave/workspace/Lucene-Solr-NightlyTests-4.x/solr/contrib/map-reduce/src/test-files/solr/collection1/../../../contrib/extraction/lib).
   [junit4]   1> 2014-01-17 07:42:00,581 WARN  [SUITE-SolrCellMorphlineTest-seed#[3335AFF825A799E4]-worker] core.SolrResourceLoader (SolrResourceLoader.java:addToClassLoader(170)) - Can't find (or read) directory to add to classloader: ../../../dist/ (resolved as: /usr/home/hudson/hudson-slave/workspace/Lucene-Solr-NightlyTests-4.x/solr/contrib/map-reduce/src/test-files/solr/collection1/../../../dist).
   [junit4]   1> 2014-01-17 07:42:00,582 WARN  [SUITE-SolrCellMorphlineTest-seed#[3335AFF825A799E4]-worker] core.SolrResourceLoader (SolrResourceLoader.java:addToClassLoader(170)) - Can't find (or read) directory to add to classloader: ../../../contrib/clustering/lib/ (resolved as: /usr/home/hudson/hudson-slave/workspace/Lucene-Solr-NightlyTests-4.x/solr/contrib/map-reduce/src/test-files/solr/collection1/../../../contrib/clustering/lib).
   [junit4]   1> 2014-01-17 07:42:00,583 WARN  [SUITE-SolrCellMorphlineTest-seed#[3335AFF825A799E4]-worker] core.SolrResourceLoader (SolrResourceLoader.java:addToClassLoader(170)) - Can't find (or read) directory to add to classloader: ../../../dist/ (resolved as: /usr/home/hudson/hudson-slave/workspace/Lucene-Solr-NightlyTests-4.x/solr/contrib/map-reduce/src/test-files/solr/collection1/../../../dist).
   [junit4]   1> 2014-01-17 07:42:00,584 WARN  [SUITE-SolrCellMorphlineTest-seed#[3335AFF825A799E4]-worker] core.SolrResourceLoader (SolrResourceLoader.java:addToClassLoader(170)) - Can't find (or read) directory to add to classloader: ../../../contrib/langid/lib/ (resolved as: /usr/home/hudson/hudson-slave/workspace/Lucene-Solr-NightlyTests-4.x/solr/contrib/map-reduce/src/test-files/solr/collection1/../../../contrib/langid/lib).
   [junit4]   1> 2014-01-17 07:42:00,585 WARN  [SUITE-SolrCellMorphlineTest-seed#[3335AFF825A799E4]-worker] core.SolrResourceLoader (SolrResourceLoader.java:addToClassLoader(170)) - Can't find (or read) directory to add to classloader: ../../../dist/ (resolved as: /usr/home/hudson/hudson-slave/workspace/Lucene-Solr-NightlyTests-4.x/solr/contrib/map-reduce/src/test-files/solr/collection1/../../../dist).
   [junit4]   1> 2014-01-17 07:42:00,586 WARN  [SUITE-SolrCellMorphlineTest-seed#[3335AFF825A799E4]-worker] core.SolrResourceLoader (SolrResourceLoader.java:addToClassLoader(170)) - Can't find (or read) directory to add to classloader: ../../../contrib/velocity/lib (resolved as: /usr/home/hudson/hudson-slave/workspace/Lucene-Solr-NightlyTests-4.x/solr/contrib/map-reduce/src/test-files/solr/collection1/../../../contrib/velocity/lib).
   [junit4]   1> 2014-01-17 07:42:00,587 WARN  [SUITE-SolrCellMorphlineTest-seed#[3335AFF825A799E4]-worker] core.SolrResourceLoader (SolrResourceLoader.java:addToClassLoader(170)) - Can't find (or read) directory to add to classloader: ../../../dist/ (resolved as: /usr/home/hudson/hudson-slave/workspace/Lucene-Solr-NightlyTests-4.x/solr/contrib/map-reduce/src/test-files/solr/collection1/../../../dist).
   [junit4]   1> 2014-01-17 07:42:00,588 WARN  [SUITE-SolrCellMorphlineTest-seed#[3335AFF825A799E4]-worker] core.SolrResourceLoader (SolrResourceLoader.java:addToClassLoader(170)) - Can't find (or read) directory to add to classloader: /non/existent/dir/yields/warning (resolved as: /non/existent/dir/yields/warning).
   [junit4]   1> 2014-01-17 07:42:00,824 INFO  [SUITE-SolrCellMorphlineTest-seed#[3335AFF825A799E4]-worker] core.SolrConfig (SolrConfig.java:<init>(170)) - Using Lucene MatchVersion: LUCENE_43
   [junit4]   1> 2014-01-17 07:42:01,100 INFO  [SUITE-SolrCellMorphlineTest-seed#[3335AFF825A799E4]-worker] core.Config (SolrConfig.java:<init>(288)) - Loaded SolrConfig: /usr/home/hudson/hudson-slave/workspace/Lucene-Solr-NightlyTests-4.x/solr/contrib/map-reduce/src/test-files/solr/collection1/conf/solrconfig.xml
   [junit4]   1> 2014-01-17 07:42:01,124 INFO  [SUITE-SolrCellMorphlineTest-seed#[3335AFF825A799E4]-worker] schema.IndexSchema (IndexSchema.java:readSchema(424)) - Reading Solr Schema from /usr/home/hudson/hudson-slave/workspace/Lucene-Solr-NightlyTests-4.x/solr/contrib/map-reduce/src/test-files/solr/collection1/conf/schema.xml
   [junit4]   1> 2014-01-17 07:42:01,210 INFO  [SUITE-SolrCellMorphlineTest-seed#[3335AFF825A799E4]-worker] schema.IndexSchema (IndexSchema.java:readSchema(452)) - [null] Schema name=example
   [junit4]   1> 2014-01-17 07:42:03,311 INFO  [SUITE-SolrCellMorphlineTest-seed#[3335AFF825A799E4]-worker] schema.IndexSchema (IndexSchema.java:readSchema(550)) - unique key field: id
   [junit4]   1> 2014-01-17 07:42:04,000 INFO  [SUITE-SolrCellMorphlineTest-seed#[3335AFF825A799E4]-worker] schema.FileExchangeRateProvider (CurrencyField.java:reload(787)) - Reloading exchange rates from file currency.xml
   [junit4]   1> 2014-01-17 07:42:04,028 INFO  [SUITE-SolrCellMorphlineTest-seed#[3335AFF825A799E4]-worker] schema.FileExchangeRateProvider (CurrencyField.java:reload(787)) - Reloading exchange rates from file currency.xml
   [junit4]   1> 2014-01-17 07:42:04,246 INFO  [SUITE-SolrCellMorphlineTest-seed#[3335AFF825A799E4]-worker] core.SolrResourceLoader (SolrResourceLoader.java:locateSolrHome(711)) - JNDI not configured for solr (NoInitialContextEx)
   [junit4]   1> 2014-01-17 07:42:04,247 INFO  [SUITE-SolrCellMorphlineTest-seed#[3335AFF825A799E4]-worker] core.SolrResourceLoader (SolrResourceLoader.java:locateSolrHome(723)) - using system property solr.solr.home: /usr/home/hudson/hudson-slave/workspace/Lucene-Solr-NightlyTests-4.x/solr/contrib/map-reduce/src/test-files/solr
   [junit4]   1> 2014-01-17 07:42:04,248 INFO  [SUITE-SolrCellMorphlineTest-seed#[3335AFF825A799E4]-worker] core.SolrResourceLoader (SolrResourceLoader.java:<init>(116)) - new SolrResourceLoader for directory: '/usr/home/hudson/hudson-slave/workspace/Lucene-Solr-NightlyTests-4.x/solr/contrib/map-reduce/src/test-files/solr/'
   [junit4]   1> 2014-01-17 07:42:04,367 INFO  [SUITE-SolrCellMorphlineTest-seed#[3335AFF825A799E4]-worker] core.SolrResourceLoader (SolrResourceLoader.java:locateSolrHome(711)) - JNDI not configured for solr (NoInitialContextEx)
   [junit4]   1> 2014-01-17 07:42:04,368 INFO  [SUITE-SolrCellMorphlineTest-seed#[3335AFF825A799E4]-worker] core.SolrResourceLoader (SolrResourceLoader.java:locateSolrHome(723)) - using system property solr.solr.home: /usr/home/hudson/hudson-slave/workspace/Lucene-Solr-NightlyTests-4.x/solr/contrib/map-reduce/src/test-files/solr
   [junit4]   1> 2014-01-17 07:42:04,368 INFO  [SUITE-SolrCellMorphlineTest-seed#[3335AFF825A799E4]-worker] core.SolrResourceLoader (SolrResourceLoader.java:<init>(112)) - new SolrResourceLoader for deduced Solr Home: '/usr/home/hudson/hudson-slave/workspace/Lucene-Solr-NightlyTests-4.x/solr/contrib/map-reduce/src/test-files/solr/'
   [junit4]   1> 2014-01-17 07:42:04,560 INFO  [SUITE-SolrCellMorphlineTest-seed#[3335AFF825A799E4]-worker] core.CoreContainer (CoreContainer.java:<init>(107)) - New CoreContainer 1658340521
   [junit4]   1> 2014-01-17 07:42:04,561 INFO  [SUITE-SolrCellMorphlineTest-seed#[3335AFF825A799E4]-worker] core.CoreContainer (CoreContainer.java:load(187)) - Loading cores into CoreContainer [instanceDir=/usr/home/hudson/hudson-slave/workspace/Lucene-Solr-NightlyTests-4.x/solr/contrib/map-reduce/src/test-files/solr/]
   [junit4]   1> 2014-01-17 07:42:04,639 INFO  [SUITE-SolrCellMorphlineTest-seed#[3335AFF825A799E4]-worker] component.HttpShardHandlerFactory (HttpShardHandlerFactory.java:getParameter(169)) - Setting socketTimeout to: 0
   [junit4]   1> 2014-01-17 07:42:04,639 INFO  [SUITE-SolrCellMorphlineTest-seed#[3335AFF825A799E4]-worker] component.HttpShardHandlerFactory (HttpShardHandlerFactory.java:getParameter(169)) - Setting urlScheme to: http://
   [junit4]   1> 2014-01-17 07:42:04,640 INFO  [SUITE-SolrCellMorphlineTest-seed#[3335AFF825A799E4]-worker] component.HttpShardHandlerFactory (HttpShardHandlerFactory.java:getParameter(169)) - Setting connTimeout to: 0
   [junit4]   1> 2014-01-17 07:42:04,640 INFO  [SUITE-SolrCellMorphlineTest-seed#[3335AFF825A799E4]-worker] component.HttpShardHandlerFactory (HttpShardHandlerFactory.java:getParameter(169)) - Setting maxConnectionsPerHost to: 20
   [junit4]   1> 2014-01-17 07:42:04,641 INFO  [SUITE-SolrCellMorphlineTest-seed#[3335AFF825A799E4]-worker] component.HttpShardHandlerFactory (HttpShardHandlerFactory.java:getParameter(169)) - Setting corePoolSize to: 0
   [junit4]   1> 2014-01-17 07:42:04,641 INFO  [SUITE-SolrCellMorphlineTest-seed#[3335AFF825A799E4]-worker] component.HttpShardHandlerFactory (HttpShardHandlerFactory.java:getParameter(169)) - Setting maximumPoolSize to: 2147483647
   [junit4]   1> 2014-01-17 07:42:04,642 INFO  [SUITE-SolrCellMorphlineTest-seed#[3335AFF825A799E4]-worker] component.HttpShardHandlerFactory (HttpShardHandlerFactory.java:getParameter(169)) - Setting maxThreadIdleTime to: 5
   [junit4]   1> 2014-01-17 07:42:04,642 INFO  [SUITE-SolrCellMorphlineTest-seed#[3335AFF825A799E4]-worker] component.HttpShardHandlerFactory (HttpShardHandlerFactory.java:getParameter(169)) - Setting sizeOfQueue to: -1
   [junit4]   1> 2014-01-17 07:42:04,643 INFO  [SUITE-SolrCellMorphlineTest-seed#[3335AFF825A799E4]-worker] component.HttpShardHandlerFactory (HttpShardHandlerFactory.java:getParameter(169)) - Setting fairnessPolicy to: false
   [junit4]   1> 2014-01-17 07:42:05,354 INFO  [SUITE-SolrCellMorphlineTest-seed#[3335AFF825A799E4]-worker] logging.LogWatcher (LogWatcher.java:createWatcher(153)) - SLF4J impl is org.slf4j.impl.Log4jLoggerFactory
   [junit4]   1> 2014-01-17 07:42:05,359 INFO  [SUITE-SolrCellMorphlineTest-seed#[3335AFF825A799E4]-worker] logging.LogWatcher (LogWatcher.java:newRegisteredLogWatcher(138)) - Registering Log Listener [Log4j (org.slf4j.impl.Log4jLoggerFactory)]
   [junit4]   1> 2014-01-17 07:42:05,367 INFO  [SUITE-SolrCellMorphlineTest-seed#[3335AFF825A799E4]-worker] core.CoreContainer (CoreContainer.java:load(213)) - Host Name: 
   [junit4]   1> 2014-01-17 07:42:05,795 INFO  [coreLoadExecutor-4-thread-1] core.CoreContainer (CoreContainer.java:create(589)) - Creating SolrCore 'collection1' using instanceDir: /usr/home/hudson/hudson-slave/workspace/Lucene-Solr-NightlyTests-4.x/solr/contrib/map-reduce/src/test-files/solr/collection1
   [junit4]   1> 2014-01-17 07:42:05,796 INFO  [coreLoadExecutor-4-thread-1] core.SolrResourceLoader (SolrResourceLoader.java:<init>(116)) - new SolrResourceLoader for directory: '/usr/home/hudson/hudson-slave/workspace/Lucene-Solr-NightlyTests-4.x/solr/contrib/map-reduce/src/test-files/solr/collection1/'
   [junit4]   1> 2014-01-17 07:42:05,957 INFO  [coreLoadExecutor-4-thread-1] core.SolrConfig (SolrConfig.java:initLibs(529)) - Adding specified lib dirs to ClassLoader
   [junit4]   1> 2014-01-17 07:42:05,959 WARN  [coreLoadExecutor-4-thread-1] core.SolrResourceLoader (SolrResourceLoader.java:addToClassLoader(170)) - Can't find (or read) directory to add to classloader: ../../../contrib/extraction/lib (resolved as: /usr/home/hudson/hudson-slave/workspace/Lucene-Solr-NightlyTests-4.x/solr/contrib/map-reduce/src/test-files/solr/collection1/../../../contrib/extraction/lib).
   [junit4]   1> 2014-01-17 07:42:05,960 WARN  [coreLoadExecutor-4-thread-1] core.SolrResourceLoader (SolrResourceLoader.java:addToClassLoader(170)) - Can't find (or read) directory to add to classloader: ../../../dist/ (resolved as: /usr/home/hudson/hudson-slave/workspace/Lucene-Solr-NightlyTests-4.x/solr/contrib/map-reduce/src/test-files/solr/collection1/../../../dist).
   [junit4]   1> 2014-01-17 07:42:05,962 WARN  [coreLoadExecutor-4-thread-1] core.SolrResourceLoader (SolrResourceLoader.java:addToClassLoader(170)) - Can't find (or read) directory to add to classloader: ../../../contrib/clustering/lib/ (resolved as: /usr/home/hudson/hudson-slave/workspace/Lucene-Solr-NightlyTests-4.x/solr/contrib/map-reduce/src/test-files/solr/collection1/../../../contrib/clustering/lib).
   [junit4]   1> 2014-01-17 07:42:05,963 WARN  [coreLoadExecutor-4-thread-1] core.SolrResourceLoader (SolrResourceLoader.java:addToClassLoader(170)) - Can't find (or read) directory to add to classloader: ../../../dist/ (resolved as: /usr/home/hudson/hudson-slave/workspace/Lucene-Solr-NightlyTests-4.x/solr/contrib/map-reduce/src/test-files/solr/collection1/../../../dist).
   [junit4]   1> 2014-01-17 07:42:05,964 WARN  [coreLoadExecutor-4-thread-1] core.SolrResourceLoader (SolrResourceLoader.java:addToClassLoader(170)) - Can't find (or read) directory to add to classloader: ../../../contrib/langid/lib/ (resolved as: /usr/home/hudson/hudson-slave/workspace/Lucene-Solr-NightlyTests-4.x/solr/contrib/map-reduce/src/test-files/solr/collection1/../../../contrib/langid/lib).
   [junit4]   1> 2014-01-17 07:42:05,965 WARN  [coreLoadExecutor-4-thread-1] core.SolrResourceLoader (SolrResourceLoader.java:addToClassLoader(170)) - Can't find (or read) directory to add to classloader: ../../../dist/ (resolved as: /usr/home/hudson/hudson-slave/workspace/Lucene-Solr-NightlyTests-4.x/solr/contrib/map-reduce/src/test-files/solr/collection1/../../../dist).
   [junit4]   1> 2014-01-17 07:42:05,967 WARN  [coreLoadExecutor-4-thread-1] core.SolrResourceLoader (SolrResourceLoader.java:addToClassLoader(170)) - Can't find (or read) directory to add to classloader: ../../../contrib/velocity/lib (resolved as: /usr/home/hudson/hudson-slave/workspace/Lucene-Solr-NightlyTests-4.x/solr/contrib/map-reduce/src/test-files/solr/collection1/../../../contrib/velocity/lib).
   [junit4]   1> 2014-01-17 07:42:05,968 WARN  [coreLoadExecutor-4-thread-1] core.SolrResourceLoader (SolrResourceLoader.java:addToClassLoader(170)) - Can't find (or read) directory to add to classloader: ../../../dist/ (resolved as: /usr/home/hudson/hudson-slave/workspace/Lucene-Solr-NightlyTests-4.x/solr/contrib/map-reduce/src/test-files/solr/collection1/../../../dist).
   [junit4]   1> 2014-01-17 07:42:05,968 WARN  [coreLoadExecutor-4-thread-1] core.SolrResourceLoader (SolrResourceLoader.java:addToClassLoader(170)) - Can't find (or read) directory to add to classloader: /non/existent/dir/yields/warning (resolved as: /non/existent/dir/yields/warning).
   [junit4]   1> 2014-01-17 07:42:06,063 INFO  [coreLoadExecutor-4-thread-1] core.SolrConfig (SolrConfig.java:<init>(170)) - Using Lucene MatchVersion: LUCENE_43
   [junit4]   1> 2014-01-17 07:42:06,211 INFO  [coreLoadExecutor-4-thread-1] core.Config (SolrConfig.java:<init>(288)) - Loaded SolrConfig: /usr/home/hudson/hudson-slave/workspace/Lucene-Solr-NightlyTests-4.x/solr/contrib/map-reduce/src/test-files/solr/collection1/conf/solrconfig.xml
   [junit4]   1> 2014-01-17 07:42:06,213 INFO  [coreLoadExecutor-4-thread-1] schema.IndexSchema (IndexSchema.java:readSchema(424)) - Reading Solr Schema from /usr/home/hudson/hudson-slave/workspace/Lucene-Solr-NightlyTests-4.x/solr/contrib/map-reduce/src/test-files/solr/collection1/conf/schema.xml
   [junit4]   1> 2014-01-17 07:42:06,290 INFO  [coreLoadExecutor-4-thread-1] schema.IndexSchema (IndexSchema.java:readSchema(452)) - [collection1] Schema name=example
   [junit4]   1> 2014-01-17 07:42:07,078 INFO  [coreLoadExecutor-4-thread-1] schema.IndexSchema (IndexSchema.java:readSchema(550)) - unique key field: id
   [junit4]   1> 2014-01-17 07:42:07,106 INFO  [coreLoadExecutor-4-thread-1] schema.FileExchangeRateProvider (CurrencyField.java:reload(787)) - Reloading exchange rates from file currency.xml
   [junit4]   1> 2014-01-17 07:42:07,115 INFO  [coreLoadExecutor-4-thread-1] schema.FileExchangeRateProvider (CurrencyField.java:reload(787)) - Reloading exchange rates from file currency.xml
   [junit4]   1> 2014-01-17 07:42:07,322 INFO  [coreLoadExecutor-4-thread-1] core.SolrCore (SolrCore.java:initDirectoryFactory(439)) - org.apache.solr.core.MockDirectoryFactory
   [junit4]   1> 2014-01-17 07:42:07,359 INFO  [coreLoadExecutor-4-thread-1] core.SolrCore (SolrCore.java:<init>(689)) - [collection1] Opening new SolrCore at /usr/home/hudson/hudson-slave/workspace/Lucene-Solr-NightlyTests-4.x/solr/contrib/map-reduce/src/test-files/solr/collection1/, dataDir=/usr/home/hudson/hudson-slave/workspace/Lucene-Solr-NightlyTests-4.x/solr/build/contrib/solr-morphlines-cell/test/J0/./solrtest-SolrCellMorphlineTest-1389944518467/
   [junit4]   1> 2014-01-17 07:42:07,364 INFO  [coreLoadExecutor-4-thread-1] core.JmxMonitoredMap (JmxMonitoredMap.java:<init>(85)) - No JMX servers found, not exposing Solr information with JMX.
   [junit4]   1> 2014-01-17 07:42:07,416 INFO  [coreLoadExecutor-4-thread-1] core.SolrCore (SolrCore.java:initListeners(354)) - [collection1] Added SolrEventListener for newSearcher: org.apache.solr.core.QuerySenderListener{queries=[]}
   [junit4]   1> 2014-01-17 07:42:07,416 INFO  [coreLoadExecutor-4-thread-1] core.SolrCore (SolrCore.java:initListeners(350)) - [collection1] Added SolrEventListener for firstSearcher: org.apache.solr.core.QuerySenderListener{queries=[{q=static firstSearcher warming in solrconfig.xml}]}
   [junit4]   1> 2014-01-17 07:42:07,540 INFO  [coreLoadExecutor-4-thread-1] core.CachingDirectoryFactory (CachingDirectoryFactory.java:get(360)) - return new directory for /usr/home/hudson/hudson-slave/workspace/Lucene-Solr-NightlyTests-4.x/solr/build/contrib/solr-morphlines-cell/test/J0/./solrtest-SolrCellMorphlineTest-1389944518467
   [junit4]   1> 2014-01-17 07:42:07,541 INFO  [coreLoadExecutor-4-thread-1] core.SolrCore (SolrCore.java:getNewIndexDir(284)) - New index directory detected: old=null new=/usr/home/hudson/hudson-slave/workspace/Lucene-Solr-NightlyTests-4.x/solr/build/contrib/solr-morphlines-cell/test/J0/./solrtest-SolrCellMorphlineTest-1389944518467/index/
   [junit4]   1> 2014-01-17 07:42:07,542 WARN  [coreLoadExecutor-4-thread-1] core.SolrCore (SolrCore.java:initIndex(505)) - [collection1] Solr index directory '/usr/home/hudson/hudson-slave/workspace/Lucene-Solr-NightlyTests-4.x/solr/build/contrib/solr-morphlines-cell/test/J0/./solrtest-SolrCellMorphlineTest-1389944518467/index' doesn't exist. Creating new index...
   [junit4]   1> 2014-01-17 07:42:07,555 INFO  [coreLoadExecutor-4-thread-1] core.CachingDirectoryFactory (CachingDirectoryFactory.java:get(360)) - return new directory for /usr/home/hudson/hudson-slave/workspace/Lucene-Solr-NightlyTests-4.x/solr/build/contrib/solr-morphlines-cell/test/J0/./solrtest-SolrCellMorphlineTest-1389944518467/index
   [junit4]   1> 2014-01-17 07:42:07,721 INFO  [coreLoadExecutor-4-thread-1] core.SolrCore (SolrDeletionPolicy.java:onCommit(98)) - SolrDeletionPolicy.onCommit: commits: num=1
   [junit4]   1> 	commit{dir=MockDirectoryWrapper(org.apache.lucene.store.RAMDirectory@1e8809ce lockFactory=org.apache.lucene.store.NativeFSLockFactory@213a8eb1),segFN=segments_1,generation=1}
   [junit4]   1> 2014-01-17 07:42:07,727 INFO  [coreLoadExecutor-4-thread-1] core.SolrCore (SolrDeletionPolicy.java:updateCommits(165)) - newest commit generation = 1
   [junit4]   1> 2014-01-17 07:42:07,797 INFO  [coreLoadExecutor-4-thread-1] core.SolrCore (SolrCore.java:initWriters(2033)) - created json: solr.JSONResponseWriter
   [junit4]   1> 2014-01-17 07:42:07,798 INFO  [coreLoadExecutor-4-thread-1] core.SolrCore (SolrCore.java:initWriters(2015)) - adding lazy queryResponseWriter: solr.VelocityResponseWriter
   [junit4]   1> 2014-01-17 07:42:07,804 INFO  [coreLoadExecutor-4-thread-1] core.SolrCore (SolrCore.java:initWriters(2033)) - created velocity: solr.VelocityResponseWriter
   [junit4]   1> 2014-01-17 07:42:07,877 INFO  [coreLoadExecutor-4-thread-1] core.SolrCore (SolrCore.java:initWriters(2033)) - created xslt: solr.XSLTResponseWriter
   [junit4]   1> 2014-01-17 07:42:07,878 INFO  [coreLoadExecutor-4-thread-1] response.XSLTResponseWriter (XSLTResponseWriter.java:init(63)) - xsltCacheLifetimeSeconds=5
   [junit4]   1> 2014-01-17 07:42:09,420 INFO  [coreLoadExecutor-4-thread-1] core.SolrCore (SolrCore.java:loadUpdateProcessorChains(928)) - no updateRequestProcessorChain defined as default, creating implicit default
   [junit4]   1> 2014-01-17 07:42:09,541 INFO  [coreLoadExecutor-4-thread-1] core.RequestHandlers (RequestHandlers.java:initHandlersFromConfig(165)) - created /select: solr.SearchHandler
   [junit4]   1> 2014-01-17 07:42:09,542 INFO  [coreLoadExecutor-4-thread-1] core.RequestHandlers (RequestHandlers.java:initHandlersFromConfig(165)) - created /query: solr.SearchHandler
   [junit4]   1> 2014-01-17 07:42:09,565 INFO  [coreLoadExecutor-4-thread-1] core.RequestHandlers (RequestHandlers.java:initHandlersFromConfig(165)) - created /get: solr.RealTimeGetHandler
   [junit4]   1> 2014-01-17 07:42:09,565 INFO  [coreLoadExecutor-4-thread-1] core.RequestHandlers (RequestHandlers.java:initHandlersFromConfig(165)) - created /browse: solr.SearchHandler
   [junit4]   1> 2014-01-17 07:42:09,600 INFO  [coreLoadExecutor-4-thread-1] core.RequestHandlers (RequestHandlers.java:initHandlersFromConfig(165)) - created /update: solr.UpdateRequestHandler
   [junit4]   1> 2014-01-17 07:42:09,623 WARN  [coreLoadExecutor-4-thread-1] core.SolrResourceLoader (SolrResourceLoader.java:findClass(486)) - Solr loaded a deprecated plugin/analysis class [solr.JsonUpdateRequestHandler]. Please consult documentation how to replace it accordingly.
   [junit4]   1> 2014-01-17 07:42:09,624 INFO  [coreLoadExecutor-4-thread-1] core.RequestHandlers (RequestHandlers.java:initHandlersFromConfig(165)) - created /update/json: solr.JsonUpdateRequestHandler
   [junit4]   1> 2014-01-17 07:42:09,648 WARN  [coreLoadExecutor-4-thread-1] core.SolrResourceLoader (SolrResourceLoader.java:findClass(486)) - Solr loaded a deprecated plugin/analysis class [solr.CSVRequestHandler]. Please consult documentation how to replace it accordingly.
   [junit4]   1> 2014-01-17 07:42:09,648 INFO  [coreLoadExecutor-4-thread-1] core.RequestHandlers (RequestHandlers.java:initHandlersFromConfig(165)) - created /update/csv: solr.CSVRequestHandler
   [junit4]   1> 2014-01-17 07:42:09,649 INFO  [coreLoadExecutor-4-thread-1] core.RequestHandlers (RequestHandlers.java:initHandlersFromConfig(147)) - adding lazy requestHandler: solr.FieldAnalysisRequestHandler
   [junit4]   1> 2014-01-17 07:42:09,652 INFO  [coreLoadExecutor-4-thread-1] core.RequestHandlers (RequestHandlers.java:initHandlersFromConfig(165)) - created /analysis/field: solr.FieldAnalysisRequestHandler
   [junit4]   1> 2014-01-17 07:42:09,653 INFO  [coreLoadExecutor-4-thread-1] core.RequestHandlers (RequestHandlers.java:initHandlersFromConfig(147)) - adding lazy requestHandler: solr.DocumentAnalysisRequestHandler
   [junit4]   1> 2014-01-17 07:42:09,653 INFO  [coreLoadExecutor-4-thread-1] core.RequestHandlers (RequestHandlers.java:initHandlersFromConfig(165)) - created /analysis/document: solr.DocumentAnalysisRequestHandler
   [junit4]   1> 2014-01-17 07:42:09,683 INFO  [coreLoadExecutor-4-thread-1] core.RequestHandlers (RequestHandlers.java:initHandlersFromConfig(165)) - created /admin/: solr.admin.AdminHandlers
   [junit4]   1> 2014-01-17 07:42:09,707 INFO  [coreLoadExecutor-4-thread-1] core.RequestHandlers (RequestHandlers.java:initHandlersFromConfig(165)) - created /admin/ping: solr.PingRequestHandler
   [junit4]   1> 2014-01-17 07:42:09,730 INFO  [coreLoadExecutor-4-thread-1] core.RequestHandlers (RequestHandlers.java:initHandlersFromConfig(165)) - created /debug/dump: solr.DumpRequestHandler
   [junit4]   1> 2014-01-17 07:42:09,776 INFO  [coreLoadExecutor-4-thread-1] core.RequestHandlers (RequestHandlers.java:initHandlersFromConfig(165)) - created /replication: solr.ReplicationHandler
   [junit4]   1> 2014-01-17 07:42:09,776 INFO  [coreLoadExecutor-4-thread-1] core.RequestHandlers (RequestHandlers.java:initHandlersFromConfig(147)) - adding lazy requestHandler: solr.SearchHandler
   [junit4]   1> 2014-01-17 07:42:09,777 INFO  [coreLoadExecutor-4-thread-1] core.RequestHandlers (RequestHandlers.java:initHandlersFromConfig(165)) - created /spell: solr.SearchHandler
   [junit4]   1> 2014-01-17 07:42:09,777 INFO  [coreLoadExecutor-4-thread-1] core.RequestHandlers (RequestHandlers.java:initHandlersFromConfig(147)) - adding lazy requestHandler: solr.SearchHandler
   [junit4]   1> 2014-01-17 07:42:09,778 INFO  [coreLoadExecutor-4-thread-1] core.RequestHandlers (RequestHandlers.java:initHandlersFromConfig(165)) - created /tvrh: solr.SearchHandler
   [junit4]   1> 2014-01-17 07:42:09,778 INFO  [coreLoadExecutor-4-thread-1] core.RequestHandlers (RequestHandlers.java:initHandlersFromConfig(147)) - adding lazy requestHandler: solr.SearchHandler
   [junit4]   1> 2014-01-17 07:42:09,778 INFO  [coreLoadExecutor-4-thread-1] core.RequestHandlers (RequestHandlers.java:initHandlersFromConfig(165)) - created /terms: solr.SearchHandler
   [junit4]   1> 2014-01-17 07:42:09,779 INFO  [coreLoadExecutor-4-thread-1] core.RequestHandlers (RequestHandlers.java:initHandlersFromConfig(147)) - adding lazy requestHandler: solr.SearchHandler
   [junit4]   1> 2014-01-17 07:42:09,779 INFO  [coreLoadExecutor-4-thread-1] core.RequestHandlers (RequestHandlers.java:initHandlersFromConfig(165)) - created /elevate: solr.SearchHandler
   [junit4]   1> 2014-01-17 07:42:09,919 INFO  [coreLoadExecutor-4-thread-1] loader.XMLLoader (XMLLoader.java:init(111)) - xsltCacheLifetimeSeconds=60
   [junit4]   1> 2014-01-17 07:42:09,947 INFO  [coreLoadExecutor-4-thread-1] loader.XMLLoader (XMLLoader.java:init(111)) - xsltCacheLifetimeSeconds=60
   [junit4]   1> 2014-01-17 07:42:09,948 INFO  [coreLoadExecutor-4-thread-1] loader.XMLLoader (XMLLoader.java:init(111)) - xsltCacheLifetimeSeconds=60
   [junit4]   1> 2014-01-17 07:42:10,044 INFO  [coreLoadExecutor-4-thread-1] core.SolrCore (CommitTracker.java:<init>(83)) - Hard AutoCommit: if uncommited for 60000ms; 
   [junit4]   1> 2014-01-17 07:42:10,045 INFO  [coreLoadExecutor-4-thread-1] core.SolrCore (CommitTracker.java:<init>(83)) - Soft AutoCommit: if uncommited for 1000ms; 
   [junit4]   1> 2014-01-17 07:42:10,051 INFO  [coreLoadExecutor-4-thread-1] core.SolrCore (SolrDeletionPolicy.java:onInit(85)) - SolrDeletionPolicy.onInit: commits: num=1
   [junit4]   1> 	commit{dir=MockDirectoryWrapper(org.apache.lucene.store.RAMDirectory@1e8809ce lockFactory=org.apache.lucene.store.NativeFSLockFactory@213a8eb1),segFN=segments_1,generation=1}
   [junit4]   1> 2014-01-17 07:42:10,052 INFO  [coreLoadExecutor-4-thread-1] core.SolrCore (SolrDeletionPolicy.java:updateCommits(165)) - newest commit generation = 1
   [junit4]   1> 2014-01-17 07:42:10,105 INFO  [coreLoadExecutor-4-thread-1] search.SolrIndexSearcher (SolrIndexSearcher.java:<init>(199)) - Opening Searcher@14df33ae main
   [junit4]   1> 2014-01-17 07:42:10,142 INFO  [coreLoadExecutor-4-thread-1] component.SpellCheckComponent (SpellCheckComponent.java:inform(623)) - Initializing spell checkers
   [junit4]   1> 2014-01-17 07:42:10,235 INFO  [coreLoadExecutor-4-thread-1] spelling.DirectSolrSpellChecker (DirectSolrSpellChecker.java:init(102)) - init: {name=default,field=name,classname=solr.DirectSolrSpellChecker,distanceMeasure=internal,accuracy=0.5,maxEdits=2,minPrefix=1,maxInspections=5,minQueryLength=4,maxQueryFrequency=0.01}
   [junit4]   1> 2014-01-17 07:42:10,324 INFO  [coreLoadExecutor-4-thread-1] component.SpellCheckComponent (SpellCheckComponent.java:inform(672)) - No queryConverter defined, using default converter
   [junit4]   1> 2014-01-17 07:42:10,342 INFO  [coreLoadExecutor-4-thread-1] component.QueryElevationComponent (QueryElevationComponent.java:inform(223)) - Loading QueryElevation from: /usr/home/hudson/hudson-slave/workspace/Lucene-Solr-NightlyTests-4.x/solr/contrib/map-reduce/src/test-files/solr/collection1/conf/elevate.xml
   [junit4]   1> 2014-01-17 07:42:10,612 INFO  [coreLoadExecutor-4-thread-1] handler.ReplicationHandler (ReplicationHandler.java:inform(965)) - Commits will be reserved for  10000
   [junit4]   1> 2014-01-17 07:42:10,613 INFO  [searcherExecutor-5-thread-1] core.SolrCore (QuerySenderListener.java:newSearcher(44)) - QuerySenderListener sending requests to Searcher@14df33ae main{StandardDirectoryReader(segments_1:1:nrt)}
   [junit4]   1> 2014-01-17 07:42:10,617 INFO  [coreLoadExecutor-4-thread-1] core.CoreContainer (CoreContainer.java:registerCore(489)) - registering core: collection1
   [junit4]   1> 2014-01-17 07:42:10,668 INFO  [SUITE-SolrCellMorphlineTest-seed#[3335AFF825A799E4]-worker] solr.SolrTestCaseJ4 (SolrTestCaseJ4.java:initCore(473)) - ####initCore end
   [junit4]   2> Creating dataDir: /usr/home/hudson/hudson-slave/workspace/Lucene-Solr-NightlyTests-4.x/solr/build/contrib/solr-morphlines-cell/test/J0/./solrtest-SolrCellMorphlineTest-1389944518467
   [junit4]   1> 2014-01-17 07:42:10,789 INFO  [TEST-SolrCellMorphlineTest.testSolrCellXML-seed#[3335AFF825A799E4]] solr.SolrTestCaseJ4 (SolrTestCaseJ4.java:setUp(222)) - ###Starting testSolrCellXML
   [junit4]   1> 2014-01-17 07:42:11,514 INFO  [searcherExecutor-5-thread-1] core.SolrCore (SolrCore.java:execute(1917)) - [collection1] webapp=null path=null params={event=firstSearcher&q=static+firstSearcher+warming+in+solrconfig.xml&distrib=false} hits=0 status=0 QTime=860 
   [junit4]   1> 2014-01-17 07:42:11,521 INFO  [searcherExecutor-5-thread-1] core.SolrCore (QuerySenderListener.java:newSearcher(91)) - QuerySenderListener done.
   [junit4]   1> 2014-01-17 07:42:11,521 INFO  [searcherExecutor-5-thread-1] component.SpellCheckComponent (SpellCheckComponent.java:newSearcher(713)) - Loading spell index for spellchecker: default
   [junit4]   1> 2014-01-17 07:42:11,522 INFO  [searcherExecutor-5-thread-1] component.SpellCheckComponent (SpellCheckComponent.java:newSearcher(713)) - Loading spell index for spellchecker: wordbreak
   [junit4]   1> 2014-01-17 07:42:11,523 INFO  [searcherExecutor-5-thread-1] core.SolrCore (SolrCore.java:registerSearcher(1865)) - [collection1] Registered new searcher Searcher@14df33ae main{StandardDirectoryReader(segments_1:1:nrt)}
   [junit4]   1> 2014-01-17 07:42:12,208 INFO  [TEST-SolrCellMorphlineTest.testSolrCellXML-seed#[3335AFF825A799E4]] processor.LogUpdateProcessor (LogUpdateProcessorFactory.java:finish(198)) - [collection1] webapp=null path=/update params={} {deleteByQuery=*:* (-1457462477295976448)} 0 1073
   [junit4]   1> 2014-01-17 07:42:12,215 INFO  [TEST-SolrCellMorphlineTest.testSolrCellXML-seed#[3335AFF825A799E4]] update.UpdateHandler (DirectUpdateHandler2.java:commit(521)) - start commit{,optimize=false,openSearcher=true,waitSearcher=true,expungeDeletes=false,softCommit=false,prepareCommit=false}
   [junit4]   1> 2014-01-17 07:42:12,217 INFO  [TEST-SolrCellMorphlineTest.testSolrCellXML-seed#[3335AFF825A799E4]] update.UpdateHandler (DirectUpdateHandler2.java:commit(561)) - No uncommitted changes. Skipping IW.commit.
   [junit4]   1> 2014-01-17 07:42:12,218 INFO  [TEST-SolrCellMorphlineTest.testSolrCellXML-seed#[3335AFF825A799E4]] search.SolrIndexSearcher (SolrIndexSearcher.java:<init>(199)) - Opening Searcher@30fd981a main
   [junit4]   1> 2014-01-17 07:42:12,231 INFO  [TEST-SolrCellMorphlineTest.testSolrCellXML-seed#[3335AFF825A799E4]] update.UpdateHandler (DirectUpdateHandler2.java:commit(612)) - end_commit_flush
   [junit4]   1> 2014-01-17 07:42:12,232 INFO  [searcherExecutor-5-thread-1] core.SolrCore (QuerySenderListener.java:newSearcher(44)) - QuerySenderListener sending requests to Searcher@30fd981a main{StandardDirectoryReader(segments_1:1:nrt)}
   [junit4]   1> 2014-01-17 07:42:12,233 INFO  [searcherExecutor-5-thread-1] core.SolrCore (QuerySenderListener.java:newSearcher(91)) - QuerySenderListener done.
   [junit4]   1> 2014-01-17 07:42:12,234 INFO  [searcherExecutor-5-thread-1] core.SolrCore (SolrCore.java:registerSearcher(1865)) - [collection1] Registered new searcher Searcher@30fd981a main{StandardDirectoryReader(segments_1:1:nrt)}
   [junit4]   1> 2014-01-17 07:42:12,236 INFO  [TEST-SolrCellMorphlineTest.testSolrCellXML-seed#[3335AFF825A799E4]] processor.LogUpdateProcessor (LogUpdateProcessorFactory.java:finish(198)) - [collection1] webapp=null path=/update params={commit=true&softCommit=false&waitSearcher=true} {commit=} 0 21
   [junit4]   1> 2014-01-17 07:42:13,169 INFO  [TEST-SolrCellMorphlineTest.testSolrCellXML-seed#[3335AFF825A799E4]] api.MorphlineContext (MorphlineContext.java:importCommandBuilders(75)) - Importing commands
   [junit4]   1> 2014-01-17 07:42:17,910 INFO  [TEST-SolrCellMorphlineTest.testSolrCellXML-seed#[3335AFF825A799E4]] core.SolrResourceLoader (SolrResourceLoader.java:<init>(116)) - new SolrResourceLoader for directory: '/usr/home/hudson/hudson-slave/workspace/Lucene-Solr-NightlyTests-4.x/solr/contrib/map-reduce/src/test-files/solr/collection1/'
   [junit4]   1> 2014-01-17 07:42:18,006 INFO  [TEST-SolrCellMorphlineTest.testSolrCellXML-seed#[3335AFF825A799E4]] core.SolrConfig (SolrConfig.java:initLibs(529)) - Adding specified lib dirs to ClassLoader
   [junit4]   1> 2014-01-17 07:42:18,007 WARN  [TEST-SolrCellMorphlineTest.testSolrCellXML-seed#[3335AFF825A799E4]] core.SolrResourceLoader (SolrResourceLoader.java:addToClassLoader(170)) - Can't find (or read) directory to add to classloader: ../../../contrib/extraction/lib (resolved as: /usr/home/hudson/hudson-slave/workspace/Lucene-Solr-NightlyTests-4.x/solr/contrib/map-reduce/src/test-files/solr/collection1/../../../contrib/extraction/lib).
   [junit4]   1> 2014-01-17 07:42:18,009 WARN  [TEST-SolrCellMorphlineTest.testSolrCellXML-seed#[3335AFF825A799E4]] core.SolrResourceLoader (SolrResourceLoader.java:addToClassLoader(170)) - Can't find (or read) directory to add to classloader: ../../../dist/ (resolved as: /usr/home/hudson/hudson-slave/workspace/Lucene-Solr-NightlyTests-4.x/solr/contrib/map-reduce/src/test-files/solr/collection1/../../../dist).
   [junit4]   1> 2014-01-17 07:42:18,010 WARN  [TEST-SolrCellMorphlineTest.testSolrCellXML-seed#[3335AFF825A799E4]] core.SolrResourceLoader (SolrResourceLoader.java:addToClassLoader(170)) - Can't find (or read) directory to add to classloader: ../../../contrib/clustering/lib/ (resolved as: /usr/home/hudson/hudson-slave/workspace/Lucene-Solr-NightlyTests-4.x/solr/contrib/map-reduce/src/test-files/solr/collection1/../../../contrib/clustering/lib).
   [junit4]   1> 2014-01-17 07:42:18,011 WARN  [TEST-SolrCellMorphlineTest.testSolrCellXML-seed#[3335AFF825A799E4]] core.SolrResourceLoader (SolrResourceLoader.java:addToClassLoader(170)) - Can't find (or read) directory to add to classloader: ../../../dist/ (resolved as: /usr/home/hudson/hudson-slave/workspace/Lucene-Solr-NightlyTests-4.x/solr/contrib/map-reduce/src/test-files/solr/collection1/../../../dist).
   [junit4]   1> 2014-01-17 07:42:18,012 WARN  [TEST-SolrCellMorphlineTest.testSolrCellXML-seed#[3335AFF825A799E4]] core.SolrResourceLoader (SolrResourceLoader.java:addToClassLoader(170)) - Can't find (or read) directory to add to classloader: ../../../contrib/langid/lib/ (resolved as: /usr/home/hudson/hudson-slave/workspace/Lucene-Solr-NightlyTests-4.x/solr/contrib/map-reduce/src/test-files/solr/collection1/../../../contrib/langid/lib).
   [junit4]   1> 2014-01-17 07:42:18,013 WARN  [TEST-SolrCellMorphlineTest.testSolrCellXML-seed#[3335AFF825A799E4]] core.SolrResourceLoader (SolrResourceLoader.java:addToClassLoader(170)) - Can't find (or read) directory to add to classloader: ../../../dist/ (resolved as: /usr/home/hudson/hudson-slave/workspace/Lucene-Solr-NightlyTests-4.x/solr/contrib/map-reduce/src/test-files/solr/collection1/../../../dist).
   [junit4]   1> 2014-01-17 07:42:18,014 WARN  [TEST-SolrCellMorphlineTest.testSolrCellXML-seed#[3335AFF825A799E4]] core.SolrResourceLoader (SolrResourceLoader.java:addToClassLoader(170)) - Can't find (or read) directory to add to classloader: ../../../contrib/velocity/lib (resolved as: /usr/home/hudson/hudson-slave/workspace/Lucene-Solr-NightlyTests-4.x/solr/contrib/map-reduce/src/test-files/solr/collection1/../../../contrib/velocity/lib).
   [junit4]   1> 2014-01-17 07:42:18,015 WARN  [TEST-SolrCellMorphlineTest.testSolrCellXML-seed#[3335AFF825A799E4]] core.SolrResourceLoader (SolrResourceLoader.java:addToClassLoader(170)) - Can't find (or read) directory to add to classloader: ../../../dist/ (resolved as: /usr/home/hudson/hudson-slave/workspace/Lucene-Solr-NightlyTests-4.x/solr/contrib/map-reduce/src/test-files/solr/collection1/../../../dist).
   [junit4]   1> 2014-01-17 07:42:18,016 WARN  [TEST-SolrCellMorphlineTest.testSolrCellXML-seed#[3335AFF825A799E4]] core.SolrResourceLoader (SolrResourceLoader.java:addToClassLoader(170)) - Can't find (or read) directory to add to classloader: /non/existent/dir/yields/warning (resolved as: /non/existent/dir/yields/warning).
   [junit4]   1> 2014-01-17 07:42:18,067 INFO  [TEST-SolrCellMorphlineTest.testSolrCellXML-seed#[3335AFF825A799E4]] core.SolrConfig (SolrConfig.java:<init>(170)) - Using Lucene MatchVersion: LUCENE_43
   [junit4]   1> 2014-01-17 07:42:18,168 INFO  [TEST-SolrCellMorphlineTest.testSolrCellXML-seed#[3335AFF825A799E4]] core.Config (SolrConfig.java:<init>(288)) - Loaded SolrConfig: solrconfig.xml
   [junit4]   1> 2014-01-17 07:42:18,170 INFO  [TEST-SolrCellMorphlineTest.testSolrCellXML-seed#[3335AFF825A799E4]] schema.IndexSchema (IndexSchema.java:readSchema(424)) - Reading Solr Schema from schema.xml
   [junit4]   1> 2014-01-17 07:42:18,212 INFO  [TEST-SolrCellMorphlineTest.testSolrCellXML-seed#[3335AFF825A799E4]] schema.IndexSchema (IndexSchema.java:readSchema(452)) - [null] Schema name=example
   [junit4]   1> 2014-01-17 07:42:18,902 INFO  [TEST-SolrCellMorphlineTest.testSolrCellXML-seed#[3335AFF825A799E4]] schema.IndexSchema (IndexSchema.java:readSchema(550)) - unique key field: id
   [junit4]   1> 2014-01-17 07:42:18,930 INFO  [TEST-SolrCellMorphlineTest.testSolrCellXML-seed#[3335AFF825A799E4]] schema.FileExchangeRateProvider (CurrencyField.java:reload(787)) - Reloading exchange rates from file currency.xml
   [junit4]   1> 2014-01-17 07:42:18,938 INFO  [TEST-SolrCellMorphlineTest.testSolrCellXML-seed#[3335AFF825A799E4]] schema.FileExchangeRateProvider (CurrencyField.java:reload(787)) - Reloading exchange rates from file currency.xml
   [junit4]   1> 2014-01-17 07:42:19,126 INFO  [TEST-SolrCellMorphlineTest.testSolrCellXML-seed#[3335AFF825A799E4]] core.SolrResourceLoader (SolrResourceLoader.java:<init>(116)) - new SolrResourceLoader for directory: '/usr/home/hudson/hudson-slave/workspace/Lucene-Solr-NightlyTests-4.x/solr/contrib/map-reduce/src/test-files/solr/collection1/'
   [junit4]   1> 2014-01-17 07:42:19,231 INFO  [TEST-SolrCellMorphlineTest.testSolrCellXML-seed#[3335AFF825A799E4]] core.SolrConfig (SolrConfig.java:initLibs(529)) - Adding specified lib dirs to ClassLoader
   [junit4]   1> 2014-01-17 07:42:19,233 WARN  [TEST-SolrCellMorphlineTest.testSolrCellXML-seed#[3335AFF825A799E4]] core.SolrResourceLoader (SolrResourceLoader.java:addToClassLoader(170)) - Can't find (or read) directory to add to classloader: ../../../contrib/extraction/lib (resolved as: /usr/home/hudson/hudson-slave/workspace/Lucene-Solr-NightlyTests-4.x/solr/contrib/map-reduce/src/test-files/solr/collection1/../../../contrib/extraction/lib).
   [junit4]   1> 2014-01-17 07:42:19,234 WARN  [TEST-SolrCellMorphlineTest.testSolrCellXML-seed#[3335AFF825A799E4]] core.SolrResourceLoader (SolrResourceLoader.java:addToClassLoader(170)) - Can't find (or read) directory to add to classloader: ../../../dist/ (resolved as: /usr/home/hudson/hudson-slave/workspace/Lucene-Solr-NightlyTests-4.x/solr/contrib/map-reduce/src/test-files/solr/collection1/../../../dist).
   [junit4]   1> 2014-01-17 07:42:19,235 WARN  [TEST-SolrCellMorphlineTest.testSolrCellXML-seed#[3335AFF825A799E4]] core.SolrResourceLoader (SolrResourceLoader.java:addToClassLoader(170)) - Can't find (or read) directory to add to classloader: ../../../contrib/clustering/lib/ (resolved as: /usr/home/hudson/hudson-slave/workspace/Lucene-Solr-NightlyTests-4.x/solr/contrib/map-reduce/src/test-files/solr/collection1/../../../contrib/clustering/lib).
   [junit4]   1> 2014-01-17 07:42:19,236 WARN  [TEST-SolrCellMorphlineTest.testSolrCellXML-seed#[3335AFF825A799E4]] core.SolrResourceLoader (SolrResourceLoader.java:addToClassLoader(170)) - Can't find (or read) directory to add to classloader: ../../../dist/ (resolved as: /usr/home/hudson/hudson-slave/workspace/Lucene-Solr-NightlyTests-4.x/solr/contrib/map-reduce/src/test-files/solr/collection1/../../../dist).
   [junit4]   1> 2014-01-17 07:42:19,237 WARN  [TEST-SolrCellMorphlineTest.testSolrCellXML-seed#[3335AFF825A799E4]] core.SolrResourceLoader (SolrResourceLoader.java:addToClassLoader(170)) - Can't find (or read) directory to add to classloader: ../../../contrib/langid/lib/ (resolved as: /usr/home/hudson/hudson-slave/workspace/Lucene-Solr-NightlyTests-4.x/solr/contrib/map-reduce/src/test-files/solr/collection1/../../../contrib/langid/lib).
   [junit4]   1> 2014-01-17 07:42:19,238 WARN  [TEST-SolrCellMorphlineTest.testSolrCellXML-seed#[3335AFF825A799E4]] core.SolrResourceLoader (SolrResourceLoader.java:addToClassLoader(170)) - Can't find (or read) directory to add to classloader: ../../../dist/ (resolved as: /usr/home/hudson/hudson-slave/workspace/Lucene-Solr-NightlyTests-4.x/solr/contrib/map-reduce/src/test-files/solr/collection1/../../../dist).
   [junit4]   1> 2014-01-17 07:42:19,240 WARN  [TEST-SolrCellMorphlineTest.testSolrCellXML-seed#[3335AFF825A799E4]] core.SolrResourceLoader (SolrResourceLoader.java:addToClassLoader(170)) - Can't find (or read) directory to add to classloader: ../../../contrib/velocity/lib (resolved as: /usr/home/hudson/hudson-slave/workspace/Lucene-Solr-NightlyTests-4.x/solr/contrib/map-reduce/src/test-files/solr/collection1/../../../contrib/velocity/lib).
   [junit4]   1> 2014-01-17 07:42:19,240 WARN  [TEST-SolrCellMorphlineTest.testSolrCellXML-seed#[3335AFF825A799E4]] core.SolrResourceLoader (SolrResourceLoader.java:addToClassLoader(170)) - Can't find (or read) directory to add to classloader: ../../../dist/ (resolved as: /usr/home/hudson/hudson-slave/workspace/Lucene-Solr-NightlyTests-4.x/solr/contrib/map-reduce/src/test-files/solr/collection1/../../../dist).
   [junit4]   1> 2014-01-17 07:42:19,241 WARN  [TEST-SolrCellMorphlineTest.testSolrCellXML-seed#[3335AFF825A799E4]] core.SolrResourceLoader (SolrResourceLoader.java:addToClassLoader(170)) - Can't find (or read) directory to add to classloader: /non/existent/dir/yields/warning (resolved as: /non/existent/dir/yields/warning).
   [junit4]   1> 2014-01-17 07:42:19,299 INFO  [TEST-SolrCellMorphlineTest.testSolrCellXML-seed#[3335AFF825A799E4]] core.SolrConfig (SolrConfig.java:<init>(170)) - Using Lucene MatchVersion: LUCENE_43
   [junit4]   1> 2014-01-17 07:42:19,409 INFO  [TEST-SolrCellMorphlineTest.testSolrCellXML-seed#[3335AFF825A799E4]] core.Config (SolrConfig.java:<init>(288)) - Loaded SolrConfig: solrconfig.xml
   [junit4]   1> 2014-01-17 07:42:19,411 INFO  [TEST-SolrCellMorphlineTest.testSolrCellXML-seed#[3335AFF825A799E4]] schema.IndexSchema (IndexSchema.java:readSchema(424)) - Reading Solr Schema from schema.xml
   [junit4]   1> 2014-01-17 07:42:19,454 INFO  [TEST-SolrCellMorphlineTest.testSolrCellXML-seed#[3335AFF825A799E4]] schema.IndexSchema (IndexSchema.java:readSchema(452)) - [null] Schema name=example
   [junit4]   1> 2014-01-17 07:42:20,119 INFO  [TEST-SolrCellMorphlineTest.testSolrCellXML-seed#[3335AFF825A799E4]] schema.IndexSchema (IndexSchema.java:readSchema(550)) - unique key field: id
   [junit4]   1> 2014-01-17 07:42:20,146 INFO  [TEST-SolrCellMorphlineTest.testSolrCellXML-seed#[3335AFF825A799E4]] schema.FileExchangeRateProvider (CurrencyField.java:reload(787)) - Reloading exchange rates from file currency.xml
   [junit4]   1> 2014-01-17 07:42:20,153 INFO  [TEST-SolrCellMorphlineTest.testSolrCellXML-seed#[3335AFF825A799E4]] schema.FileExchangeRateProvider (CurrencyField.java:reload(787)) - Reloading exchange rates from file currency.xml
   [junit4]   1> 2014-01-17 07:42:20,193 INFO  [TEST-SolrCellMorphlineTest.testSolrCellXML-seed#[3335AFF825A799E4]] core.SolrResourceLoader (SolrResourceLoader.java:<init>(116)) - new SolrResourceLoader for directory: '/usr/home/hudson/hudson-slave/workspace/Lucene-Solr-NightlyTests-4.x/solr/contrib/map-reduce/src/test-files/solr/collection1/'
   [junit4]   1> 2014-01-17 07:42:20,276 INFO  [TEST-SolrCellMorphlineTest.testSolrCellXML-seed#[3335AFF825A799E4]] core.SolrConfig (SolrConfig.java:initLibs(529)) - Adding specified lib dirs to ClassLoader
   [junit4]   1> 2014-01-17 07:42:20,277 WARN  [TEST-SolrCellMorphlineTest.testSolrCellXML-seed#[3335AFF825A799E4]] core.SolrResourceLoader (SolrResourceLoader.java:addToClassLoader(170)) - Can't find (or read) directory to add to classloader: ../../../contrib/extraction/lib (resolved as: /usr/home/hudson/hudson-slave/workspace/Lucene-Solr-NightlyTests-4.x/solr/contrib/map-reduce/src/test-files/solr/collection1/../../../contrib/extraction/lib).
   [junit4]   1> 2014-01-17 07:42:20,278 WARN  [TEST-SolrCellMorphlineTest.testSolrCellXML-seed#[3335AFF825A799E4]] core.SolrResourceLoader (SolrResourceLoader.java:addToClassLoader(170)) - Can't find (or read) directory to add to classloader: ../../../dist/ (resolved as: /usr/home/hudson/hudson-slave/workspace/Lucene-Solr-NightlyTests-4.x/solr/contrib/map-reduce/src/test-files/solr/collection1/../../../dist).
   [junit4]   1> 2014-01-17 07:42:20,279 WARN  [TEST-SolrCellMorphlineTest.testSolrCellXML-seed#[3335AFF825A799E4]] core.SolrResourceLoader (SolrResourceLoader.java:addToClassLoader(170)) - Can't find (or read) directory to add to classloader: ../../../contrib/clustering/lib/ (resolved as: /usr/home/hudson/hudson-slave/workspace/Lucene-Solr-NightlyTests-4.x/solr/contrib/map-reduce/src/test-files/solr/collection1/../../../contrib/clustering/lib).
   [junit4]   1> 2014-01-17 07:42:20,280 WARN  [TEST-SolrCellMorphlineTest.testSolrCellXML-seed#[3335AFF825A799E4]] core.SolrResourceLoader (SolrResourceLoader.java:addToClassLoader(170)) - Can't find (or read) directory to add to classloader: ../../../dist/ (resolved as: /usr/home/hudson/hudson-slave/workspace/Lucene-Solr-NightlyTests-4.x/solr/contrib/map-reduce/src/test-files/solr/collection1/../../../dist).
   [junit4]   1> 2014-01-17 07:42:20,281 WARN  [TEST-SolrCellMorphlineTest.testSolrCellXML-seed#[3335AFF825A799E4]] core.SolrResourceLoader (SolrResourceLoader.java:addToClassLoader(170)) - Can't find (or read) directory to add to classloader: ../../../contrib/langid/lib/ (resolved as: /usr/home/hudson/hudson-slave/workspace/Lucene-Solr-NightlyTests-4.x/solr/contrib/map-reduce/src/test-files/solr/collection1/../../../contrib/langid/lib).
   [junit4]   1> 2014-01-17 07:42:20,281 WARN  [TEST-SolrCellMorphlineTest.testSolrCellXML-seed#[3335AFF825A799E4]] core.SolrResourceLoader (SolrResourceLoader.java:addToClassLoader(170)) - Can't find (or read) directory to add to classloader: ../../../dist/ (resolved as: /usr/home/hudson/hudson-slave/workspace/Lucene-Solr-NightlyTests-4.x/solr/contrib/map-reduce/src/test-files/solr/collection1/../../../dist).
   [junit4]   1> 2014-01-17 07:42:20,283 WARN  [TEST-SolrCellMorphlineTest.testSolrCellXML-seed#[3335AFF825A799E4]] core.SolrResourceLoader (SolrResourceLoader.java:addToClassLoader(170)) - Can't find (or read) directory to add to classloader: ../../../contrib/velocity/lib (resolved as: /usr/home/hudson/hudson-slave/workspace/Lucene-Solr-NightlyTests-4.x/solr/contrib/map-reduce/src/test-files/solr/collection1/../../../contrib/velocity/lib).
   [junit4]   1> 2014-01-17 07:42:20,283 WARN  [TEST-SolrCellMorphlineTest.testSolrCellXML-seed#[3335AFF825A799E4]] core.SolrResourceLoader (SolrResourceLoader.java:addToClassLoader(170)) - Can't find (or read) directory to add to classloader: ../../../dist/ (resolved as: /usr/home/hudson/hudson-slave/workspace/Lucene-Solr-NightlyTests-4.x/solr/contrib/map-reduce/src/test-files/solr/collection1/../../../dist).
   [junit4]   1> 2014-01-17 07:42:20,284 WARN  [TEST-SolrCellMorphlineTest.testSolrCellXML-seed#[3335AFF825A799E4]] core.SolrResourceLoader (SolrResourceLoader.java:addToClassLoader(170)) - Can't find (or read) directory to add to classloader: /non/existent/dir/yields/warning (resolved as: /non/existent/dir/yields/warning).
   [junit4]   1> 2014-01-17 07:42:20,332 INFO  [TEST-SolrCellMorphlineTest.testSolrCellXML-seed#[3335AFF825A799E4]] core.SolrConfig (SolrConfig.java:<init>(170)) - Using Lucene MatchVersion: LUCENE_43
   [junit4]   1> 2014-01-17 07:42:20,424 INFO  [TEST-SolrCellMorphlineTest.testSolrCellXML-seed#[3335AFF825A799E4]] core.Config (SolrConfig.java:<init>(288)) - Loaded SolrConfig: solrconfig.xml
   [junit4]   1> 2014-01-17 07:42:20,425 INFO  [TEST-SolrCellMorphlineTest.testSolrCellXML-seed#[3335AFF825A799E4]] schema.IndexSchema (IndexSchema.java:readSchema(424)) - Reading Solr Schema from schema.xml
   [junit4]   1> 2014-01-17 07:42:20,469 INFO  [TEST-SolrCellMorphlineTest.testSolrCellXML-seed#[3335AFF825A799E4]] schema.IndexSchema (IndexSchema.java:readSchema(452)) - [null] Schema name=example
   [junit4]   1> 2014-01-17 07:42:21,315 INFO  [TEST-SolrCellMorphlineTest.testSolrCellXML-seed#[3335AFF825A799E4]] schema.IndexSchema (IndexSchema.java:readSchema(550)) - unique key field: id
   [junit4]   1> 2014-01-17 07:42:21,339 INFO  [TEST-SolrCellMorphlineTest.testSolrCellXML-seed#[3335AFF825A799E4]] schema.FileExchangeRateProvider (CurrencyField.java:reload(787)) - Reloading exchange rates from file currency.xml
   [junit4]   1> 2014-01-17 07:42:21,347 INFO  [TEST-SolrCellMorphlineTest.testSolrCellXML-seed#[3335AFF825A799E4]] schema.FileExchangeRateProvider (CurrencyField.java:reload(787)) - Reloading exchange rates from file currency.xml
   [junit4]   1> 2014-01-17 07:42:21,420 INFO  [TEST-SolrCellMorphlineTest.testSolrCellXML-seed#[3335AFF825A799E4]] processor.LogUpdateProcessor (LogUpdateProcessorFactory.java:finish(198)) - [collection1] webapp=null path=/update params={} {deleteByQuery=*:* (-1457462487461920768)} 0 2
   [junit4]   1> 2014-01-17 07:42:21,421 INFO  [TEST-SolrCellMorphlineTest.testSolrCellXML-seed#[3335AFF825A799E4]] update.UpdateHandler (DirectUpdateHandler2.java:commit(521)) - start commit{,optimize=false,openSearcher=true,waitSearcher=true,expungeDeletes=false,softCommit=false,prepareCommit=false}
   [junit4]   1> 2014-01-17 07:42:21,421 INFO  [TEST-SolrCellMorphlineTest.testSolrCellXML-seed#[3335AFF825A799E4]] update.UpdateHandler (DirectUpdateHandler2.java:commit(561)) - No uncommitted changes. Skipping IW.commit.
   [junit4]   1> 2014-01-17 07:42:21,422 INFO  [TEST-SolrCellMorphlineTest.testSolrCellXML-seed#[3335AFF825A799E4]] search.SolrIndexSearcher (SolrIndexSearcher.java:<init>(199)) - Opening Searcher@239b0124 main
   [junit4]   1> 2014-01-17 07:42:21,423 INFO  [TEST-SolrCellMorphlineTest.testSolrCellXML-seed#[3335AFF825A799E4]] update.UpdateHandler (DirectUpdateHandler2.java:commit(612)) - end_commit_flush
   [junit4]   1> 2014-01-17 07:42:21,423 INFO  [searcherExecutor-5-thread-1] core.SolrCore (QuerySenderListener.java:newSearcher(44)) - QuerySenderListener sending requests to Searcher@239b0124 main{StandardDirectoryReader(segments_1:1:nrt)}
   [junit4]   1> 2014-01-17 07:42:21,424 INFO  [searcherExecutor-5-thread-1] core.SolrCore (QuerySenderListener.java:newSearcher(91)) - QuerySenderListener done.
   [junit4]   1> 2014-01-17 07:42:21,424 INFO  [searcherExecutor-5-thread-1] core.SolrCore (SolrCore.java:registerSearcher(1865)) - [collection1] Registered new searcher Searcher@239b0124 main{StandardDirectoryReader(segments_1:1:nrt)}
   [junit4]   1> 2014-01-17 07:42:21,425 INFO  [TEST-SolrCellMorphlineTest.testSolrCellXML-seed#[3335AFF825A799E4]] processor.LogUpdateProcessor (LogUpdateProcessorFactory.java:finish(198)) - [collection1] webapp=null path=/update params={commit=true&softCommit=false&waitSearcher=true} {commit=} 0 4
   [junit4]   1> 2014-01-17 07:42:21,945 INFO  [TEST-SolrCellMorphlineTest.testSolrCellXML-seed#[3335AFF825A799E4]] processor.LogUpdateProcessor (LogUpdateProcessorFactory.java:finish(198)) - [collection1] webapp=null path=/update params={} {add=[testXML2.xml#0 (1457462487795367936)]} 0 210
   [junit4]   1> 2014-01-17 07:42:21,956 INFO  [TEST-SolrCellMorphlineTest.testSolrCellXML-seed#[3335AFF825A799E4]] update.UpdateHandler (DirectUpdateHandler2.java:commit(521)) - start commit{,optimize=false,openSearcher=true,waitSearcher=true,expungeDeletes=false,softCommit=true,prepareCommit=false}
   [junit4]   1> 2014-01-17 07:42:22,185 INFO  [TEST-SolrCellMorphlineTest.testSolrCellXML-seed#[3335AFF825A799E4]] search.SolrIndexSearcher (SolrIndexSearcher.java:<init>(199)) - Opening Searcher@6b9c18ae main
   [junit4]   1> 2014-01-17 07:42:22,186 INFO  [TEST-SolrCellMorphlineTest.testSolrCellXML-seed#[3335AFF825A799E4]] update.UpdateHandler (DirectUpdateHandler2.java:commit(612)) - end_commit_flush
   [junit4]   1> 2014-01-17 07:42:22,186 INFO  [searcherExecutor-5-thread-1] core.SolrCore (QuerySenderListener.java:newSearcher(44)) - QuerySenderListener sending requests to Searcher@6b9c18ae main{StandardDirectoryReader(segments_1:3:nrt _0(4.7):C1)}
   [junit4]   1> 2014-01-17 07:42:22,187 INFO  [searcherExecutor-5-thread-1] core.SolrCore (QuerySenderListener.java:newSearcher(91)) - QuerySenderListener done.
   [junit4]   1> 2014-01-17 07:42:22,188 INFO  [searcherExecutor-5-thread-1] core.SolrCore (SolrCore.java:registerSearcher(1865)) - [collection1] Registered new searcher Searcher@6b9c18ae main{StandardDirectoryReader(segments_1:3:nrt _0(4.7):C1)}
   [junit4]   1> 2014-01-17 07:42:22,189 INFO  [TEST-SolrCellMorphlineTest.testSolrCellXML-seed#[3335AFF825A799E4]] processor.LogUpdateProcessor (LogUpdateProcessorFactory.java:finish(198)) - [collection1] webapp=null path=/update params={commit=true&softCommit=true&waitSearcher=true} {commit=} 0 233
   [junit4]   1> 2014-01-17 07:42:22,234 INFO  [TEST-SolrCellMorphlineTest.testSolrCellXML-seed#[3335AFF825A799E4]] core.SolrCore (SolrCore.java:execute(1917)) - [collection1] webapp=null path=/select params={q=*%3A*&rows=2147483647} hits=1 status=0 QTime=36 
   [junit4]   1> 2014-01-17 07:42:22,252 INFO  [TEST-SolrCellMorphlineTest.testSolrCellXML-seed#[3335AFF825A799E4]] update.UpdateHandler (DirectUpdateHandler2.java:commit(521)) - start commit{,optimize=false,openSearcher=true,waitSearcher=true,expungeDeletes=false,softCommit=true,prepareCommit=false}
   [junit4]   1> 2014-01-17 07:42:22,253 INFO  [TEST-SolrCellMorphlineTest.testSolrCellXML-seed#[3335AFF825A799E4]] search.SolrIndexSearcher (SolrIndexSearcher.java:<init>(199)) - Opening Searcher@586dd8f1 main
   [junit4]   1> 2014-01-17 07:42:22,254 INFO  [TEST-SolrCellMorphlineTest.testSolrCellXML-seed#[3335AFF825A799E4]] update.UpdateHandler (DirectUpdateHandler2.java:commit(612)) - end_commit_flush
   [junit4]   1> 2014-01-17 07:42:22,254 INFO  [searcherExecutor-5-thread-1] core.SolrCore (QuerySenderListener.java:newSearcher(44)) - QuerySenderListener sending requests to Searcher@586dd8f1 main{StandardDirectoryReader(segments_1:3:nrt _0(4.7):C1)}
   [junit4]   1> 2014-01-17 07:42:22,255 INFO  [searcherExecutor-5-thread-1] core.SolrCore (QuerySenderListener.java:newSearcher(91)) - QuerySenderListener done.
   [junit4]   1> 2014-01-17 07:42:22,255 INFO  [searcherExecutor-5-thread-1] core.SolrCore (SolrCore.java:registerSearcher(1865)) - [collection1] Registered new searcher Searcher@586dd8f1 main{StandardDirectoryReader(segments_1:3:nrt _0(4.7):C1)}
   [junit4]   1> 2014-01-17 07:42:22,256 INFO  [TEST-SolrCellMorphlineTest.testSolrCellXML-seed#[3335AFF825A799E4]] processor.LogUpdateProcessor (LogUpdateProcessorFactory.java:finish(198)) - [collection1] webapp=null path=/update params={commit=true&softCommit=true&waitSearcher=true} {commit=} 0 4
   [junit4]   1> 2014-01-17 07:42:22,257 INFO  [TEST-SolrCellMorphlineTest.testSolrCellXML-seed#[3335AFF825A799E4]] core.SolrCore (SolrCore.java:execute(1917)) - [collection1] webapp=null path=/select params={q=*%3A*&rows=2147483647} hits=1 status=0 QTime=0 
   [junit4]   1> 2014-01-17 07:42:22,258 INFO  [TEST-SolrCellMorphlineTest.testSolrCellXML-seed#[3335AFF825A799E4]] solr.SolrTestCaseJ4 (SolrTestCaseJ4.java:tearDown(227)) - ###Ending testSolrCellXML
   [junit4]   1> 2014-01-17 07:42:22,285 INFO  [TEST-SolrCellMorphlineTest.testTransformValue-seed#[3335AFF825A799E4]] solr.SolrTestCaseJ4 (SolrTestCaseJ4.java:setUp(222)) - ###Starting testTransformValue
   [junit4]   1> 2014-01-17 07:42:22,471 INFO  [TEST-SolrCellMorphlineTest.testTransformValue-seed#[3335AFF825A799E4]] search.SolrIndexSearcher (SolrIndexSearcher.java:<init>(199)) - Opening Searcher@69ddad02 realtime
   [junit4]   1> 2014-01-17 07:42:22,471 INFO  [TEST-SolrCellMorphlineTest.testTransformValue-seed#[3335AFF825A799E4]] processor.LogUpdateProcessor (LogUpdateProcessorFactory.java:finish(198)) - [collection1] webapp=null path=/update params={} {deleteByQuery=*:* (-1457462488372084736)} 0 186
   [junit4]   1> 2014-01-17 07:42:22,472 INFO  [TEST-SolrCellMorphlineTest.testTransformValue-seed#[3335AFF825A799E4]] update.UpdateHandler (DirectUpdateHandler2.java:commit(521)) - start commit{,optimize=false,openSearcher=true,waitSearcher=true,expungeDeletes=false,softCommit=false,prepareCommit=false}
   [junit4]   1> 2014-01-17 07:42:22,474 INFO  [TEST-SolrCellMorphlineTest.testTransformValue-seed#[3335AFF825A799E4]] core.SolrCore (SolrDeletionPolicy.java:onCommit(98)) - SolrDeletionPolicy.onCommit: commits: num=2
   [junit4]   1> 	commit{dir=MockDirectoryWrapper(org.apache.lucene.store.RAMDirectory@1e8809ce lockFactory=org.apache.lucene.store.NativeFSLockFactory@213a8eb1),segFN=segments_1,generation=1}
   [junit4]   1> 	commit{dir=MockDirectoryWrapper(org.apache.lucene.store.RAMDirectory@1e8809ce lockFactory=org.apache.lucene.store.NativeFSLockFactory@213a8eb1),segFN=segments_2,generation=2}
   [junit4]   1> 2014-01-17 07:42:22,474 INFO  [TEST-SolrCellMorphlineTest.testTransformValue-seed#[3335AFF825A799E4]] core.SolrCore (SolrDeletionPolicy.java:updateCommits(165)) - newest commit generation = 2
   [junit4]   1> 2014-01-17 07:42:22,475 INFO  [TEST-SolrCellMorphlineTest.testTransformValue-seed#[3335AFF825A799E4]] search.SolrIndexSearcher (SolrIndexSearcher.java:<init>(199)) - Opening Searcher@57bd06bf main
   [junit4]   1> 2014-01-17 07:42:22,476 INFO  [TEST-SolrCellMorphlineTest.testTransformValue-seed#[3335AFF825A799E4]] update.UpdateHandler (DirectUpdateHandler2.java:commit(612)) - end_commit_flush
   [junit4]   1> 2014-01-17 07:42:22,476 INFO  [searcherExecutor-5-thread-1] core.SolrCore (QuerySenderListener.java:newSearcher(44)) - QuerySenderListener sending requests to Searcher@57bd06bf main{StandardDirectoryReader(segments_1:5:nrt)}
   [junit4]   1> 2014-01-17 07:42:22,477 INFO  [searcherExecutor-5-thread-1] core.SolrCore (QuerySenderListener.java:newSearcher(91)) - QuerySenderListener done.
   [junit4]   1> 2014-01-17 07:42:22,478 INFO  [searcherExecutor-5-thread-1] core.SolrCore (SolrCore.java:registerSearcher(1865)) - [collection1] Registered new searcher Searcher@57bd06bf main{StandardDirectoryReader(segments_1:5:nrt)}
   [junit4]   1> 2014-01-17 07:42:22,480 INFO  [TEST-SolrCellMorphlineTest.testTransformValue-seed#[3335AFF825A799E4]] processor.LogUpdateProcessor (LogUpdateProcessorFactory.java:finish(198)) - [collection1] webapp=null path=/update params={commit=true&softCommit=false&waitSearcher=true} {commit=} 0 8
   [junit4]   1> 2014-01-17 07:42:22,489 INFO  [TEST-SolrCellMorphlineTest.testTransformValue-seed#[3335AFF825A799E4]] solr.SolrTestCaseJ4 (SolrTestCaseJ4.java:tearDown(227)) - ###Ending testTransformValue
   [junit4]   1> 2014-01-17 07:42:22,499 INFO  [TEST-SolrCellMorphlineTest.testSolrCellDocumentTypes-seed#[3335AFF825A799E4]] solr.SolrTestCaseJ4 (SolrTestCaseJ4.java:setUp(222)) - ###Starting testSolrCellDocumentTypes
   [junit4]   1> 2014-01-17 07:42:22,501 INFO  [TEST-SolrCellMorphlineTest.testSolrCellDocumentTypes-seed#[3335AFF825A799E4]] processor.LogUpdateProcessor (LogUpdateProcessorFactory.java:finish(198)) - [collection1] webapp=null path=/update params={} {deleteByQuery=*:* (-1457462488596480000)} 0 1
   [junit4]   1> 2014-01-17 07:42:22,502 INFO  [TEST-SolrCellMorphlineTest.testSolrCellDocumentTypes-seed#[3335AFF825A799E4]] update.UpdateHandler (DirectUpdateHandler2.java:commit(521)) - start commit{,optimize=false,openSearcher=true,waitSearcher=true,expungeDeletes=false,softCommit=false,prepareCommit=false}
   [junit4]   1> 2014-01-17 07:42:22,502 INFO  [TEST-SolrCellMorphlineTest.testSolrCellDocumentTypes-seed#[3335AFF825A799E4]] update.UpdateHandler (DirectUpdateHandler2.java:commit(561)) - No uncommitted changes. Skipping IW.commit.
   [junit4]   1> 2014-01-17 07:42:22,503 INFO  [TEST-SolrCellMorphlineTest.testSolrCellDocumentTypes-seed#[3335AFF825A799E4]] search.SolrIndexSearcher (SolrIndexSearcher.java:<init>(199)) - Opening Searcher@5a74b10b main
   [junit4]   1> 2014-01-17 07:42:22,504 INFO  [TEST-SolrCellMorphlineTest.testSolrCellDocumentTypes-seed#[3335AFF825A799E4]] update.UpdateHandler (DirectUpdateHandler2.java:commit(612)) - end_commit_flush
   [junit4]   1> 2014-01-17 07:42:22,504 INFO  [searcherExecutor-5-thread-1] core.SolrCore (QuerySenderListener.java:newSearcher(44)) - QuerySenderListener sending requests to Searcher@5a74b10b main{StandardDirectoryReader(segments_1:5:nrt)}
   [junit4]   1> 2014-01-17 07:42:22,505 INFO  [searcherExecutor-5-thread-1] core.SolrCore (QuerySenderListener.java:newSearcher(91)) - QuerySenderListener done.
   [junit4]   1> 2014-01-17 07:42:22,506 INFO  [searcherExecutor-5-thread-1] core.SolrCore (SolrCore.java:registerSearcher(1865)) - [collection1] Registered new searcher Searcher@5a74b10b main{StandardDirectoryReader(segments_1:5:nrt)}
   [junit4]   1> 2014-01-17 07:42:22,506 INFO  [TEST-SolrCellMorphlineTest.testSolrCellDocumentTypes-seed#[3335AFF825A799E4]] processor.LogUpdateProcessor (LogUpdateProcessorFactory.java:finish(198)) - [collection1] webapp=null path=/update params={commit=true&softCommit=false&waitSearcher=true} {commit=} 0 4
   [junit4]   1> 2014-01-17 07:42:22,534 INFO  [TEST-SolrCellMorphlineTest.testSolrCellDocumentTypes-seed#[3335AFF825A799E4]] api.MorphlineContext (MorphlineContext.java:importCommandBuilders(75)) - Importing commands
   [junit4]   1> 2014-01-17 07:42:29,431 INFO  [TEST-SolrCellMorphlineTest.testSolrCellDocumentTypes-seed#[3335AFF825A799E4]] core.SolrResourceLoader (SolrResourceLoader.java:<init>(116)) - new SolrResourceLoader for directory: '/usr/home/hudson/hudson-slave/workspace/Lucene-Solr-NightlyTests-4.x/solr/contrib/map-reduce/src/test-files/solr/collection1/'
   [junit4]   1> 2014-01-17 07:42:29,516 INFO  [TEST-SolrCellMorphlineTest.testSolrCellDocumentTypes-seed#[3335AFF825A799E4]] core.SolrConfig (SolrConfig.java:initLibs(529)) - Adding specified lib dirs to ClassLoader
   [junit4]   1> 2014-01-17 07:42:29,517 WARN  [TEST-SolrCellMorphlineTest.testSolrCellDocumentTypes-seed#[3335AFF825A799E4]] core.SolrResourceLoader (SolrResourceLoader.java:addToClassLoader(170)) - Can't find (or read) directory to add to classloader: ../../../contrib/extraction/lib (resolved as: /usr/home/hudson/hudson-slave/workspace/Lucene-Solr-NightlyTests-4.x/solr/contrib/map-reduce/src/test-files/solr/collection1/../../../contrib/extraction/lib).
   [junit4]   1> 2014-01-17 07:42:29,518 WARN  [TEST-SolrCellMorphlineTest.testSolrCellDocumentTypes-seed#[3335AFF825A799E4]] core.SolrResourceLoader (SolrResourceLoader.java:addToClassLoader(170)) - Can't find (or read) directory to add to classloader: ../../../dist/ (resolved as: /usr/home/hudson/hudson-slave/workspace/Lucene-Solr-NightlyTests-4.x/solr/contrib/map-reduce/src/test-files/solr/collection1/../../../dist).
   [junit4]   1> 2014-01-17 07:42:29,520 WARN  [TEST-SolrCellMorphlineTest.testSolrCellDocumentTypes-seed#[3335AFF825A799E4]] core.SolrResourceLoader (SolrResourceLoader.java:addToClassLoader(170)) - Can't find (or read) directory to add to classloader: ../../../contrib/clustering/lib/ (resolved as: /usr/home/hudson/hudson-slave/workspace/Lucene-Solr-NightlyTests-4.x/solr/contrib/map-reduce/src/test-files/solr/collection1/../../../contrib/clustering/lib).
   [junit4]   1> 2014-01-17 07:42:29,521 WARN  [TEST-SolrCellMorphlineTest.testSolrCellDocumentTypes-seed#[3335AFF825A799E4]] core.SolrResourceLoader (SolrResourceLoader.java:addToClassLoader(170)) - Can't find (or read) directory to add to classloader: ../../../dist/ (resolved as: /usr/home/hudson/hudson-slave/workspace/Lucene-Solr-NightlyTests-4.x/solr/contrib/map-reduce/src/test-files/solr/collection1/../../../dist).
   [junit4]   1> 2014-01-17 07:42:29,523 WARN  [TEST-SolrCellMorphlineTest.testSolrCellDocumentTypes-seed#[3335AFF825A799E4]] core.SolrResourceLoader (SolrResourceLoader.java:addToClassLoader(170)) - Can't find (or read) directory to add to classloader: ../../../contrib/langid/lib/ (resolved as: /usr/home/hudson/hudson-slave/workspace/Lucene-Solr-NightlyTests-4.x/solr/contrib/map-reduce/src/test-files/solr/collection1/../../../contrib/langid/lib).
   [junit4]   1> 2014-01-17 07:42:29,524 WARN  [TEST-SolrCellMorphlineTest.testSolrCellDocumentTypes-seed#[3335AFF825A799E4]] core.SolrResourceLoader (SolrResourceLoader.java:addToClassLoader(170)) - Can't find (or read) directory to add to classloader: ../../../dist/ (resolved as: /usr/home/hudson/hudson-slave/workspace/Lucene-Solr-NightlyTests-4.x/solr/contrib/map-reduce/src/test-files/solr/collection1/../../../dist).
   [junit4]   1> 2014-01-17 07:42:29,525 WARN  [TEST-SolrCellMorphlineTest.testSolrCellDocumentTypes-seed#[3335AFF825A799E4]] core.SolrResourceLoader (SolrResourceLoader.java:addToClassLoader(170)) - Can't find (or read) directory to add to classloader: ../../../contrib/velocity/lib (resolved as: /usr/home/hudson/hudson-slave/workspace/Lucene-Solr-NightlyTests-4.x/solr/contrib/map-reduce/src/test-files/solr/collection1/../../../contrib/velocity/lib).
   [junit4]   1> 2014-01-17 07:42:29,526 WARN  [TEST-SolrCellMorphlineTest.testSolrCellDocumentTypes-seed#[3335AFF825A799E4]] core.SolrResourceLoader (SolrResourceLoader.java:addToClassLoader(170)) - Can't find (or read) directory to add to classloader: ../../../dist/ (resolved as: /usr/home/hudson/hudson-slave/workspace/Lucene-Solr-NightlyTests-4.x/solr/contrib/map-reduce/src/test-files/solr/collection1/../../../dist).
   [junit4]   1> 2014-01-17 07:42:29,527 WARN  [TEST-SolrCellMorphlineTest.testSolrCellDocumentTypes-seed#[3335AFF825A799E4]] core.SolrResourceLoader (SolrResourceLoader.java:addToClassLoader(170)) - Can't find (or read) directory to add to classloader: /non/existent/dir/yields/warning (resolved as: /non/existent/dir/yields/warning).
   [junit4]   1> 2014-01-17 07:42:29,605 INFO  [TEST-SolrCellMorphlineTest.testSolrCellDocumentTypes-seed#[3335AFF825A799E4]] core.SolrConfig (SolrConfig.java:<init>(170)) - Using Lucene MatchVersion: LUCENE_43
   [junit4]   1> 2014-01-17 07:42:29,703 INFO  [TEST-SolrCellMorphlineTest.testSolrCellDocumentTypes-seed#[3335AFF825A799E4]] core.Config (SolrConfig.java:<init>(288)) - Loaded SolrConfig: solrconfig.xml
   [junit4]   1> 2014-01-17 07:42:29,704 INFO  [TEST-SolrCellMorphlineTest.testSolrCellDocumentTypes-seed#[3335AFF825A799E4]] schema.IndexSchema (IndexSchema.java:readSchema(424)) - Reading Solr Schema from schema.xml
   [junit4]   1> 2014-01-17 07:42:29,732 INFO  [TEST-SolrCellMorphlineTest.testSolrCellDocumentTypes-seed#[3335AFF825A799E4]] schema.IndexSchema (IndexSchema.java:readSchema(452)) - [null] Schema name=example
   [junit4]   1> 2014-01-17 07:42:30,377 INFO  [TEST-SolrCellMorphlineTest.testSolrCellDocumentTypes-seed#[3335AFF825A799E4]] schema.IndexSchema (IndexSchema.java:readSchema(550)) - unique key field: id
   [junit4]   1> 2014-01-17 07:42:30,401 INFO  [TEST-SolrCellMorphlineTest.testSolrCellDocumentTypes-seed#[3335AFF825A799E4]] schema.FileExchangeRateProvider (CurrencyField.java:reload(787)) - Reloading exchange rates from file currency.xml
   [junit4]   1> 2014-01-17 07:42:30,408 INFO  [TEST-SolrCellMorphlineTest.testSolrCellDocumentTypes-seed#[3335AFF825A799E4]] schema.FileExchangeRateProvider (CurrencyField.java:reload(787)) - Reloading exchange rates from file currency.xml
   [junit4]   1> 2014-01-17 07:42:30,474 INFO  [TEST-SolrCellMorphlineTest.testSolrCellDocumentTypes-seed#[3335AFF825A799E4]] core.SolrResourceLoader (SolrResourceLoader.java:<init>(116)) - new SolrResourceLoader for directory: '/usr/home/hudson/hudson-slave/workspace/Lucene-Solr-NightlyTests-4.x/solr/contrib/map-reduce/src/test-files/solr/collection1/'
   [junit4]   1> 2014-01-17 07:42:30,560 INFO  [TEST-SolrCellMorphlineTest.testSolrCellDocumentTypes-seed#[3335AFF825A799E4]] core.SolrConfig (SolrConfig.java:initLibs(529)) - Adding specified lib dirs to ClassLoader
   [junit4]   1> 2014-01-17 07:42:30,562 WARN  [TEST-SolrCellMorphlineTest.testSolrCellDocumentTypes-seed#[3335AFF825A799E4]] core.SolrResourceLoader (SolrResourceLoader.java:addToClassLoader(170)) - Can't find (or read) directory to add to classloader: ../../../contrib/extraction/lib (resolved as: /usr/home/hudson/hudson-slave/workspace/Lucene-Solr-NightlyTests-4.x/solr/contrib/map-reduce/src/test-files/solr/collection1/../../../contrib/extraction/lib).
   [junit4]   1> 2014-01-17 07:42:30,563 WARN  [TEST-SolrCellMorphlineTest.testSolrCellDocumentTypes-seed#[3335AFF825A799E4]] core.SolrResourceLoader (SolrResourceLoader.java:addToClassLoader(170)) - Can't find (or read) directory to add to classloader: ../../../dist/ (resolved as: /usr/home/hudson/hudson-slave/workspace/Lucene-Solr-NightlyTests-4.x/solr/contrib/map-reduce/src/test-files/solr/collection1/../../../dist).
   [junit4]   1> 2014-01-17 07:42:30,564 WARN  [TEST-SolrCellMorphlineTest.testSolrCellDocumentTypes-seed#[3335AFF825A799E4]] core.SolrResourceLoader (SolrResourceLoader.java:addToClassLoader(170)) - Can't find (or read) directory to add to classloader: ../../../contrib/clustering/lib/ (resolved as: /usr/home/hudson/hudson-slave/workspace/Lucene-Solr-NightlyTests-4.x/solr/contrib/map-reduce/src/test-files/solr/collection1/../../../contrib/clustering/lib).
   [junit4]   1> 2014-01-17 07:42:30,564 WARN  [TEST-SolrCellMorphlineTest.testSolrCellDocumentTypes-seed#[3335AFF825A799E4]] core.SolrResourceLoader (SolrResourceLoader.java:addToClassLoader(170)) - Can't find (or read) directory to add to classloader: ../../../dist/ (resolved as: /usr/home/hudson/hudson-slave/workspace/Lucene-Solr-NightlyTests-4.x/solr/contrib/map-reduce/src/test-files/solr/collection1/../../../dist).
   [junit4]   1> 2014-01-17 07:42:30,565 WARN  [TEST-SolrCellMorphlineTest.testSolrCellDocumentTypes-seed#[3335AFF825A799E4]] core.SolrResourceLoader (SolrResourceLoader.java:addToClassLoader(170)) - Can't find (or read) directory to add to classloader: ../../../contrib/langid/lib/ (resolved as: /usr/home/hudson/hudson-slave/workspace/Lucene-Solr-NightlyTests-4.x/solr/contrib/map-reduce/src/test-files/solr/collection1/../../../contrib/langid/lib).
   [junit4]   1> 2014-01-17 07:42:30,566 WARN  [TEST-SolrCellMorphlineTest.testSolrCellDocumentTypes-seed#[3335AFF825A799E4]] core.SolrResourceLoader (SolrResourceLoader.java:addToClassLoader(170)) - Can't find (or read) directory to add to classloader: ../../../dist/ (resolved as: /usr/home/hudson/hudson-slave/workspace/Lucene-Solr-NightlyTests-4.x/solr/contrib/map-reduce/src/test-files/solr/collection1/../../../dist).
   [junit4]   1> 2014-01-17 07:42:30,567 WARN  [TEST-SolrCellMorphlineTest.testSolrCellDocumentTypes-seed#[3335AFF825A799E4]] core.SolrResourceLoader (SolrResourceLoader.java:addToClassLoader(170)) - Can't find (or read) directory to add to classloader: ../../../contrib/velocity/lib (resolved as: /usr/home/hudson/hudson-slave/workspace/Lucene-Solr-NightlyTests-4.x/solr/contrib/map-reduce/src/test-files/solr/collection1/../../../contrib/velocity/lib).
   [junit4]   1> 2014-01-17 07:42:30,568 WARN  [TEST-SolrCellMorphlineTest.testSolrCellDocumentTypes-seed#[3335AFF825A799E4]] core.SolrResourceLoader (SolrResourceLoader.java:addToClassLoader(170)) - Can't find (or read) directory to add to classloader: ../../../dist/ (resolved as: /usr/home/hudson/hudson-slave/workspace/Lucene-Solr-NightlyTests-4.x/solr/contrib/map-reduce/src/test-files/solr/collection1/../../../dist).
   [junit4]   1> 2014-01-17 07:42:30,568 WARN  [TEST-SolrCellMorphlineTest.testSolrCellDocumentTypes-seed#[3335AFF825A799E4]] core.SolrResourceLoader (SolrResourceLoader.java:addToClassLoader(170)) - Can't find (or read) directory to add to classloader: /non/existent/dir/yields/warning (resolved as: /non/existent/dir/yields/warning).
   [junit4]   1> 2014-01-17 07:42:30,616 INFO  [TEST-SolrCellMorphlineTest.testSolrCellDocumentTypes-seed#[3335AFF825A799E4]] core.SolrConfig (SolrConfig.java:<init>(170)) - Using Lucene MatchVersion: LUCENE_43
   [junit4]   1> 2014-01-17 07:42:30,709 INFO  [TEST-SolrCellMorphlineTest.testSolrCellDocumentTypes-seed#[3335AFF825A799E4]] core.Config (SolrConfig.java:<init>(288)) - Loaded SolrConfig: solrconfig.xml
   [junit4]   1> 2014-01-17 07:42:30,710 INFO  [TEST-SolrCellMorphlineTest.testSolrCellDocumentTypes-seed#[3335AFF825A799E4]] schema.IndexSchema (IndexSchema.java:readSchema(424)) - Reading Solr Schema from schema.xml
   [junit4]   1> 2014-01-17 07:42:30,735 INFO  [TEST-SolrCellMorphlineTest.testSolrCellDocumentTypes-seed#[3335AFF825A799E4]] schema.IndexSchema (IndexSchema.java:readSchema(452)) - [null] Schema name=example
   [junit4]   1> 2014-01-17 07:42:31,390 INFO  [TEST-SolrCellMorphlineTest.testSolrCellDocumentTypes-seed#[3335AFF825A799E4]] schema.IndexSchema (IndexSchema.java:readSchema(550)) - unique key field: id
   [junit4]   1> 2014-01-17 07:42:31,425 INFO  [TEST-SolrCellMorphlineTest.testSolrCellDocumentTypes-seed#[3335AFF825A799E4]] schema.FileExchangeRateProvider (CurrencyField.java:reload(787)) - Reloading exchange rates from file currency.xml
   [junit4]   1> 2014-01-17 07:42:31,435 INFO  [TEST-SolrCellMorphlineTest.testSolrCellDocumentTypes-seed#[3335AFF825A799E4]] schema.FileExchangeRateProvider (CurrencyField.java:reload(787)) - Reloading exchange rates from file currency.xml
   [junit4]   1> 2014-01-17 07:42:34,602 INFO  [TEST-SolrCellMorphlineTest.testSolrCellDocumentTypes-seed#[3335AFF825A799E4]] core.SolrResourceLoader (SolrResourceLoader.java:<init>(116)) - new SolrResourceLoader for directory: '/usr/home/hudson/hudson-slave/workspace/Lucene-Solr-NightlyTests-4.x/solr/contrib/map-reduce/src/test-files/solr/collection1/'
   [junit4]   1> 2014-01-17 07:42:34,691 INFO  [TEST-SolrCellMorphlineTest.testSolrCellDocumentTypes-seed#[3335AFF825A799E4]] core.SolrConfig (SolrConfig.java:initLibs(529)) - Adding specified lib dirs to ClassLoader
   [junit4]   1> 2014-01-17 07:42:34,693 WARN  [TEST-SolrCellMorphlineTest.testSolrCellDocumentTypes-seed#[3335AFF825A799E4]] core.SolrResourceLoader (SolrResourceLoader.java:addToClassLoader(170)) - Can't find (or read) directory to add to classloader: ../../../contrib/extraction/lib (resolved as: /usr/home/hudson/hudson-slave/workspace/Lucene-Solr-NightlyTests-4.x/solr/contrib/map-reduce/src/test-files/solr/collection1/../../../contrib/extraction/lib).
   [junit4]   1> 2014-01-17 07:42:34,694 WARN  [TEST-SolrCellMorphlineTest.testSolrCellDocumentTypes-seed#[3335AFF825A799E4]] core.SolrResourceLoader (SolrResourceLoader.java:addToClassLoader(170)) - Can't find (or read) directory to add to classloader: ../../../dist/ (resolved as: /usr/home/hudson/hudson-slave/workspace/Lucene-Solr-NightlyTests-4.x/solr/contrib/map-reduce/src/test-files/solr/collection1/../../../dist).
   [junit4]   1> 2014-01-17 07:42:34,695 WARN  [TEST-SolrCellMorphlineTest.testSolrCellDocumentTypes-seed#[3335AFF825A799E4]] core.SolrResourceLoader (SolrResourceLoader.java:addToClassLoader(170)) - Can't find (or read) directory to add to classloader: ../../../contrib/clustering/lib/ (resolved as: /usr/home/hudson/hudson-slave/workspace/Lucene-Solr-NightlyTests-4.x/solr/contrib/map-reduce/src/test-files/solr/collection1/../../../contrib/clustering/lib).
   [junit4]   1> 2014-01-17 07:42:34,696 WARN  [TEST-SolrCellMorphlineTest.testSolrCellDocumentTypes-seed#[3335AFF825A799E4]] core.SolrResourceLoader (SolrResourceLoader.java:addToClassLoader(170)) - Can't find (or read) directory to add to classloader: ../../../dist/ (resolved as: /usr/home/hudson/hudson-slave/workspace/Lucene-Solr-NightlyTests-4.x/solr/contrib/map-reduce/src/test-files/solr/collection1/../../../dist).
   [junit4]   1> 2014-01-17 07:42:34,697 WARN  [TEST-SolrCellMorphlineTest.testSolrCellDocumentTypes-seed#[3335AFF825A799E4]] core.SolrResourceLoader (SolrResourceLoader.java:addToClassLoader(170)) - Can't find (or read) directory to add to classloader: ../../../contrib/langid/lib/ (resolved as: /usr/home/hudson/hudson-slave/workspace/Lucene-Solr-NightlyTests-4.x/solr/contrib/map-reduce/src/test-files/solr/collection1/../../../contrib/langid/lib).
   [junit4]   1> 2014-01-17 07:42:34,697 WARN  [TEST-SolrCellMorphlineTest.testSolrCellDocumentTypes-seed#[3335AFF825A799E4]] core.SolrResourceLoader (SolrResourceLoader.java:addToClassLoader(170)) - Can't find (or read) directory to add to classloader: ../../../dist/ (resolved as: /usr/home/hudson/hudson-slave/workspace/Lucene-Solr-NightlyTests-4.x/solr/contrib/map-reduce/src/test-files/solr/collection1/../../../dist).
   [junit4]   1> 2014-01-17 07:42:34,698 WARN  [TEST-SolrCellMorphlineTest.testSolrCellDocumentTypes-seed#[3335AFF825A799E4]] core.SolrResourceLoader (SolrResourceLoader.java:addToClassLoader(170)) - Can't find (or read) directory to add to classloader: ../../../contrib/velocity/lib (resolved as: /usr/home/hudson/hudson-slave/workspace/Lucene-Solr-NightlyTests-4.x/solr/contrib/map-reduce/src/test-files/solr/collection1/../../../contrib/velocity/lib).
   [junit4]   1> 2014-01-17 07:42:34,699 WARN  [TEST-SolrCellMorphlineTest.testSolrCellDocumentTypes-seed#[3335AFF825A799E4]] core.SolrResourceLoader (SolrResourceLoader.java:addToClassLoader(170)) - Can't find (or read) directory to add to classloader: ../../../dist/ (resolved as: /usr/home/hudson/hudson-slave/workspace/Lucene-Solr-NightlyTests-4.x/solr/contrib/map-reduce/src/test-files/solr/collection1/../../../dist).
   [junit4]   1> 2014-01-17 07:42:34,700 WARN  [TEST-SolrCellMorphlineTest.testSolrCellDocumentTypes-seed#[3335AFF825A799E4]] core.SolrResourceLoader (SolrResourceLoader.java:addToClassLoader(170)) - Can't find (or read) directory to add to classloader: /non/existent/dir/yields/warning (resolved as: /non/existent/dir/yields/warning).
   [junit4]   1> 2014-01-17 07:42:34,746 INFO  [TEST-SolrCellMorphlineTest.testSolrCellDocumentTypes-seed#[3335AFF825A799E4]] core.SolrConfig (SolrConfig.java:<init>(170)) - Using Lucene MatchVersion: LUCENE_43
   [junit4]   1> 2014-01-17 07:42:34,835 INFO  [TEST-SolrCellMorphlineTest.testSolrCellDocumentTypes-seed#[3335AFF825A799E4]] core.Config (SolrConfig.java:<init>(288)) - Loaded SolrConfig: solrconfig.xml
   [junit4]   1> 2014-01-17 07:42:34,837 INFO  [TEST-SolrCellMorphlineTest.testSolrCellDocumentTypes-seed#[3335AFF825A799E4]] schema.IndexSchema (IndexSchema.java:readSchema(424)) - Reading Solr Schema from schema.xml
   [junit4]   1> 2014-01-17 07:42:34,853 INFO  [TEST-SolrCellMorphlineTest.testSolrCellDocumentTypes-seed#[3335AFF825A799E4]] schema.IndexSchema (IndexSchema.java:readSchema(452)) - [null] Schema name=example
   [junit4]   1> 2014-01-17 07:42:35,475 INFO  [TEST-SolrCellMorphlineTest.testSolrCellDocumentTypes-seed#[3335AFF825A799E4]] schema.IndexSchema (IndexSchema.java:readSchema(550)) - unique key field: id
   [junit4]   1> 2014-01-17 07:42:35,497 INFO  [TEST-SolrCellMorphlineTest.testSolrCellDocumentTypes-seed#[3335AFF825A799E4]] schema.FileExchangeRateProvider (CurrencyField.java:reload(787)) - Reloading exchange rates from file currency.xml
   [junit4]   1> 2014-01-17 07:42:35,503 INFO  [TEST-SolrCellMorphlineTest.testSolrCellDocumentTypes-seed#[3335AFF825A799E4]] schema.FileExchangeRateProvider (CurrencyField.java:reload(787)) - Reloading exchange rates from file currency.xml
   [junit4]   1> 2014-01-17 07:42:35,531 INFO  [TEST-SolrCellMorphlineTest.testSolrCellDocumentTypes-seed#[3335AFF825A799E4]] core.SolrResourceLoader (SolrResourceLoader.java:<init>(116)) - new SolrResourceLoader for directory: '/usr/home/hudson/hudson-slave/workspace/Lucene-Solr-NightlyTests-4.x/solr/contrib/map-reduce/src/test-files/solr/collection1/'
   [junit4]   1> 2014-01-17 07:42:35,556 INFO  [TEST-SolrCellMorphlineTest.testSolrCellDocumentTypes-seed#[3335AFF825A799E4]] core.SolrConfig (SolrConfig.java:initLibs(529)) - Adding specified lib dirs to ClassLoader
   [junit4]   1> 2014-01-17 07:42:35,557 WARN  [TEST-SolrCellMorphlineTest.testSolrCellDocumentTypes-seed#[3335AFF825A799E4]] core.SolrResourceLoader (SolrResourceLoader.java:addToClassLoader(170)) - Can't find (or read) directory to add to classloader: ../../../contrib/extraction/lib (resolved as: /usr/home/hudson/hudson-slave/workspace/Lucene-Solr-NightlyTests-4.x/solr/contrib/map-reduce/src/test-files/solr/collection1/../../../contrib/extraction/lib).
   [junit4]   1> 2014-01-17 07:42:35,558 WARN  [TEST-SolrCellMorphlineTest.testSolrCellDocumentTypes-seed#[3335AFF825A799E4]] core.SolrResourceLoader (SolrResourceLoader.java:addToClassLoader(170)) - Can't find (or read) directory to add to classloader: ../../../dist/ (resolved as: /usr/home/hudson/hudson-slave/workspace/Lucene-Solr-NightlyTests-4.x/solr/contrib/map-reduce/src/test-files/solr/collection1/../../../dist).
   [junit4]   1> 2014-01-17 07:42:35,558 WARN  [TEST-SolrCellMorphlineTest.testSolrCellDocumentTypes-seed#[3335AFF825A799E4]] core.SolrResourceLoader (SolrResourceLoader.java:addToClassLoader(170)) - Can't find (or read) directory to add to classloader: ../../../contrib/clustering/lib/ (resolved as: /usr/home/hudson/hudson-slave/workspace/Lucene-Solr-NightlyTests-4.x/solr/contrib/map-reduce/src/test-files/solr/collection1/../../../contrib/clustering/lib).
   [junit4]   1> 2014-01-17 07:42:35,559 WARN  [TEST-SolrCellMorphlineTest.testSolrCellDocumentTypes-seed#[3335AFF825A799E4]] core.SolrResourceLoader (SolrResourceLoader.java:addToClassLoader(170)) - Can't find (or read) directory to add to classloader: ../../../dist/ (resolved as: /usr/home/hudson/hudson-slave/workspace/Lucene-Solr-NightlyTests-4.x/solr/contrib/map-reduce/src/test-files/solr/collection1/../../../dist).
   [junit4]   1> 2014-01-17 07:42:35,559 WARN  [TEST-SolrCellMorphlineTest.testSolrCellDocumentTypes-seed#[3335AFF825A799E4]] core.SolrResourceLoader (SolrResourceLoader.java:addToClassLoader(170)) - Can't find (or read) directory to add to classloader: ../../../contrib/langid/lib/ (resolved as: /usr/home/hudson/hudson-slave/workspace/Lucene-Solr-NightlyTests-4.x/solr/contrib/map-reduce/src/test-files/solr/collection1/../../../contrib/langid/lib).
   [junit4]   1> 2014-01-17 07:42:35,560 WARN  [TEST-SolrCellMorphlineTest.testSolrCellDocumentTypes-seed#[3335AFF825A799E4]] core.SolrResourceLoader (SolrResourceLoader.java:addToClassLoader(170)) - Can't find (or read) directory to add to classloader: ../../../dist/ (resolved as: /usr/home/hudson/hudson-slave/workspace/Lucene-Solr-NightlyTests-4.x/solr/contrib/map-reduce/src/test-files/solr/collection1/../../../dist).
   [junit4]   1> 2014-01-17 07:42:35,561 WARN  [TEST-SolrCellMorphlineTest.testSolrCellDocumentTypes-seed#[3335AFF825A799E4]] core.SolrResourceLoader (SolrResourceLoader.java:addToClassLoader(170)) - Can't find (or read) directory to add to classloader: ../../../contrib/velocity/lib (resolved as: /usr/home/hudson/hudson-slave/workspace/Lucene-Solr-NightlyTests-4.x/solr/contrib/map-reduce/src/test-files/solr/collection1/../../../contrib/velocity/lib).
   [junit4]   1> 2014-01-17 07:42:35,561 WARN  [TEST-SolrCellMorphlineTest.testSolrCellDocumentTypes-seed#[3335AFF825A799E4]] core.SolrResourceLoader (SolrResourceLoader.java:addToClassLoader(170)) - Can't find (or read) directory to add to classloader: ../../../dist/ (resolved as: /usr/home/hudson/hudson-slave/workspace/Lucene-Solr-NightlyTests-4.x/solr/contrib/map-reduce/src/test-files/solr/collection1/../

[...truncated too long message...]

ctoryReader(segments_4:57:nrt _m(4.7):C1 _n(4.7):C1 _o(4.7):C1)}
   [junit4]   1> 2014-01-17 07:43:06,653 INFO  [TEST-SolrCellMorphlineTest.testSolrCellJPGCompressed-seed#[3335AFF825A799E4]] processor.LogUpdateProcessor (LogUpdateProcessorFactory.java:finish(198)) - [collection1] webapp=null path=/update params={commit=true&softCommit=true&waitSearcher=true} {commit=} 0 8
   [junit4]   1> 2014-01-17 07:43:06,654 INFO  [TEST-SolrCellMorphlineTest.testSolrCellJPGCompressed-seed#[3335AFF825A799E4]] core.SolrCore (SolrCore.java:execute(1917)) - [collection1] webapp=null path=/select params={q=*%3A*&rows=2147483647} hits=3 status=0 QTime=0 
   [junit4]   1> 2014-01-17 07:43:06,656 INFO  [TEST-SolrCellMorphlineTest.testSolrCellJPGCompressed-seed#[3335AFF825A799E4]] update.UpdateHandler (DirectUpdateHandler2.java:commit(521)) - start commit{,optimize=false,openSearcher=true,waitSearcher=true,expungeDeletes=false,softCommit=true,prepareCommit=false}
   [junit4]   1> 2014-01-17 07:43:06,656 INFO  [TEST-SolrCellMorphlineTest.testSolrCellJPGCompressed-seed#[3335AFF825A799E4]] search.SolrIndexSearcher (SolrIndexSearcher.java:<init>(199)) - Opening Searcher@57003d5d main
   [junit4]   1> 2014-01-17 07:43:06,657 INFO  [TEST-SolrCellMorphlineTest.testSolrCellJPGCompressed-seed#[3335AFF825A799E4]] update.UpdateHandler (DirectUpdateHandler2.java:commit(612)) - end_commit_flush
   [junit4]   1> 2014-01-17 07:43:06,658 INFO  [searcherExecutor-5-thread-1] core.SolrCore (QuerySenderListener.java:newSearcher(44)) - QuerySenderListener sending requests to Searcher@57003d5d main{StandardDirectoryReader(segments_4:57:nrt _m(4.7):C1 _n(4.7):C1 _o(4.7):C1)}
   [junit4]   1> 2014-01-17 07:43:06,659 INFO  [searcherExecutor-5-thread-1] core.SolrCore (QuerySenderListener.java:newSearcher(91)) - QuerySenderListener done.
   [junit4]   1> 2014-01-17 07:43:06,659 INFO  [searcherExecutor-5-thread-1] core.SolrCore (SolrCore.java:registerSearcher(1865)) - [collection1] Registered new searcher Searcher@57003d5d main{StandardDirectoryReader(segments_4:57:nrt _m(4.7):C1 _n(4.7):C1 _o(4.7):C1)}
   [junit4]   1> 2014-01-17 07:43:06,660 INFO  [TEST-SolrCellMorphlineTest.testSolrCellJPGCompressed-seed#[3335AFF825A799E4]] processor.LogUpdateProcessor (LogUpdateProcessorFactory.java:finish(198)) - [collection1] webapp=null path=/update params={commit=true&softCommit=true&waitSearcher=true} {commit=} 0 4
   [junit4]   1> 2014-01-17 07:43:06,661 INFO  [TEST-SolrCellMorphlineTest.testSolrCellJPGCompressed-seed#[3335AFF825A799E4]] core.SolrCore (SolrCore.java:execute(1917)) - [collection1] webapp=null path=/select params={q=*%3A*&rows=2147483647} hits=3 status=0 QTime=0 
   [junit4]   1> 2014-01-17 07:43:06,662 INFO  [TEST-SolrCellMorphlineTest.testSolrCellJPGCompressed-seed#[3335AFF825A799E4]] solr.SolrTestCaseJ4 (SolrTestCaseJ4.java:tearDown(227)) - ###Ending testSolrCellJPGCompressed
   [junit4]   1> 2014-01-17 07:43:06,666 INFO  [SUITE-SolrCellMorphlineTest-seed#[3335AFF825A799E4]-worker] solr.SolrTestCaseJ4 (SolrTestCaseJ4.java:deleteCore(543)) - ###deleteCore
   [junit4]   1> 2014-01-17 07:43:06,667 INFO  [SUITE-SolrCellMorphlineTest-seed#[3335AFF825A799E4]-worker] core.CoreContainer (CoreContainer.java:shutdown(360)) - Shutting down CoreContainer instance=1658340521
   [junit4]   1> 2014-01-17 07:43:06,668 INFO  [SUITE-SolrCellMorphlineTest-seed#[3335AFF825A799E4]-worker] core.SolrCore (SolrCore.java:close(1000)) - [collection1]  CLOSING SolrCore org.apache.solr.core.SolrCore@d7e60a1
   [junit4]   1> 2014-01-17 07:43:06,671 INFO  [SUITE-SolrCellMorphlineTest-seed#[3335AFF825A799E4]-worker] update.UpdateHandler (DirectUpdateHandler2.java:close(687)) - closing DirectUpdateHandler2{commits=36,autocommit maxTime=60000ms,autocommits=0,soft autocommit maxTime=1000ms,soft autocommits=0,optimizes=0,rollbacks=0,expungeDeletes=0,docsPending=3,adds=0,deletesById=0,deletesByQuery=0,errors=0,cumulative_adds=41,cumulative_deletesById=0,cumulative_deletesByQuery=9,cumulative_errors=0,transaction_logs_total_size=52130,transaction_logs_total_number=9}
   [junit4]   1> 2014-01-17 07:43:06,672 INFO  [SUITE-SolrCellMorphlineTest-seed#[3335AFF825A799E4]-worker] update.SolrCoreState (SolrCoreState.java:decrefSolrCoreState(71)) - Closing SolrCoreState
   [junit4]   1> 2014-01-17 07:43:06,673 INFO  [SUITE-SolrCellMorphlineTest-seed#[3335AFF825A799E4]-worker] update.DefaultSolrCoreState (DefaultSolrCoreState.java:closeIndexWriter(65)) - SolrCoreState ref count has reached 0 - closing IndexWriter
   [junit4]   1> 2014-01-17 07:43:06,674 INFO  [SUITE-SolrCellMorphlineTest-seed#[3335AFF825A799E4]-worker] update.DefaultSolrCoreState (DefaultSolrCoreState.java:closeIndexWriter(67)) - closing IndexWriter with IndexWriterCloser
   [junit4]   1> 2014-01-17 07:43:06,688 INFO  [SUITE-SolrCellMorphlineTest-seed#[3335AFF825A799E4]-worker] core.SolrCore (SolrDeletionPolicy.java:onCommit(98)) - SolrDeletionPolicy.onCommit: commits: num=2
   [junit4]   1> 	commit{dir=MockDirectoryWrapper(org.apache.lucene.store.RAMDirectory@1e8809ce lockFactory=org.apache.lucene.store.NativeFSLockFactory@213a8eb1),segFN=segments_4,generation=4}
   [junit4]   1> 	commit{dir=MockDirectoryWrapper(org.apache.lucene.store.RAMDirectory@1e8809ce lockFactory=org.apache.lucene.store.NativeFSLockFactory@213a8eb1),segFN=segments_5,generation=5}
   [junit4]   1> 2014-01-17 07:43:06,689 INFO  [SUITE-SolrCellMorphlineTest-seed#[3335AFF825A799E4]-worker] core.SolrCore (SolrDeletionPolicy.java:updateCommits(165)) - newest commit generation = 5
   [junit4]   1> 2014-01-17 07:43:06,692 INFO  [SUITE-SolrCellMorphlineTest-seed#[3335AFF825A799E4]-worker] core.SolrCore (SolrCore.java:closeSearcher(1882)) - [collection1] Closing main searcher on request.
   [junit4]   1> 2014-01-17 07:43:06,693 INFO  [SUITE-SolrCellMorphlineTest-seed#[3335AFF825A799E4]-worker] core.CachingDirectoryFactory (CachingDirectoryFactory.java:close(168)) - Closing MockDirectoryFactory - 2 directories currently being tracked
   [junit4]   1> 2014-01-17 07:43:06,694 INFO  [SUITE-SolrCellMorphlineTest-seed#[3335AFF825A799E4]-worker] core.CachingDirectoryFactory (CachingDirectoryFactory.java:closeCacheValue(235)) - looking to close /usr/home/hudson/hudson-slave/workspace/Lucene-Solr-NightlyTests-4.x/solr/build/contrib/solr-morphlines-cell/test/J0/./solrtest-SolrCellMorphlineTest-1389944518467/index [CachedDir<<refCount=0;path=/usr/home/hudson/hudson-slave/workspace/Lucene-Solr-NightlyTests-4.x/solr/build/contrib/solr-morphlines-cell/test/J0/./solrtest-SolrCellMorphlineTest-1389944518467/index;done=false>>]
   [junit4]   1> 2014-01-17 07:43:06,695 INFO  [SUITE-SolrCellMorphlineTest-seed#[3335AFF825A799E4]-worker] core.CachingDirectoryFactory (CachingDirectoryFactory.java:close(304)) - Closing directory: /usr/home/hudson/hudson-slave/workspace/Lucene-Solr-NightlyTests-4.x/solr/build/contrib/solr-morphlines-cell/test/J0/./solrtest-SolrCellMorphlineTest-1389944518467/index
   [junit4]   1> 2014-01-17 07:43:06,696 INFO  [SUITE-SolrCellMorphlineTest-seed#[3335AFF825A799E4]-worker] core.CachingDirectoryFactory (CachingDirectoryFactory.java:closeCacheValue(235)) - looking to close /usr/home/hudson/hudson-slave/workspace/Lucene-Solr-NightlyTests-4.x/solr/build/contrib/solr-morphlines-cell/test/J0/./solrtest-SolrCellMorphlineTest-1389944518467 [CachedDir<<refCount=0;path=/usr/home/hudson/hudson-slave/workspace/Lucene-Solr-NightlyTests-4.x/solr/build/contrib/solr-morphlines-cell/test/J0/./solrtest-SolrCellMorphlineTest-1389944518467;done=false>>]
   [junit4]   1> 2014-01-17 07:43:06,696 INFO  [SUITE-SolrCellMorphlineTest-seed#[3335AFF825A799E4]-worker] core.CachingDirectoryFactory (CachingDirectoryFactory.java:close(304)) - Closing directory: /usr/home/hudson/hudson-slave/workspace/Lucene-Solr-NightlyTests-4.x/solr/build/contrib/solr-morphlines-cell/test/J0/./solrtest-SolrCellMorphlineTest-1389944518467
   [junit4]   2> NOTE: test params are: codec=Lucene3x, sim=DefaultSimilarity, locale=ar, timezone=Etc/GMT+3
   [junit4]   2> NOTE: FreeBSD 9.1-RELEASE-p3 amd64/Sun Microsystems Inc. 1.6.0_32 (64-bit)/cpus=16,threads=1,free=317218312,total=506527744
   [junit4]   2> NOTE: All tests run in this JVM: [SolrCellMorphlineTest]
   [junit4] Completed in 71.51s, 5 tests, 1 failure <<< FAILURES!

[...truncated 9 lines...]
BUILD FAILED
/usr/home/hudson/hudson-slave/workspace/Lucene-Solr-NightlyTests-4.x/build.xml:466: The following error occurred while executing this line:
/usr/home/hudson/hudson-slave/workspace/Lucene-Solr-NightlyTests-4.x/build.xml:439: The following error occurred while executing this line:
/usr/home/hudson/hudson-slave/workspace/Lucene-Solr-NightlyTests-4.x/build.xml:39: The following error occurred while executing this line:
/usr/home/hudson/hudson-slave/workspace/Lucene-Solr-NightlyTests-4.x/extra-targets.xml:37: The following error occurred while executing this line:
/usr/home/hudson/hudson-slave/workspace/Lucene-Solr-NightlyTests-4.x/solr/build.xml:209: The following error occurred while executing this line:
/usr/home/hudson/hudson-slave/workspace/Lucene-Solr-NightlyTests-4.x/solr/common-build.xml:441: The following error occurred while executing this line:
/usr/home/hudson/hudson-slave/workspace/Lucene-Solr-NightlyTests-4.x/solr/common-build.xml:491: The following error occurred while executing this line:
/usr/home/hudson/hudson-slave/workspace/Lucene-Solr-NightlyTests-4.x/lucene/common-build.xml:1308: The following error occurred while executing this line:
/usr/home/hudson/hudson-slave/workspace/Lucene-Solr-NightlyTests-4.x/lucene/common-build.xml:941: There were test failures: 1 suite, 5 tests, 1 failure

Total time: 160 minutes 58 seconds
Build step 'Invoke Ant' marked build as failure
Archiving artifacts
Recording test results
Email was triggered for: Failure
Sending email for trigger: Failure

UILD\\s+FAILED(?s:.*+)                                                                                                                                   \
)"}

Mime
View raw message