lucene-dev mailing list archives

Site index · List index
Message view « Date » · « Thread »
Top « Date » · « Thread »
From Policeman Jenkins Server <jenk...@thetaphi.de>
Subject [JENKINS] Lucene-Solr-trunk-Linux (32bit/jdk1.7.0_60-ea-b03) - Build # 9294 - Failure!
Date Thu, 30 Jan 2014 13:44:50 GMT
Build: http://jenkins.thetaphi.de/job/Lucene-Solr-trunk-Linux/9294/
Java: 32bit/jdk1.7.0_60-ea-b03 -client -XX:+UseParallelGC

1 tests failed.
REGRESSION:  org.apache.solr.morphlines.cell.SolrCellMorphlineTest.testSolrCellDocumentTypes2

Error Message:
key:ignored_creation_date expected:<[2007-10-01T16:13:56Z]> but was:<[1464-10-01T16:13:56Z]>

Stack Trace:
java.lang.AssertionError: key:ignored_creation_date expected:<[2007-10-01T16:13:56Z]> but was:<[1464-10-01T16:13:56Z]>
	at __randomizedtesting.SeedInfo.seed([A32141060A4CE5F9:28A1FAE60DBA7607]:0)
	at org.junit.Assert.fail(Assert.java:93)
	at org.junit.Assert.failNotEquals(Assert.java:647)
	at org.junit.Assert.assertEquals(Assert.java:128)
	at org.apache.solr.morphlines.solr.AbstractSolrMorphlineTestBase.testDocumentTypesInternal(AbstractSolrMorphlineTestBase.java:165)
	at org.apache.solr.morphlines.cell.SolrCellMorphlineTest.testSolrCellDocumentTypes2(SolrCellMorphlineTest.java:255)
	at sun.reflect.NativeMethodAccessorImpl.invoke0(Native Method)
	at sun.reflect.NativeMethodAccessorImpl.invoke(NativeMethodAccessorImpl.java:57)
	at sun.reflect.DelegatingMethodAccessorImpl.invoke(DelegatingMethodAccessorImpl.java:43)
	at java.lang.reflect.Method.invoke(Method.java:606)
	at com.carrotsearch.randomizedtesting.RandomizedRunner.invoke(RandomizedRunner.java:1559)
	at com.carrotsearch.randomizedtesting.RandomizedRunner.access$600(RandomizedRunner.java:79)
	at com.carrotsearch.randomizedtesting.RandomizedRunner$6.evaluate(RandomizedRunner.java:737)
	at com.carrotsearch.randomizedtesting.RandomizedRunner$7.evaluate(RandomizedRunner.java:773)
	at com.carrotsearch.randomizedtesting.RandomizedRunner$8.evaluate(RandomizedRunner.java:787)
	at com.carrotsearch.randomizedtesting.rules.SystemPropertiesRestoreRule$1.evaluate(SystemPropertiesRestoreRule.java:53)
	at org.apache.lucene.util.TestRuleSetupTeardownChained$1.evaluate(TestRuleSetupTeardownChained.java:50)
	at org.apache.lucene.util.TestRuleFieldCacheSanity$1.evaluate(TestRuleFieldCacheSanity.java:51)
	at org.apache.lucene.util.AbstractBeforeAfterRule$1.evaluate(AbstractBeforeAfterRule.java:46)
	at com.carrotsearch.randomizedtesting.rules.SystemPropertiesInvariantRule$1.evaluate(SystemPropertiesInvariantRule.java:55)
	at org.apache.lucene.util.TestRuleThreadAndTestName$1.evaluate(TestRuleThreadAndTestName.java:49)
	at org.apache.lucene.util.TestRuleIgnoreAfterMaxFailures$1.evaluate(TestRuleIgnoreAfterMaxFailures.java:70)
	at org.apache.lucene.util.TestRuleMarkFailure$1.evaluate(TestRuleMarkFailure.java:48)
	at com.carrotsearch.randomizedtesting.rules.StatementAdapter.evaluate(StatementAdapter.java:36)
	at com.carrotsearch.randomizedtesting.ThreadLeakControl$StatementRunner.run(ThreadLeakControl.java:358)
	at com.carrotsearch.randomizedtesting.ThreadLeakControl.forkTimeoutingTask(ThreadLeakControl.java:782)
	at com.carrotsearch.randomizedtesting.ThreadLeakControl$3.evaluate(ThreadLeakControl.java:442)
	at com.carrotsearch.randomizedtesting.RandomizedRunner.runSingleTest(RandomizedRunner.java:746)
	at com.carrotsearch.randomizedtesting.RandomizedRunner$3.evaluate(RandomizedRunner.java:648)
	at com.carrotsearch.randomizedtesting.RandomizedRunner$4.evaluate(RandomizedRunner.java:682)
	at com.carrotsearch.randomizedtesting.RandomizedRunner$5.evaluate(RandomizedRunner.java:693)
	at com.carrotsearch.randomizedtesting.rules.StatementAdapter.evaluate(StatementAdapter.java:36)
	at com.carrotsearch.randomizedtesting.rules.SystemPropertiesRestoreRule$1.evaluate(SystemPropertiesRestoreRule.java:53)
	at org.apache.lucene.util.AbstractBeforeAfterRule$1.evaluate(AbstractBeforeAfterRule.java:46)
	at org.apache.lucene.util.TestRuleStoreClassName$1.evaluate(TestRuleStoreClassName.java:42)
	at com.carrotsearch.randomizedtesting.rules.SystemPropertiesInvariantRule$1.evaluate(SystemPropertiesInvariantRule.java:55)
	at com.carrotsearch.randomizedtesting.rules.NoShadowingOrOverridesOnMethodsRule$1.evaluate(NoShadowingOrOverridesOnMethodsRule.java:39)
	at com.carrotsearch.randomizedtesting.rules.NoShadowingOrOverridesOnMethodsRule$1.evaluate(NoShadowingOrOverridesOnMethodsRule.java:39)
	at com.carrotsearch.randomizedtesting.rules.StatementAdapter.evaluate(StatementAdapter.java:36)
	at org.apache.lucene.util.TestRuleAssertionsRequired$1.evaluate(TestRuleAssertionsRequired.java:43)
	at org.apache.lucene.util.TestRuleMarkFailure$1.evaluate(TestRuleMarkFailure.java:48)
	at org.apache.lucene.util.TestRuleIgnoreAfterMaxFailures$1.evaluate(TestRuleIgnoreAfterMaxFailures.java:70)
	at org.apache.lucene.util.TestRuleIgnoreTestSuites$1.evaluate(TestRuleIgnoreTestSuites.java:55)
	at com.carrotsearch.randomizedtesting.rules.StatementAdapter.evaluate(StatementAdapter.java:36)
	at com.carrotsearch.randomizedtesting.ThreadLeakControl$StatementRunner.run(ThreadLeakControl.java:358)
	at java.lang.Thread.run(Thread.java:744)




Build Log:
[...truncated 18229 lines...]
   [junit4] Suite: org.apache.solr.morphlines.cell.SolrCellMorphlineTest
   [junit4]   1> 2014-01-30 13:44:24,977 INFO  [SUITE-SolrCellMorphlineTest-seed#[A32141060A4CE5F9]-worker] solr.SolrTestCaseJ4 (SolrTestCaseJ4.java:initCore(470)) - ####initCore
   [junit4]   1> 2014-01-30 13:44:25,014 INFO  [SUITE-SolrCellMorphlineTest-seed#[A32141060A4CE5F9]-worker] core.SolrResourceLoader (SolrResourceLoader.java:<init>(116)) - new SolrResourceLoader for directory: '/mnt/ssd/jenkins/workspace/Lucene-Solr-trunk-Linux/solr/contrib/map-reduce/src/test-files/solr/collection1/'
   [junit4]   1> 2014-01-30 13:44:25,511 INFO  [SUITE-SolrCellMorphlineTest-seed#[A32141060A4CE5F9]-worker] core.SolrConfig (SolrConfig.java:initLibs(529)) - Adding specified lib dirs to ClassLoader
   [junit4]   1> 2014-01-30 13:44:25,513 WARN  [SUITE-SolrCellMorphlineTest-seed#[A32141060A4CE5F9]-worker] core.SolrResourceLoader (SolrResourceLoader.java:addToClassLoader(170)) - Can't find (or read) directory to add to classloader: ../../../contrib/extraction/lib (resolved as: /mnt/ssd/jenkins/workspace/Lucene-Solr-trunk-Linux/solr/contrib/map-reduce/src/test-files/solr/collection1/../../../contrib/extraction/lib).
   [junit4]   1> 2014-01-30 13:44:25,513 WARN  [SUITE-SolrCellMorphlineTest-seed#[A32141060A4CE5F9]-worker] core.SolrResourceLoader (SolrResourceLoader.java:addToClassLoader(170)) - Can't find (or read) directory to add to classloader: ../../../dist/ (resolved as: /mnt/ssd/jenkins/workspace/Lucene-Solr-trunk-Linux/solr/contrib/map-reduce/src/test-files/solr/collection1/../../../dist).
   [junit4]   1> 2014-01-30 13:44:25,514 WARN  [SUITE-SolrCellMorphlineTest-seed#[A32141060A4CE5F9]-worker] core.SolrResourceLoader (SolrResourceLoader.java:addToClassLoader(170)) - Can't find (or read) directory to add to classloader: ../../../contrib/clustering/lib/ (resolved as: /mnt/ssd/jenkins/workspace/Lucene-Solr-trunk-Linux/solr/contrib/map-reduce/src/test-files/solr/collection1/../../../contrib/clustering/lib).
   [junit4]   1> 2014-01-30 13:44:25,514 WARN  [SUITE-SolrCellMorphlineTest-seed#[A32141060A4CE5F9]-worker] core.SolrResourceLoader (SolrResourceLoader.java:addToClassLoader(170)) - Can't find (or read) directory to add to classloader: ../../../dist/ (resolved as: /mnt/ssd/jenkins/workspace/Lucene-Solr-trunk-Linux/solr/contrib/map-reduce/src/test-files/solr/collection1/../../../dist).
   [junit4]   1> 2014-01-30 13:44:25,515 WARN  [SUITE-SolrCellMorphlineTest-seed#[A32141060A4CE5F9]-worker] core.SolrResourceLoader (SolrResourceLoader.java:addToClassLoader(170)) - Can't find (or read) directory to add to classloader: ../../../contrib/langid/lib/ (resolved as: /mnt/ssd/jenkins/workspace/Lucene-Solr-trunk-Linux/solr/contrib/map-reduce/src/test-files/solr/collection1/../../../contrib/langid/lib).
   [junit4]   1> 2014-01-30 13:44:25,515 WARN  [SUITE-SolrCellMorphlineTest-seed#[A32141060A4CE5F9]-worker] core.SolrResourceLoader (SolrResourceLoader.java:addToClassLoader(170)) - Can't find (or read) directory to add to classloader: ../../../dist/ (resolved as: /mnt/ssd/jenkins/workspace/Lucene-Solr-trunk-Linux/solr/contrib/map-reduce/src/test-files/solr/collection1/../../../dist).
   [junit4]   1> 2014-01-30 13:44:25,516 WARN  [SUITE-SolrCellMorphlineTest-seed#[A32141060A4CE5F9]-worker] core.SolrResourceLoader (SolrResourceLoader.java:addToClassLoader(170)) - Can't find (or read) directory to add to classloader: ../../../contrib/velocity/lib (resolved as: /mnt/ssd/jenkins/workspace/Lucene-Solr-trunk-Linux/solr/contrib/map-reduce/src/test-files/solr/collection1/../../../contrib/velocity/lib).
   [junit4]   1> 2014-01-30 13:44:25,516 WARN  [SUITE-SolrCellMorphlineTest-seed#[A32141060A4CE5F9]-worker] core.SolrResourceLoader (SolrResourceLoader.java:addToClassLoader(170)) - Can't find (or read) directory to add to classloader: ../../../dist/ (resolved as: /mnt/ssd/jenkins/workspace/Lucene-Solr-trunk-Linux/solr/contrib/map-reduce/src/test-files/solr/collection1/../../../dist).
   [junit4]   1> 2014-01-30 13:44:25,517 WARN  [SUITE-SolrCellMorphlineTest-seed#[A32141060A4CE5F9]-worker] core.SolrResourceLoader (SolrResourceLoader.java:addToClassLoader(170)) - Can't find (or read) directory to add to classloader: /non/existent/dir/yields/warning (resolved as: /non/existent/dir/yields/warning).
   [junit4]   1> 2014-01-30 13:44:25,570 INFO  [SUITE-SolrCellMorphlineTest-seed#[A32141060A4CE5F9]-worker] core.SolrConfig (SolrConfig.java:<init>(170)) - Using Lucene MatchVersion: LUCENE_43
   [junit4]   1> 2014-01-30 13:44:25,704 INFO  [SUITE-SolrCellMorphlineTest-seed#[A32141060A4CE5F9]-worker] core.Config (SolrConfig.java:<init>(288)) - Loaded SolrConfig: /mnt/ssd/jenkins/workspace/Lucene-Solr-trunk-Linux/solr/contrib/map-reduce/src/test-files/solr/collection1/conf/solrconfig.xml
   [junit4]   1> 2014-01-30 13:44:25,712 INFO  [SUITE-SolrCellMorphlineTest-seed#[A32141060A4CE5F9]-worker] schema.IndexSchema (IndexSchema.java:readSchema(426)) - Reading Solr Schema from /mnt/ssd/jenkins/workspace/Lucene-Solr-trunk-Linux/solr/contrib/map-reduce/src/test-files/solr/collection1/conf/schema.xml
   [junit4]   1> 2014-01-30 13:44:25,752 INFO  [SUITE-SolrCellMorphlineTest-seed#[A32141060A4CE5F9]-worker] schema.IndexSchema (IndexSchema.java:readSchema(454)) - [null] Schema name=example
   [junit4]   1> 2014-01-30 13:44:26,451 INFO  [SUITE-SolrCellMorphlineTest-seed#[A32141060A4CE5F9]-worker] schema.IndexSchema (IndexSchema.java:readSchema(552)) - unique key field: id
   [junit4]   1> 2014-01-30 13:44:26,605 INFO  [SUITE-SolrCellMorphlineTest-seed#[A32141060A4CE5F9]-worker] schema.FileExchangeRateProvider (CurrencyField.java:reload(781)) - Reloading exchange rates from file currency.xml
   [junit4]   1> 2014-01-30 13:44:26,613 INFO  [SUITE-SolrCellMorphlineTest-seed#[A32141060A4CE5F9]-worker] schema.FileExchangeRateProvider (CurrencyField.java:reload(781)) - Reloading exchange rates from file currency.xml
   [junit4]   1> 2014-01-30 13:44:26,697 INFO  [SUITE-SolrCellMorphlineTest-seed#[A32141060A4CE5F9]-worker] core.SolrResourceLoader (SolrResourceLoader.java:locateSolrHome(711)) - JNDI not configured for solr (NoInitialContextEx)
   [junit4]   1> 2014-01-30 13:44:26,697 INFO  [SUITE-SolrCellMorphlineTest-seed#[A32141060A4CE5F9]-worker] core.SolrResourceLoader (SolrResourceLoader.java:locateSolrHome(723)) - using system property solr.solr.home: /mnt/ssd/jenkins/workspace/Lucene-Solr-trunk-Linux/solr/contrib/map-reduce/src/test-files/solr
   [junit4]   1> 2014-01-30 13:44:26,698 INFO  [SUITE-SolrCellMorphlineTest-seed#[A32141060A4CE5F9]-worker] core.SolrResourceLoader (SolrResourceLoader.java:<init>(116)) - new SolrResourceLoader for directory: '/mnt/ssd/jenkins/workspace/Lucene-Solr-trunk-Linux/solr/contrib/map-reduce/src/test-files/solr/'
   [junit4]   1> 2014-01-30 13:44:26,729 INFO  [SUITE-SolrCellMorphlineTest-seed#[A32141060A4CE5F9]-worker] core.SolrResourceLoader (SolrResourceLoader.java:locateSolrHome(711)) - JNDI not configured for solr (NoInitialContextEx)
   [junit4]   1> 2014-01-30 13:44:26,730 INFO  [SUITE-SolrCellMorphlineTest-seed#[A32141060A4CE5F9]-worker] core.SolrResourceLoader (SolrResourceLoader.java:locateSolrHome(723)) - using system property solr.solr.home: /mnt/ssd/jenkins/workspace/Lucene-Solr-trunk-Linux/solr/contrib/map-reduce/src/test-files/solr
   [junit4]   1> 2014-01-30 13:44:26,730 INFO  [SUITE-SolrCellMorphlineTest-seed#[A32141060A4CE5F9]-worker] core.SolrResourceLoader (SolrResourceLoader.java:<init>(112)) - new SolrResourceLoader for deduced Solr Home: '/mnt/ssd/jenkins/workspace/Lucene-Solr-trunk-Linux/solr/contrib/map-reduce/src/test-files/solr/'
   [junit4]   1> 2014-01-30 13:44:26,815 INFO  [SUITE-SolrCellMorphlineTest-seed#[A32141060A4CE5F9]-worker] core.CoreContainer (CoreContainer.java:<init>(107)) - New CoreContainer 18117062
   [junit4]   1> 2014-01-30 13:44:26,816 INFO  [SUITE-SolrCellMorphlineTest-seed#[A32141060A4CE5F9]-worker] core.CoreContainer (CoreContainer.java:load(187)) - Loading cores into CoreContainer [instanceDir=/mnt/ssd/jenkins/workspace/Lucene-Solr-trunk-Linux/solr/contrib/map-reduce/src/test-files/solr/]
   [junit4]   1> 2014-01-30 13:44:26,833 INFO  [SUITE-SolrCellMorphlineTest-seed#[A32141060A4CE5F9]-worker] component.HttpShardHandlerFactory (HttpShardHandlerFactory.java:getParameter(169)) - Setting socketTimeout to: 0
   [junit4]   1> 2014-01-30 13:44:26,833 INFO  [SUITE-SolrCellMorphlineTest-seed#[A32141060A4CE5F9]-worker] component.HttpShardHandlerFactory (HttpShardHandlerFactory.java:getParameter(169)) - Setting urlScheme to: http://
   [junit4]   1> 2014-01-30 13:44:26,834 INFO  [SUITE-SolrCellMorphlineTest-seed#[A32141060A4CE5F9]-worker] component.HttpShardHandlerFactory (HttpShardHandlerFactory.java:getParameter(169)) - Setting connTimeout to: 0
   [junit4]   1> 2014-01-30 13:44:26,834 INFO  [SUITE-SolrCellMorphlineTest-seed#[A32141060A4CE5F9]-worker] component.HttpShardHandlerFactory (HttpShardHandlerFactory.java:getParameter(169)) - Setting maxConnectionsPerHost to: 20
   [junit4]   1> 2014-01-30 13:44:26,835 INFO  [SUITE-SolrCellMorphlineTest-seed#[A32141060A4CE5F9]-worker] component.HttpShardHandlerFactory (HttpShardHandlerFactory.java:getParameter(169)) - Setting corePoolSize to: 0
   [junit4]   1> 2014-01-30 13:44:26,835 INFO  [SUITE-SolrCellMorphlineTest-seed#[A32141060A4CE5F9]-worker] component.HttpShardHandlerFactory (HttpShardHandlerFactory.java:getParameter(169)) - Setting maximumPoolSize to: 2147483647
   [junit4]   1> 2014-01-30 13:44:26,835 INFO  [SUITE-SolrCellMorphlineTest-seed#[A32141060A4CE5F9]-worker] component.HttpShardHandlerFactory (HttpShardHandlerFactory.java:getParameter(169)) - Setting maxThreadIdleTime to: 5
   [junit4]   1> 2014-01-30 13:44:26,836 INFO  [SUITE-SolrCellMorphlineTest-seed#[A32141060A4CE5F9]-worker] component.HttpShardHandlerFactory (HttpShardHandlerFactory.java:getParameter(169)) - Setting sizeOfQueue to: -1
   [junit4]   1> 2014-01-30 13:44:26,836 INFO  [SUITE-SolrCellMorphlineTest-seed#[A32141060A4CE5F9]-worker] component.HttpShardHandlerFactory (HttpShardHandlerFactory.java:getParameter(169)) - Setting fairnessPolicy to: false
   [junit4]   1> 2014-01-30 13:44:27,095 INFO  [SUITE-SolrCellMorphlineTest-seed#[A32141060A4CE5F9]-worker] logging.LogWatcher (LogWatcher.java:createWatcher(153)) - SLF4J impl is org.slf4j.impl.Log4jLoggerFactory
   [junit4]   1> 2014-01-30 13:44:27,097 INFO  [SUITE-SolrCellMorphlineTest-seed#[A32141060A4CE5F9]-worker] logging.LogWatcher (LogWatcher.java:newRegisteredLogWatcher(138)) - Registering Log Listener [Log4j (org.slf4j.impl.Log4jLoggerFactory)]
   [junit4]   1> 2014-01-30 13:44:27,100 INFO  [SUITE-SolrCellMorphlineTest-seed#[A32141060A4CE5F9]-worker] core.CoreContainer (CoreContainer.java:load(213)) - Host Name: 
   [junit4]   1> 2014-01-30 13:44:27,203 INFO  [coreLoadExecutor-4-thread-1] core.CoreContainer (CoreContainer.java:create(589)) - Creating SolrCore 'collection1' using instanceDir: /mnt/ssd/jenkins/workspace/Lucene-Solr-trunk-Linux/solr/contrib/map-reduce/src/test-files/solr/collection1
   [junit4]   1> 2014-01-30 13:44:27,203 INFO  [coreLoadExecutor-4-thread-1] core.SolrResourceLoader (SolrResourceLoader.java:<init>(116)) - new SolrResourceLoader for directory: '/mnt/ssd/jenkins/workspace/Lucene-Solr-trunk-Linux/solr/contrib/map-reduce/src/test-files/solr/collection1/'
   [junit4]   1> 2014-01-30 13:44:27,247 INFO  [coreLoadExecutor-4-thread-1] core.SolrConfig (SolrConfig.java:initLibs(529)) - Adding specified lib dirs to ClassLoader
   [junit4]   1> 2014-01-30 13:44:27,248 WARN  [coreLoadExecutor-4-thread-1] core.SolrResourceLoader (SolrResourceLoader.java:addToClassLoader(170)) - Can't find (or read) directory to add to classloader: ../../../contrib/extraction/lib (resolved as: /mnt/ssd/jenkins/workspace/Lucene-Solr-trunk-Linux/solr/contrib/map-reduce/src/test-files/solr/collection1/../../../contrib/extraction/lib).
   [junit4]   1> 2014-01-30 13:44:27,248 WARN  [coreLoadExecutor-4-thread-1] core.SolrResourceLoader (SolrResourceLoader.java:addToClassLoader(170)) - Can't find (or read) directory to add to classloader: ../../../dist/ (resolved as: /mnt/ssd/jenkins/workspace/Lucene-Solr-trunk-Linux/solr/contrib/map-reduce/src/test-files/solr/collection1/../../../dist).
   [junit4]   1> 2014-01-30 13:44:27,249 WARN  [coreLoadExecutor-4-thread-1] core.SolrResourceLoader (SolrResourceLoader.java:addToClassLoader(170)) - Can't find (or read) directory to add to classloader: ../../../contrib/clustering/lib/ (resolved as: /mnt/ssd/jenkins/workspace/Lucene-Solr-trunk-Linux/solr/contrib/map-reduce/src/test-files/solr/collection1/../../../contrib/clustering/lib).
   [junit4]   1> 2014-01-30 13:44:27,249 WARN  [coreLoadExecutor-4-thread-1] core.SolrResourceLoader (SolrResourceLoader.java:addToClassLoader(170)) - Can't find (or read) directory to add to classloader: ../../../dist/ (resolved as: /mnt/ssd/jenkins/workspace/Lucene-Solr-trunk-Linux/solr/contrib/map-reduce/src/test-files/solr/collection1/../../../dist).
   [junit4]   1> 2014-01-30 13:44:27,250 WARN  [coreLoadExecutor-4-thread-1] core.SolrResourceLoader (SolrResourceLoader.java:addToClassLoader(170)) - Can't find (or read) directory to add to classloader: ../../../contrib/langid/lib/ (resolved as: /mnt/ssd/jenkins/workspace/Lucene-Solr-trunk-Linux/solr/contrib/map-reduce/src/test-files/solr/collection1/../../../contrib/langid/lib).
   [junit4]   1> 2014-01-30 13:44:27,250 WARN  [coreLoadExecutor-4-thread-1] core.SolrResourceLoader (SolrResourceLoader.java:addToClassLoader(170)) - Can't find (or read) directory to add to classloader: ../../../dist/ (resolved as: /mnt/ssd/jenkins/workspace/Lucene-Solr-trunk-Linux/solr/contrib/map-reduce/src/test-files/solr/collection1/../../../dist).
   [junit4]   1> 2014-01-30 13:44:27,250 WARN  [coreLoadExecutor-4-thread-1] core.SolrResourceLoader (SolrResourceLoader.java:addToClassLoader(170)) - Can't find (or read) directory to add to classloader: ../../../contrib/velocity/lib (resolved as: /mnt/ssd/jenkins/workspace/Lucene-Solr-trunk-Linux/solr/contrib/map-reduce/src/test-files/solr/collection1/../../../contrib/velocity/lib).
   [junit4]   1> 2014-01-30 13:44:27,251 WARN  [coreLoadExecutor-4-thread-1] core.SolrResourceLoader (SolrResourceLoader.java:addToClassLoader(170)) - Can't find (or read) directory to add to classloader: ../../../dist/ (resolved as: /mnt/ssd/jenkins/workspace/Lucene-Solr-trunk-Linux/solr/contrib/map-reduce/src/test-files/solr/collection1/../../../dist).
   [junit4]   1> 2014-01-30 13:44:27,251 WARN  [coreLoadExecutor-4-thread-1] core.SolrResourceLoader (SolrResourceLoader.java:addToClassLoader(170)) - Can't find (or read) directory to add to classloader: /non/existent/dir/yields/warning (resolved as: /non/existent/dir/yields/warning).
   [junit4]   1> 2014-01-30 13:44:27,286 INFO  [coreLoadExecutor-4-thread-1] core.SolrConfig (SolrConfig.java:<init>(170)) - Using Lucene MatchVersion: LUCENE_43
   [junit4]   1> 2014-01-30 13:44:27,357 INFO  [coreLoadExecutor-4-thread-1] core.Config (SolrConfig.java:<init>(288)) - Loaded SolrConfig: /mnt/ssd/jenkins/workspace/Lucene-Solr-trunk-Linux/solr/contrib/map-reduce/src/test-files/solr/collection1/conf/solrconfig.xml
   [junit4]   1> 2014-01-30 13:44:27,358 INFO  [coreLoadExecutor-4-thread-1] schema.IndexSchema (IndexSchema.java:readSchema(426)) - Reading Solr Schema from /mnt/ssd/jenkins/workspace/Lucene-Solr-trunk-Linux/solr/contrib/map-reduce/src/test-files/solr/collection1/conf/schema.xml
   [junit4]   1> 2014-01-30 13:44:27,374 INFO  [coreLoadExecutor-4-thread-1] schema.IndexSchema (IndexSchema.java:readSchema(454)) - [collection1] Schema name=example
   [junit4]   1> 2014-01-30 13:44:27,775 INFO  [coreLoadExecutor-4-thread-1] schema.IndexSchema (IndexSchema.java:readSchema(552)) - unique key field: id
   [junit4]   1> 2014-01-30 13:44:27,792 INFO  [coreLoadExecutor-4-thread-1] schema.FileExchangeRateProvider (CurrencyField.java:reload(781)) - Reloading exchange rates from file currency.xml
   [junit4]   1> 2014-01-30 13:44:27,797 INFO  [coreLoadExecutor-4-thread-1] schema.FileExchangeRateProvider (CurrencyField.java:reload(781)) - Reloading exchange rates from file currency.xml
   [junit4]   1> 2014-01-30 13:44:27,844 INFO  [coreLoadExecutor-4-thread-1] core.SolrCore (SolrCore.java:initDirectoryFactory(440)) - org.apache.solr.core.MockDirectoryFactory
   [junit4]   1> 2014-01-30 13:44:27,852 INFO  [coreLoadExecutor-4-thread-1] core.SolrCore (SolrCore.java:<init>(690)) - [collection1] Opening new SolrCore at /mnt/ssd/jenkins/workspace/Lucene-Solr-trunk-Linux/solr/contrib/map-reduce/src/test-files/solr/collection1/, dataDir=/mnt/ssd/jenkins/workspace/Lucene-Solr-trunk-Linux/solr/build/contrib/solr-morphlines-cell/test/J0/./solrtest-SolrCellMorphlineTest-1391089464982/
   [junit4]   1> 2014-01-30 13:44:27,854 INFO  [coreLoadExecutor-4-thread-1] core.JmxMonitoredMap (JmxMonitoredMap.java:<init>(85)) - No JMX servers found, not exposing Solr information with JMX.
   [junit4]   1> 2014-01-30 13:44:27,865 INFO  [coreLoadExecutor-4-thread-1] core.SolrCore (SolrCore.java:initListeners(355)) - [collection1] Added SolrEventListener for newSearcher: org.apache.solr.core.QuerySenderListener{queries=[]}
   [junit4]   1> 2014-01-30 13:44:27,865 INFO  [coreLoadExecutor-4-thread-1] core.SolrCore (SolrCore.java:initListeners(351)) - [collection1] Added SolrEventListener for firstSearcher: org.apache.solr.core.QuerySenderListener{queries=[{q=static firstSearcher warming in solrconfig.xml}]}
   [junit4]   1> 2014-01-30 13:44:27,893 INFO  [coreLoadExecutor-4-thread-1] core.CachingDirectoryFactory (CachingDirectoryFactory.java:get(360)) - return new directory for /mnt/ssd/jenkins/workspace/Lucene-Solr-trunk-Linux/solr/build/contrib/solr-morphlines-cell/test/J0/./solrtest-SolrCellMorphlineTest-1391089464982
   [junit4]   1> 2014-01-30 13:44:27,893 INFO  [coreLoadExecutor-4-thread-1] core.SolrCore (SolrCore.java:getNewIndexDir(285)) - New index directory detected: old=null new=/mnt/ssd/jenkins/workspace/Lucene-Solr-trunk-Linux/solr/build/contrib/solr-morphlines-cell/test/J0/./solrtest-SolrCellMorphlineTest-1391089464982/index/
   [junit4]   1> 2014-01-30 13:44:27,893 WARN  [coreLoadExecutor-4-thread-1] core.SolrCore (SolrCore.java:initIndex(506)) - [collection1] Solr index directory '/mnt/ssd/jenkins/workspace/Lucene-Solr-trunk-Linux/solr/build/contrib/solr-morphlines-cell/test/J0/./solrtest-SolrCellMorphlineTest-1391089464982/index' doesn't exist. Creating new index...
   [junit4]   1> 2014-01-30 13:44:27,903 INFO  [coreLoadExecutor-4-thread-1] core.CachingDirectoryFactory (CachingDirectoryFactory.java:get(360)) - return new directory for /mnt/ssd/jenkins/workspace/Lucene-Solr-trunk-Linux/solr/build/contrib/solr-morphlines-cell/test/J0/./solrtest-SolrCellMorphlineTest-1391089464982/index
   [junit4]   1> 2014-01-30 13:44:27,944 INFO  [coreLoadExecutor-4-thread-1] core.SolrCore (SolrDeletionPolicy.java:onCommit(98)) - SolrDeletionPolicy.onCommit: commits: num=1
   [junit4]   1> 	commit{dir=MockDirectoryWrapper(org.apache.lucene.store.RAMDirectory@35210f lockFactory=org.apache.lucene.store.NativeFSLockFactory@12bb98c),segFN=segments_1,generation=1}
   [junit4]   1> 2014-01-30 13:44:27,946 INFO  [coreLoadExecutor-4-thread-1] core.SolrCore (SolrDeletionPolicy.java:updateCommits(165)) - newest commit generation = 1
   [junit4]   1> 2014-01-30 13:44:27,954 INFO  [coreLoadExecutor-4-thread-1] core.SolrCore (SolrCore.java:initWriters(2035)) - created json: solr.JSONResponseWriter
   [junit4]   1> 2014-01-30 13:44:27,954 INFO  [coreLoadExecutor-4-thread-1] core.SolrCore (SolrCore.java:initWriters(2017)) - adding lazy queryResponseWriter: solr.VelocityResponseWriter
   [junit4]   1> 2014-01-30 13:44:27,955 INFO  [coreLoadExecutor-4-thread-1] core.SolrCore (SolrCore.java:initWriters(2035)) - created velocity: solr.VelocityResponseWriter
   [junit4]   1> 2014-01-30 13:44:27,964 INFO  [coreLoadExecutor-4-thread-1] core.SolrCore (SolrCore.java:initWriters(2035)) - created xslt: solr.XSLTResponseWriter
   [junit4]   1> 2014-01-30 13:44:27,965 INFO  [coreLoadExecutor-4-thread-1] response.XSLTResponseWriter (XSLTResponseWriter.java:init(63)) - xsltCacheLifetimeSeconds=5
   [junit4]   1> 2014-01-30 13:44:28,195 INFO  [coreLoadExecutor-4-thread-1] core.SolrCore (SolrCore.java:loadUpdateProcessorChains(929)) - no updateRequestProcessorChain defined as default, creating implicit default
   [junit4]   1> 2014-01-30 13:44:28,217 INFO  [coreLoadExecutor-4-thread-1] core.RequestHandlers (RequestHandlers.java:initHandlersFromConfig(165)) - created /select: solr.SearchHandler
   [junit4]   1> 2014-01-30 13:44:28,218 INFO  [coreLoadExecutor-4-thread-1] core.RequestHandlers (RequestHandlers.java:initHandlersFromConfig(165)) - created /query: solr.SearchHandler
   [junit4]   1> 2014-01-30 13:44:28,223 INFO  [coreLoadExecutor-4-thread-1] core.RequestHandlers (RequestHandlers.java:initHandlersFromConfig(165)) - created /get: solr.RealTimeGetHandler
   [junit4]   1> 2014-01-30 13:44:28,223 INFO  [coreLoadExecutor-4-thread-1] core.RequestHandlers (RequestHandlers.java:initHandlersFromConfig(165)) - created /browse: solr.SearchHandler
   [junit4]   1> 2014-01-30 13:44:28,230 INFO  [coreLoadExecutor-4-thread-1] core.RequestHandlers (RequestHandlers.java:initHandlersFromConfig(165)) - created /update: solr.UpdateRequestHandler
   [junit4]   1> 2014-01-30 13:44:28,234 WARN  [coreLoadExecutor-4-thread-1] core.SolrResourceLoader (SolrResourceLoader.java:findClass(486)) - Solr loaded a deprecated plugin/analysis class [solr.JsonUpdateRequestHandler]. Please consult documentation how to replace it accordingly.
   [junit4]   1> 2014-01-30 13:44:28,235 INFO  [coreLoadExecutor-4-thread-1] core.RequestHandlers (RequestHandlers.java:initHandlersFromConfig(165)) - created /update/json: solr.JsonUpdateRequestHandler
   [junit4]   1> 2014-01-30 13:44:28,239 WARN  [coreLoadExecutor-4-thread-1] core.SolrResourceLoader (SolrResourceLoader.java:findClass(486)) - Solr loaded a deprecated plugin/analysis class [solr.CSVRequestHandler]. Please consult documentation how to replace it accordingly.
   [junit4]   1> 2014-01-30 13:44:28,240 INFO  [coreLoadExecutor-4-thread-1] core.RequestHandlers (RequestHandlers.java:initHandlersFromConfig(165)) - created /update/csv: solr.CSVRequestHandler
   [junit4]   1> 2014-01-30 13:44:28,240 INFO  [coreLoadExecutor-4-thread-1] core.RequestHandlers (RequestHandlers.java:initHandlersFromConfig(147)) - adding lazy requestHandler: solr.FieldAnalysisRequestHandler
   [junit4]   1> 2014-01-30 13:44:28,241 INFO  [coreLoadExecutor-4-thread-1] core.RequestHandlers (RequestHandlers.java:initHandlersFromConfig(165)) - created /analysis/field: solr.FieldAnalysisRequestHandler
   [junit4]   1> 2014-01-30 13:44:28,241 INFO  [coreLoadExecutor-4-thread-1] core.RequestHandlers (RequestHandlers.java:initHandlersFromConfig(147)) - adding lazy requestHandler: solr.DocumentAnalysisRequestHandler
   [junit4]   1> 2014-01-30 13:44:28,242 INFO  [coreLoadExecutor-4-thread-1] core.RequestHandlers (RequestHandlers.java:initHandlersFromConfig(165)) - created /analysis/document: solr.DocumentAnalysisRequestHandler
   [junit4]   1> 2014-01-30 13:44:28,247 INFO  [coreLoadExecutor-4-thread-1] core.RequestHandlers (RequestHandlers.java:initHandlersFromConfig(165)) - created /admin/: solr.admin.AdminHandlers
   [junit4]   1> 2014-01-30 13:44:28,252 INFO  [coreLoadExecutor-4-thread-1] core.RequestHandlers (RequestHandlers.java:initHandlersFromConfig(165)) - created /admin/ping: solr.PingRequestHandler
   [junit4]   1> 2014-01-30 13:44:28,256 INFO  [coreLoadExecutor-4-thread-1] core.RequestHandlers (RequestHandlers.java:initHandlersFromConfig(165)) - created /debug/dump: solr.DumpRequestHandler
   [junit4]   1> 2014-01-30 13:44:28,271 INFO  [coreLoadExecutor-4-thread-1] core.RequestHandlers (RequestHandlers.java:initHandlersFromConfig(165)) - created /replication: solr.ReplicationHandler
   [junit4]   1> 2014-01-30 13:44:28,271 INFO  [coreLoadExecutor-4-thread-1] core.RequestHandlers (RequestHandlers.java:initHandlersFromConfig(147)) - adding lazy requestHandler: solr.SearchHandler
   [junit4]   1> 2014-01-30 13:44:28,271 INFO  [coreLoadExecutor-4-thread-1] core.RequestHandlers (RequestHandlers.java:initHandlersFromConfig(165)) - created /spell: solr.SearchHandler
   [junit4]   1> 2014-01-30 13:44:28,272 INFO  [coreLoadExecutor-4-thread-1] core.RequestHandlers (RequestHandlers.java:initHandlersFromConfig(147)) - adding lazy requestHandler: solr.SearchHandler
   [junit4]   1> 2014-01-30 13:44:28,272 INFO  [coreLoadExecutor-4-thread-1] core.RequestHandlers (RequestHandlers.java:initHandlersFromConfig(165)) - created /tvrh: solr.SearchHandler
   [junit4]   1> 2014-01-30 13:44:28,272 INFO  [coreLoadExecutor-4-thread-1] core.RequestHandlers (RequestHandlers.java:initHandlersFromConfig(147)) - adding lazy requestHandler: solr.SearchHandler
   [junit4]   1> 2014-01-30 13:44:28,272 INFO  [coreLoadExecutor-4-thread-1] core.RequestHandlers (RequestHandlers.java:initHandlersFromConfig(165)) - created /terms: solr.SearchHandler
   [junit4]   1> 2014-01-30 13:44:28,273 INFO  [coreLoadExecutor-4-thread-1] core.RequestHandlers (RequestHandlers.java:initHandlersFromConfig(147)) - adding lazy requestHandler: solr.SearchHandler
   [junit4]   1> 2014-01-30 13:44:28,273 INFO  [coreLoadExecutor-4-thread-1] core.RequestHandlers (RequestHandlers.java:initHandlersFromConfig(165)) - created /elevate: solr.SearchHandler
   [junit4]   1> 2014-01-30 13:44:28,305 INFO  [coreLoadExecutor-4-thread-1] loader.XMLLoader (XMLLoader.java:init(111)) - xsltCacheLifetimeSeconds=60
   [junit4]   1> 2014-01-30 13:44:28,311 INFO  [coreLoadExecutor-4-thread-1] loader.XMLLoader (XMLLoader.java:init(111)) - xsltCacheLifetimeSeconds=60
   [junit4]   1> 2014-01-30 13:44:28,313 INFO  [coreLoadExecutor-4-thread-1] loader.XMLLoader (XMLLoader.java:init(111)) - xsltCacheLifetimeSeconds=60
   [junit4]   1> 2014-01-30 13:44:28,338 INFO  [coreLoadExecutor-4-thread-1] core.SolrCore (CommitTracker.java:<init>(83)) - Hard AutoCommit: if uncommited for 60000ms; 
   [junit4]   1> 2014-01-30 13:44:28,338 INFO  [coreLoadExecutor-4-thread-1] core.SolrCore (CommitTracker.java:<init>(83)) - Soft AutoCommit: if uncommited for 1000ms; 
   [junit4]   1> 2014-01-30 13:44:28,341 INFO  [coreLoadExecutor-4-thread-1] core.SolrCore (SolrDeletionPolicy.java:onInit(85)) - SolrDeletionPolicy.onInit: commits: num=1
   [junit4]   1> 	commit{dir=MockDirectoryWrapper(org.apache.lucene.store.RAMDirectory@35210f lockFactory=org.apache.lucene.store.NativeFSLockFactory@12bb98c),segFN=segments_1,generation=1}
   [junit4]   1> 2014-01-30 13:44:28,341 INFO  [coreLoadExecutor-4-thread-1] core.SolrCore (SolrDeletionPolicy.java:updateCommits(165)) - newest commit generation = 1
   [junit4]   1> 2014-01-30 13:44:28,353 INFO  [coreLoadExecutor-4-thread-1] search.SolrIndexSearcher (SolrIndexSearcher.java:<init>(200)) - Opening Searcher@d13409 main
   [junit4]   1> 2014-01-30 13:44:28,362 INFO  [coreLoadExecutor-4-thread-1] component.SpellCheckComponent (SpellCheckComponent.java:inform(619)) - Initializing spell checkers
   [junit4]   1> 2014-01-30 13:44:28,379 INFO  [coreLoadExecutor-4-thread-1] spelling.DirectSolrSpellChecker (DirectSolrSpellChecker.java:init(102)) - init: {name=default,field=name,classname=solr.DirectSolrSpellChecker,distanceMeasure=internal,accuracy=0.5,maxEdits=2,minPrefix=1,maxInspections=5,minQueryLength=4,maxQueryFrequency=0.01}
   [junit4]   1> 2014-01-30 13:44:28,397 INFO  [coreLoadExecutor-4-thread-1] component.SpellCheckComponent (SpellCheckComponent.java:inform(668)) - No queryConverter defined, using default converter
   [junit4]   1> 2014-01-30 13:44:28,401 INFO  [coreLoadExecutor-4-thread-1] component.QueryElevationComponent (QueryElevationComponent.java:inform(222)) - Loading QueryElevation from: /mnt/ssd/jenkins/workspace/Lucene-Solr-trunk-Linux/solr/contrib/map-reduce/src/test-files/solr/collection1/conf/elevate.xml
   [junit4]   1> 2014-01-30 13:44:28,461 INFO  [coreLoadExecutor-4-thread-1] handler.ReplicationHandler (ReplicationHandler.java:inform(965)) - Commits will be reserved for  10000
   [junit4]   1> 2014-01-30 13:44:28,462 INFO  [searcherExecutor-5-thread-1] core.SolrCore (QuerySenderListener.java:newSearcher(44)) - QuerySenderListener sending requests to Searcher@d13409 main{StandardDirectoryReader(segments_1:1:nrt)}
   [junit4]   1> 2014-01-30 13:44:28,463 INFO  [coreLoadExecutor-4-thread-1] core.CoreContainer (CoreContainer.java:registerCore(489)) - registering core: collection1
   [junit4]   1> 2014-01-30 13:44:28,468 INFO  [SUITE-SolrCellMorphlineTest-seed#[A32141060A4CE5F9]-worker] solr.SolrTestCaseJ4 (SolrTestCaseJ4.java:initCore(489)) - ####initCore end
   [junit4]   2> Creating dataDir: /mnt/ssd/jenkins/workspace/Lucene-Solr-trunk-Linux/solr/build/contrib/solr-morphlines-cell/test/J0/./solrtest-SolrCellMorphlineTest-1391089464982
   [junit4]   1> 2014-01-30 13:44:28,489 INFO  [TEST-SolrCellMorphlineTest.testSolrCellDocumentTypes2-seed#[A32141060A4CE5F9]] solr.SolrTestCaseJ4 (SolrTestCaseJ4.java:setUp(238)) - ###Starting testSolrCellDocumentTypes2
   [junit4]   1> 2014-01-30 13:44:28,571 INFO  [searcherExecutor-5-thread-1] core.SolrCore (SolrCore.java:execute(1919)) - [collection1] webapp=null path=null params={q=static+firstSearcher+warming+in+solrconfig.xml&event=firstSearcher&distrib=false} hits=0 status=0 QTime=105 
   [junit4]   1> 2014-01-30 13:44:28,572 INFO  [searcherExecutor-5-thread-1] core.SolrCore (QuerySenderListener.java:newSearcher(91)) - QuerySenderListener done.
   [junit4]   1> 2014-01-30 13:44:28,572 INFO  [searcherExecutor-5-thread-1] component.SpellCheckComponent (SpellCheckComponent.java:newSearcher(709)) - Loading spell index for spellchecker: default
   [junit4]   1> 2014-01-30 13:44:28,573 INFO  [searcherExecutor-5-thread-1] component.SpellCheckComponent (SpellCheckComponent.java:newSearcher(709)) - Loading spell index for spellchecker: wordbreak
   [junit4]   1> 2014-01-30 13:44:28,573 INFO  [searcherExecutor-5-thread-1] core.SolrCore (SolrCore.java:registerSearcher(1867)) - [collection1] Registered new searcher Searcher@d13409 main{StandardDirectoryReader(segments_1:1:nrt)}
   [junit4]   1> 2014-01-30 13:44:28,669 INFO  [TEST-SolrCellMorphlineTest.testSolrCellDocumentTypes2-seed#[A32141060A4CE5F9]] processor.LogUpdateProcessor (LogUpdateProcessorFactory.java:finish(198)) - [collection1] webapp=null path=/update params={} {deleteByQuery=*:* (-1458663030636150784)} 0 149
   [junit4]   1> 2014-01-30 13:44:28,671 INFO  [TEST-SolrCellMorphlineTest.testSolrCellDocumentTypes2-seed#[A32141060A4CE5F9]] update.UpdateHandler (DirectUpdateHandler2.java:commit(521)) - start commit{,optimize=false,openSearcher=true,waitSearcher=true,expungeDeletes=false,softCommit=false,prepareCommit=false}
   [junit4]   1> 2014-01-30 13:44:28,672 INFO  [TEST-SolrCellMorphlineTest.testSolrCellDocumentTypes2-seed#[A32141060A4CE5F9]] update.UpdateHandler (DirectUpdateHandler2.java:commit(561)) - No uncommitted changes. Skipping IW.commit.
   [junit4]   1> 2014-01-30 13:44:28,673 INFO  [TEST-SolrCellMorphlineTest.testSolrCellDocumentTypes2-seed#[A32141060A4CE5F9]] search.SolrIndexSearcher (SolrIndexSearcher.java:<init>(200)) - Opening Searcher@1d858d9 main
   [junit4]   1> 2014-01-30 13:44:28,674 INFO  [searcherExecutor-5-thread-1] core.SolrCore (QuerySenderListener.java:newSearcher(44)) - QuerySenderListener sending requests to Searcher@1d858d9 main{StandardDirectoryReader(segments_1:1:nrt)}
   [junit4]   1> 2014-01-30 13:44:28,675 INFO  [searcherExecutor-5-thread-1] core.SolrCore (QuerySenderListener.java:newSearcher(91)) - QuerySenderListener done.
   [junit4]   1> 2014-01-30 13:44:28,675 INFO  [TEST-SolrCellMorphlineTest.testSolrCellDocumentTypes2-seed#[A32141060A4CE5F9]] update.UpdateHandler (DirectUpdateHandler2.java:commit(612)) - end_commit_flush
   [junit4]   1> 2014-01-30 13:44:28,675 INFO  [searcherExecutor-5-thread-1] core.SolrCore (SolrCore.java:registerSearcher(1867)) - [collection1] Registered new searcher Searcher@1d858d9 main{StandardDirectoryReader(segments_1:1:nrt)}
   [junit4]   1> 2014-01-30 13:44:28,676 INFO  [TEST-SolrCellMorphlineTest.testSolrCellDocumentTypes2-seed#[A32141060A4CE5F9]] processor.LogUpdateProcessor (LogUpdateProcessorFactory.java:finish(198)) - [collection1] webapp=null path=/update params={commit=true&softCommit=false&waitSearcher=true} {commit=} 0 5
   [junit4]   1> 2014-01-30 13:44:28,901 INFO  [TEST-SolrCellMorphlineTest.testSolrCellDocumentTypes2-seed#[A32141060A4CE5F9]] api.MorphlineContext (MorphlineContext.java:importCommandBuilders(75)) - Importing commands
   [junit4]   1> 2014-01-30 13:44:31,569 INFO  [TEST-SolrCellMorphlineTest.testSolrCellDocumentTypes2-seed#[A32141060A4CE5F9]] core.SolrResourceLoader (SolrResourceLoader.java:<init>(116)) - new SolrResourceLoader for directory: '/mnt/ssd/jenkins/workspace/Lucene-Solr-trunk-Linux/solr/contrib/map-reduce/src/test-files/solr/collection1/'
   [junit4]   1> 2014-01-30 13:44:31,601 INFO  [TEST-SolrCellMorphlineTest.testSolrCellDocumentTypes2-seed#[A32141060A4CE5F9]] core.SolrConfig (SolrConfig.java:initLibs(529)) - Adding specified lib dirs to ClassLoader
   [junit4]   1> 2014-01-30 13:44:31,602 WARN  [TEST-SolrCellMorphlineTest.testSolrCellDocumentTypes2-seed#[A32141060A4CE5F9]] core.SolrResourceLoader (SolrResourceLoader.java:addToClassLoader(170)) - Can't find (or read) directory to add to classloader: ../../../contrib/extraction/lib (resolved as: /mnt/ssd/jenkins/workspace/Lucene-Solr-trunk-Linux/solr/contrib/map-reduce/src/test-files/solr/collection1/../../../contrib/extraction/lib).
   [junit4]   1> 2014-01-30 13:44:31,602 WARN  [TEST-SolrCellMorphlineTest.testSolrCellDocumentTypes2-seed#[A32141060A4CE5F9]] core.SolrResourceLoader (SolrResourceLoader.java:addToClassLoader(170)) - Can't find (or read) directory to add to classloader: ../../../dist/ (resolved as: /mnt/ssd/jenkins/workspace/Lucene-Solr-trunk-Linux/solr/contrib/map-reduce/src/test-files/solr/collection1/../../../dist).
   [junit4]   1> 2014-01-30 13:44:31,603 WARN  [TEST-SolrCellMorphlineTest.testSolrCellDocumentTypes2-seed#[A32141060A4CE5F9]] core.SolrResourceLoader (SolrResourceLoader.java:addToClassLoader(170)) - Can't find (or read) directory to add to classloader: ../../../contrib/clustering/lib/ (resolved as: /mnt/ssd/jenkins/workspace/Lucene-Solr-trunk-Linux/solr/contrib/map-reduce/src/test-files/solr/collection1/../../../contrib/clustering/lib).
   [junit4]   1> 2014-01-30 13:44:31,603 WARN  [TEST-SolrCellMorphlineTest.testSolrCellDocumentTypes2-seed#[A32141060A4CE5F9]] core.SolrResourceLoader (SolrResourceLoader.java:addToClassLoader(170)) - Can't find (or read) directory to add to classloader: ../../../dist/ (resolved as: /mnt/ssd/jenkins/workspace/Lucene-Solr-trunk-Linux/solr/contrib/map-reduce/src/test-files/solr/collection1/../../../dist).
   [junit4]   1> 2014-01-30 13:44:31,604 WARN  [TEST-SolrCellMorphlineTest.testSolrCellDocumentTypes2-seed#[A32141060A4CE5F9]] core.SolrResourceLoader (SolrResourceLoader.java:addToClassLoader(170)) - Can't find (or read) directory to add to classloader: ../../../contrib/langid/lib/ (resolved as: /mnt/ssd/jenkins/workspace/Lucene-Solr-trunk-Linux/solr/contrib/map-reduce/src/test-files/solr/collection1/../../../contrib/langid/lib).
   [junit4]   1> 2014-01-30 13:44:31,604 WARN  [TEST-SolrCellMorphlineTest.testSolrCellDocumentTypes2-seed#[A32141060A4CE5F9]] core.SolrResourceLoader (SolrResourceLoader.java:addToClassLoader(170)) - Can't find (or read) directory to add to classloader: ../../../dist/ (resolved as: /mnt/ssd/jenkins/workspace/Lucene-Solr-trunk-Linux/solr/contrib/map-reduce/src/test-files/solr/collection1/../../../dist).
   [junit4]   1> 2014-01-30 13:44:31,604 WARN  [TEST-SolrCellMorphlineTest.testSolrCellDocumentTypes2-seed#[A32141060A4CE5F9]] core.SolrResourceLoader (SolrResourceLoader.java:addToClassLoader(170)) - Can't find (or read) directory to add to classloader: ../../../contrib/velocity/lib (resolved as: /mnt/ssd/jenkins/workspace/Lucene-Solr-trunk-Linux/solr/contrib/map-reduce/src/test-files/solr/collection1/../../../contrib/velocity/lib).
   [junit4]   1> 2014-01-30 13:44:31,605 WARN  [TEST-SolrCellMorphlineTest.testSolrCellDocumentTypes2-seed#[A32141060A4CE5F9]] core.SolrResourceLoader (SolrResourceLoader.java:addToClassLoader(170)) - Can't find (or read) directory to add to classloader: ../../../dist/ (resolved as: /mnt/ssd/jenkins/workspace/Lucene-Solr-trunk-Linux/solr/contrib/map-reduce/src/test-files/solr/collection1/../../../dist).
   [junit4]   1> 2014-01-30 13:44:31,605 WARN  [TEST-SolrCellMorphlineTest.testSolrCellDocumentTypes2-seed#[A32141060A4CE5F9]] core.SolrResourceLoader (SolrResourceLoader.java:addToClassLoader(170)) - Can't find (or read) directory to add to classloader: /non/existent/dir/yields/warning (resolved as: /non/existent/dir/yields/warning).
   [junit4]   1> 2014-01-30 13:44:31,638 INFO  [TEST-SolrCellMorphlineTest.testSolrCellDocumentTypes2-seed#[A32141060A4CE5F9]] core.SolrConfig (SolrConfig.java:<init>(170)) - Using Lucene MatchVersion: LUCENE_43
   [junit4]   1> 2014-01-30 13:44:31,826 INFO  [TEST-SolrCellMorphlineTest.testSolrCellDocumentTypes2-seed#[A32141060A4CE5F9]] core.Config (SolrConfig.java:<init>(288)) - Loaded SolrConfig: solrconfig.xml
   [junit4]   1> 2014-01-30 13:44:31,827 INFO  [TEST-SolrCellMorphlineTest.testSolrCellDocumentTypes2-seed#[A32141060A4CE5F9]] schema.IndexSchema (IndexSchema.java:readSchema(426)) - Reading Solr Schema from schema.xml
   [junit4]   1> 2014-01-30 13:44:31,839 INFO  [TEST-SolrCellMorphlineTest.testSolrCellDocumentTypes2-seed#[A32141060A4CE5F9]] schema.IndexSchema (IndexSchema.java:readSchema(454)) - [null] Schema name=example
   [junit4]   1> 2014-01-30 13:44:32,213 INFO  [TEST-SolrCellMorphlineTest.testSolrCellDocumentTypes2-seed#[A32141060A4CE5F9]] schema.IndexSchema (IndexSchema.java:readSchema(552)) - unique key field: id
   [junit4]   1> 2014-01-30 13:44:32,230 INFO  [TEST-SolrCellMorphlineTest.testSolrCellDocumentTypes2-seed#[A32141060A4CE5F9]] schema.FileExchangeRateProvider (CurrencyField.java:reload(781)) - Reloading exchange rates from file currency.xml
   [junit4]   1> 2014-01-30 13:44:32,234 INFO  [TEST-SolrCellMorphlineTest.testSolrCellDocumentTypes2-seed#[A32141060A4CE5F9]] schema.FileExchangeRateProvider (CurrencyField.java:reload(781)) - Reloading exchange rates from file currency.xml
   [junit4]   1> 2014-01-30 13:44:32,262 INFO  [TEST-SolrCellMorphlineTest.testSolrCellDocumentTypes2-seed#[A32141060A4CE5F9]] core.SolrResourceLoader (SolrResourceLoader.java:<init>(116)) - new SolrResourceLoader for directory: '/mnt/ssd/jenkins/workspace/Lucene-Solr-trunk-Linux/solr/contrib/map-reduce/src/test-files/solr/collection1/'
   [junit4]   1> 2014-01-30 13:44:32,289 INFO  [TEST-SolrCellMorphlineTest.testSolrCellDocumentTypes2-seed#[A32141060A4CE5F9]] core.SolrConfig (SolrConfig.java:initLibs(529)) - Adding specified lib dirs to ClassLoader
   [junit4]   1> 2014-01-30 13:44:32,290 WARN  [TEST-SolrCellMorphlineTest.testSolrCellDocumentTypes2-seed#[A32141060A4CE5F9]] core.SolrResourceLoader (SolrResourceLoader.java:addToClassLoader(170)) - Can't find (or read) directory to add to classloader: ../../../contrib/extraction/lib (resolved as: /mnt/ssd/jenkins/workspace/Lucene-Solr-trunk-Linux/solr/contrib/map-reduce/src/test-files/solr/collection1/../../../contrib/extraction/lib).
   [junit4]   1> 2014-01-30 13:44:32,290 WARN  [TEST-SolrCellMorphlineTest.testSolrCellDocumentTypes2-seed#[A32141060A4CE5F9]] core.SolrResourceLoader (SolrResourceLoader.java:addToClassLoader(170)) - Can't find (or read) directory to add to classloader: ../../../dist/ (resolved as: /mnt/ssd/jenkins/workspace/Lucene-Solr-trunk-Linux/solr/contrib/map-reduce/src/test-files/solr/collection1/../../../dist).
   [junit4]   1> 2014-01-30 13:44:32,291 WARN  [TEST-SolrCellMorphlineTest.testSolrCellDocumentTypes2-seed#[A32141060A4CE5F9]] core.SolrResourceLoader (SolrResourceLoader.java:addToClassLoader(170)) - Can't find (or read) directory to add to classloader: ../../../contrib/clustering/lib/ (resolved as: /mnt/ssd/jenkins/workspace/Lucene-Solr-trunk-Linux/solr/contrib/map-reduce/src/test-files/solr/collection1/../../../contrib/clustering/lib).
   [junit4]   1> 2014-01-30 13:44:32,291 WARN  [TEST-SolrCellMorphlineTest.testSolrCellDocumentTypes2-seed#[A32141060A4CE5F9]] core.SolrResourceLoader (SolrResourceLoader.java:addToClassLoader(170)) - Can't find (or read) directory to add to classloader: ../../../dist/ (resolved as: /mnt/ssd/jenkins/workspace/Lucene-Solr-trunk-Linux/solr/contrib/map-reduce/src/test-files/solr/collection1/../../../dist).
   [junit4]   1> 2014-01-30 13:44:32,292 WARN  [TEST-SolrCellMorphlineTest.testSolrCellDocumentTypes2-seed#[A32141060A4CE5F9]] core.SolrResourceLoader (SolrResourceLoader.java:addToClassLoader(170)) - Can't find (or read) directory to add to classloader: ../../../contrib/langid/lib/ (resolved as: /mnt/ssd/jenkins/workspace/Lucene-Solr-trunk-Linux/solr/contrib/map-reduce/src/test-files/solr/collection1/../../../contrib/langid/lib).
   [junit4]   1> 2014-01-30 13:44:32,292 WARN  [TEST-SolrCellMorphlineTest.testSolrCellDocumentTypes2-seed#[A32141060A4CE5F9]] core.SolrResourceLoader (SolrResourceLoader.java:addToClassLoader(170)) - Can't find (or read) directory to add to classloader: ../../../dist/ (resolved as: /mnt/ssd/jenkins/workspace/Lucene-Solr-trunk-Linux/solr/contrib/map-reduce/src/test-files/solr/collection1/../../../dist).
   [junit4]   1> 2014-01-30 13:44:32,292 WARN  [TEST-SolrCellMorphlineTest.testSolrCellDocumentTypes2-seed#[A32141060A4CE5F9]] core.SolrResourceLoader (SolrResourceLoader.java:addToClassLoader(170)) - Can't find (or read) directory to add to classloader: ../../../contrib/velocity/lib (resolved as: /mnt/ssd/jenkins/workspace/Lucene-Solr-trunk-Linux/solr/contrib/map-reduce/src/test-files/solr/collection1/../../../contrib/velocity/lib).
   [junit4]   1> 2014-01-30 13:44:32,293 WARN  [TEST-SolrCellMorphlineTest.testSolrCellDocumentTypes2-seed#[A32141060A4CE5F9]] core.SolrResourceLoader (SolrResourceLoader.java:addToClassLoader(170)) - Can't find (or read) directory to add to classloader: ../../../dist/ (resolved as: /mnt/ssd/jenkins/workspace/Lucene-Solr-trunk-Linux/solr/contrib/map-reduce/src/test-files/solr/collection1/../../../dist).
   [junit4]   1> 2014-01-30 13:44:32,293 WARN  [TEST-SolrCellMorphlineTest.testSolrCellDocumentTypes2-seed#[A32141060A4CE5F9]] core.SolrResourceLoader (SolrResourceLoader.java:addToClassLoader(170)) - Can't find (or read) directory to add to classloader: /non/existent/dir/yields/warning (resolved as: /non/existent/dir/yields/warning).
   [junit4]   1> 2014-01-30 13:44:32,325 INFO  [TEST-SolrCellMorphlineTest.testSolrCellDocumentTypes2-seed#[A32141060A4CE5F9]] core.SolrConfig (SolrConfig.java:<init>(170)) - Using Lucene MatchVersion: LUCENE_43
   [junit4]   1> 2014-01-30 13:44:32,392 INFO  [TEST-SolrCellMorphlineTest.testSolrCellDocumentTypes2-seed#[A32141060A4CE5F9]] core.Config (SolrConfig.java:<init>(288)) - Loaded SolrConfig: solrconfig.xml
   [junit4]   1> 2014-01-30 13:44:32,393 INFO  [TEST-SolrCellMorphlineTest.testSolrCellDocumentTypes2-seed#[A32141060A4CE5F9]] schema.IndexSchema (IndexSchema.java:readSchema(426)) - Reading Solr Schema from schema.xml
   [junit4]   1> 2014-01-30 13:44:32,404 INFO  [TEST-SolrCellMorphlineTest.testSolrCellDocumentTypes2-seed#[A32141060A4CE5F9]] schema.IndexSchema (IndexSchema.java:readSchema(454)) - [null] Schema name=example
   [junit4]   1> 2014-01-30 13:44:32,763 INFO  [TEST-SolrCellMorphlineTest.testSolrCellDocumentTypes2-seed#[A32141060A4CE5F9]] schema.IndexSchema (IndexSchema.java:readSchema(552)) - unique key field: id
   [junit4]   1> 2014-01-30 13:44:32,777 INFO  [TEST-SolrCellMorphlineTest.testSolrCellDocumentTypes2-seed#[A32141060A4CE5F9]] schema.FileExchangeRateProvider (CurrencyField.java:reload(781)) - Reloading exchange rates from file currency.xml
   [junit4]   1> 2014-01-30 13:44:32,781 INFO  [TEST-SolrCellMorphlineTest.testSolrCellDocumentTypes2-seed#[A32141060A4CE5F9]] schema.FileExchangeRateProvider (CurrencyField.java:reload(781)) - Reloading exchange rates from file currency.xml
   [junit4]   1> 2014-01-30 13:44:33,295 INFO  [TEST-SolrCellMorphlineTest.testSolrCellDocumentTypes2-seed#[A32141060A4CE5F9]] core.SolrResourceLoader (SolrResourceLoader.java:<init>(116)) - new SolrResourceLoader for directory: '/mnt/ssd/jenkins/workspace/Lucene-Solr-trunk-Linux/solr/contrib/map-reduce/src/test-files/solr/collection1/'
   [junit4]   1> 2014-01-30 13:44:33,322 INFO  [TEST-SolrCellMorphlineTest.testSolrCellDocumentTypes2-seed#[A32141060A4CE5F9]] core.SolrConfig (SolrConfig.java:initLibs(529)) - Adding specified lib dirs to ClassLoader
   [junit4]   1> 2014-01-30 13:44:33,323 WARN  [TEST-SolrCellMorphlineTest.testSolrCellDocumentTypes2-seed#[A32141060A4CE5F9]] core.SolrResourceLoader (SolrResourceLoader.java:addToClassLoader(170)) - Can't find (or read) directory to add to classloader: ../../../contrib/extraction/lib (resolved as: /mnt/ssd/jenkins/workspace/Lucene-Solr-trunk-Linux/solr/contrib/map-reduce/src/test-files/solr/collection1/../../../contrib/extraction/lib).
   [junit4]   1> 2014-01-30 13:44:33,323 WARN  [TEST-SolrCellMorphlineTest.testSolrCellDocumentTypes2-seed#[A32141060A4CE5F9]] core.SolrResourceLoader (SolrResourceLoader.java:addToClassLoader(170)) - Can't find (or read) directory to add to classloader: ../../../dist/ (resolved as: /mnt/ssd/jenkins/workspace/Lucene-Solr-trunk-Linux/solr/contrib/map-reduce/src/test-files/solr/collection1/../../../dist).
   [junit4]   1> 2014-01-30 13:44:33,324 WARN  [TEST-SolrCellMorphlineTest.testSolrCellDocumentTypes2-seed#[A32141060A4CE5F9]] core.SolrResourceLoader (SolrResourceLoader.java:addToClassLoader(170)) - Can't find (or read) directory to add to classloader: ../../../contrib/clustering/lib/ (resolved as: /mnt/ssd/jenkins/workspace/Lucene-Solr-trunk-Linux/solr/contrib/map-reduce/src/test-files/solr/collection1/../../../contrib/clustering/lib).
   [junit4]   1> 2014-01-30 13:44:33,324 WARN  [TEST-SolrCellMorphlineTest.testSolrCellDocumentTypes2-seed#[A32141060A4CE5F9]] core.SolrResourceLoader (SolrResourceLoader.java:addToClassLoader(170)) - Can't find (or read) directory to add to classloader: ../../../dist/ (resolved as: /mnt/ssd/jenkins/workspace/Lucene-Solr-trunk-Linux/solr/contrib/map-reduce/src/test-files/solr/collection1/../../../dist).
   [junit4]   1> 2014-01-30 13:44:33,325 WARN  [TEST-SolrCellMorphlineTest.testSolrCellDocumentTypes2-seed#[A32141060A4CE5F9]] core.SolrResourceLoader (SolrResourceLoader.java:addToClassLoader(170)) - Can't find (or read) directory to add to classloader: ../../../contrib/langid/lib/ (resolved as: /mnt/ssd/jenkins/workspace/Lucene-Solr-trunk-Linux/solr/contrib/map-reduce/src/test-files/solr/collection1/../../../contrib/langid/lib).
   [junit4]   1> 2014-01-30 13:44:33,325 WARN  [TEST-SolrCellMorphlineTest.testSolrCellDocumentTypes2-seed#[A32141060A4CE5F9]] core.SolrResourceLoader (SolrResourceLoader.java:addToClassLoader(170)) - Can't find (or read) directory to add to classloader: ../../../dist/ (resolved as: /mnt/ssd/jenkins/workspace/Lucene-Solr-trunk-Linux/solr/contrib/map-reduce/src/test-files/solr/collection1/../../../dist).
   [junit4]   1> 2014-01-30 13:44:33,326 WARN  [TEST-SolrCellMorphlineTest.testSolrCellDocumentTypes2-seed#[A32141060A4CE5F9]] core.SolrResourceLoader (SolrResourceLoader.java:addToClassLoader(170)) - Can't find (or read) directory to add to classloader: ../../../contrib/velocity/lib (resolved as: /mnt/ssd/jenkins/workspace/Lucene-Solr-trunk-Linux/solr/contrib/map-reduce/src/test-files/solr/collection1/../../../contrib/velocity/lib).
   [junit4]   1> 2014-01-30 13:44:33,326 WARN  [TEST-SolrCellMorphlineTest.testSolrCellDocumentTypes2-seed#[A32141060A4CE5F9]] core.SolrResourceLoader (SolrResourceLoader.java:addToClassLoader(170)) - Can't find (or read) directory to add to classloader: ../../../dist/ (resolved as: /mnt/ssd/jenkins/workspace/Lucene-Solr-trunk-Linux/solr/contrib/map-reduce/src/test-files/solr/collection1/../../../dist).
   [junit4]   1> 2014-01-30 13:44:33,327 WARN  [TEST-SolrCellMorphlineTest.testSolrCellDocumentTypes2-seed#[A32141060A4CE5F9]] core.SolrResourceLoader (SolrResourceLoader.java:addToClassLoader(170)) - Can't find (or read) directory to add to classloader: /non/existent/dir/yields/warning (resolved as: /non/existent/dir/yields/warning).
   [junit4]   1> 2014-01-30 13:44:33,359 INFO  [TEST-SolrCellMorphlineTest.testSolrCellDocumentTypes2-seed#[A32141060A4CE5F9]] core.SolrConfig (SolrConfig.java:<init>(170)) - Using Lucene MatchVersion: LUCENE_43
   [junit4]   1> 2014-01-30 13:44:33,418 INFO  [TEST-SolrCellMorphlineTest.testSolrCellDocumentTypes2-seed#[A32141060A4CE5F9]] core.Config (SolrConfig.java:<init>(288)) - Loaded SolrConfig: solrconfig.xml
   [junit4]   1> 2014-01-30 13:44:33,419 INFO  [TEST-SolrCellMorphlineTest.testSolrCellDocumentTypes2-seed#[A32141060A4CE5F9]] schema.IndexSchema (IndexSchema.java:readSchema(426)) - Reading Solr Schema from schema.xml
   [junit4]   1> 2014-01-30 13:44:33,428 INFO  [TEST-SolrCellMorphlineTest.testSolrCellDocumentTypes2-seed#[A32141060A4CE5F9]] schema.IndexSchema (IndexSchema.java:readSchema(454)) - [null] Schema name=example
   [junit4]   1> 2014-01-30 13:44:33,788 INFO  [TEST-SolrCellMorphlineTest.testSolrCellDocumentTypes2-seed#[A32141060A4CE5F9]] schema.IndexSchema (IndexSchema.java:readSchema(552)) - unique key field: id
   [junit4]   1> 2014-01-30 13:44:33,799 INFO  [TEST-SolrCellMorphlineTest.testSolrCellDocumentTypes2-seed#[A32141060A4CE5F9]] schema.FileExchangeRateProvider (CurrencyField.java:reload(781)) - Reloading exchange rates from file currency.xml
   [junit4]   1> 2014-01-30 13:44:33,804 INFO  [TEST-SolrCellMorphlineTest.testSolrCellDocumentTypes2-seed#[A32141060A4CE5F9]] schema.FileExchangeRateProvider (CurrencyField.java:reload(781)) - Reloading exchange rates from file currency.xml
   [junit4]   1> 2014-01-30 13:44:33,833 INFO  [TEST-SolrCellMorphlineTest.testSolrCellDocumentTypes2-seed#[A32141060A4CE5F9]] core.SolrResourceLoader (SolrResourceLoader.java:<init>(116)) - new SolrResourceLoader for directory: '/mnt/ssd/jenkins/workspace/Lucene-Solr-trunk-Linux/solr/contrib/map-reduce/src/test-files/solr/collection1/'
   [junit4]   1> 2014-01-30 13:44:33,863 INFO  [TEST-SolrCellMorphlineTest.testSolrCellDocumentTypes2-seed#[A32141060A4CE5F9]] core.SolrConfig (SolrConfig.java:initLibs(529)) - Adding specified lib dirs to ClassLoader
   [junit4]   1> 2014-01-30 13:44:33,864 WARN  [TEST-SolrCellMorphlineTest.testSolrCellDocumentTypes2-seed#[A32141060A4CE5F9]] core.SolrResourceLoader (SolrResourceLoader.java:addToClassLoader(170)) - Can't find (or read) directory to add to classloader: ../../../contrib/extraction/lib (resolved as: /mnt/ssd/jenkins/workspace/Lucene-Solr-trunk-Linux/solr/contrib/map-reduce/src/test-files/solr/collection1/../../../contrib/extraction/lib).
   [junit4]   1> 2014-01-30 13:44:33,865 WARN  [TEST-SolrCellMorphlineTest.testSolrCellDocumentTypes2-seed#[A32141060A4CE5F9]] core.SolrResourceLoader (SolrResourceLoader.java:addToClassLoader(170)) - Can't find (or read) directory to add to classloader: ../../../dist/ (resolved as: /mnt/ssd/jenkins/workspace/Lucene-Solr-trunk-Linux/solr/contrib/map-reduce/src/test-files/solr/collection1/../../../dist).
   [junit4]   1> 2014-01-30 13:44:33,865 WARN  [TEST-SolrCellMorphlineTest.testSolrCellDocumentTypes2-seed#[A32141060A4CE5F9]] core.SolrResourceLoader (SolrResourceLoader.java:addToClassLoader(170)) - Can't find (or read) directory to add to classloader: ../../../contrib/clustering/lib/ (resolved as: /mnt/ssd/jenkins/workspace/Lucene-Solr-trunk-Linux/solr/contrib/map-reduce/src/test-files/solr/collection1/../../../contrib/clustering/lib).
   [junit4]   1> 2014-01-30 13:44:33,866 WARN  [TEST-SolrCellMorphlineTest.testSolrCellDocumentTypes2-seed#[A32141060A4CE5F9]] core.SolrResourceLoader (SolrResourceLoader.java:addToClassLoader(170)) - Can't find (or read) directory to add to classloader: ../../../dist/ (resolved as: /mnt/ssd/jenkins/workspace/Lucene-Solr-trunk-Linux/solr/contrib/map-reduce/src/test-files/solr/collection1/../../../dist).
   [junit4]   1> 2014-01-30 13:44:33,866 WARN  [TEST-SolrCellMorphlineTest.testSolrCellDocumentTypes2-seed#[A32141060A4CE5F9]] core.SolrResourceLoader (SolrResourceLoader.java:addToClassLoader(170)) - Can't find (or read) directory to add to classloader: ../../../contrib/langid/lib/ (resolved as: /mnt/ssd/jenkins/workspace/Lucene-Solr-trunk-Linux/solr/contrib/map-reduce/src/test-files/solr/collection1/../../../contrib/langid/lib).
   [junit4]   1> 2014-01-30 13:44:33,866 WARN  [TEST-SolrCellMorphlineTest.testSolrCellDocumentTypes2-seed#[A32141060A4CE5F9]] core.SolrResourceLoader (SolrResourceLoader.java:addToClassLoader(170)) - Can't find (or read) directory to add to classloader: ../../../dist/ (resolved as: /mnt/ssd/jenkins/workspace/Lucene-Solr-trunk-Linux/solr/contrib/map-reduce/src/test-files/solr/collection1/../../../dist).
   [junit4]   1> 2014-01-30 13:44:33,867 WARN  [TEST-SolrCellMorphlineTest.testSolrCellDocumentTypes2-seed#[A32141060A4CE5F9]] core.SolrResourceLoader (SolrResourceLoader.java:addToClassLoader(170)) - Can't find (or read) directory to add to classloader: ../../../contrib/velocity/lib (resolved as: /mnt/ssd/jenkins/workspace/Lucene-Solr-trunk-Linux/solr/contrib/map-reduce/src/test-files/solr/collection1/../../../contrib/velocity/lib).
   [junit4]   1> 2014-01-30 13:44:33,867 WARN  [TEST-SolrCellMorphlineTest.testSolrCellDocumentTypes2-seed#[A32141060A4CE5F9]] core.SolrResourceLoader (SolrResourceLoader.java:addToClassLoader(170)) - Can't find (or read) directory to add to classloader: ../../../dist/ (resolved as: /mnt/ssd/jenkins/workspace/Lucene-Solr-trunk-Linux/solr/contrib/map-reduce/src/test-files/solr/collection1/../../../dist).
   [junit4]   1> 2014-01-30 13:44:33,868 WARN  [TEST-SolrCellMorphlineTest.testSolrCellDocumentTypes2-seed#[A32141060A4CE5F9]] core.SolrResourceLoader (SolrResourceLoader.java:addToClassLoader(170)) - Can't find (or read) directory to add to classloader: /non/existent/dir/yields/warning (resolved as: /non/existent/dir/yields/warning).
   [junit4]   1> 2014-01-30 13:44:33,898 INFO  [TEST-SolrCellMorphlineTest.testSolrCellDocumentTypes2-seed#[A32141060A4CE5F9]] core.SolrConfig (SolrConfig.java:<init>(170)) - Using Lucene MatchVersion: LUCENE_43
   [junit4]   1> 2014-01-30 13:44:33,955 INFO  [TEST-SolrCellMorphlineTest.testSolrCellDocumentTypes2-seed#[A32141060A4CE5F9]] core.Config (SolrConfig.java:<init>(288)) - Loaded SolrConfig: solrconfig.xml
   [junit4]   1> 2014-01-30 13:44:33,956 INFO  [TEST-SolrCellMorphlineTest.testSolrCellDocumentTypes2-seed#[A32141060A4CE5F9]] schema.IndexSchema (IndexSchema.java:readSchema(426)) - Reading Solr Schema from schema.xml
   [junit4]   1> 2014-01-30 13:44:33,964 INFO  [TEST-SolrCellMorphlineTest.testSolrCellDocumentTypes2-seed#[A32141060A4CE5F9]] schema.IndexSchema (IndexSchema.java:readSchema(454)) - [null] Schema name=example
   [junit4]   1> 2014-01-30 13:44:34,311 INFO  [TEST-SolrCellMorphlineTest.testSolrCellDocumentTypes2-seed#[A32141060A4CE5F9]] schema.IndexSchema (IndexSchema.java:readSchema(552)) - unique key field: id
   [junit4]   1> 2014-01-30 13:44:34,321 INFO  [TEST-SolrCellMorphlineTest.testSolrCellDocumentTypes2-seed#[A32141060A4CE5F9]] schema.FileExchangeRateProvider (CurrencyField.java:reload(781)) - Reloading exchange rates from file currency.xml
   [junit4]   1> 2014-01-30 13:44:34,325 INFO  [TEST-SolrCellMorphlineTest.testSolrCellDocumentTypes2-seed#[A32141060A4CE5F9]] schema.FileExchangeRateProvider (CurrencyField.java:reload(781)) - Reloading exchange rates from file currency.xml
   [junit4]   1> 2014-01-30 13:44:34,512 INFO  [TEST-SolrCellMorphlineTest.testSolrCellDocumentTypes2-seed#[A32141060A4CE5F9]] core.SolrResourceLoader (SolrResourceLoader.java:<init>(116)) - new SolrResourceLoader for directory: '/mnt/ssd/jenkins/workspace/Lucene-Solr-trunk-Linux/solr/contrib/map-reduce/src/test-files/solr/collection1/'
   [junit4]   1> 2014-01-30 13:44:34,543 INFO  [TEST-SolrCellMorphlineTest.testSolrCellDocumentTypes2-seed#[A32141060A4CE5F9]] core.SolrConfig (SolrConfig.java:initLibs(529)) - Adding specified lib dirs to ClassLoader
   [junit4]   1> 2014-01-30 13:44:34,544 WARN  [TEST-SolrCellMorphlineTest.testSolrCellDocumentTypes2-seed#[A32141060A4CE5F9]] core.SolrResourceLoader (SolrResourceLoader.java:addToClassLoader(170)) - Can't find (or read) directory to add to classloader: ../../../contrib/extraction/lib (resolved as: /mnt/ssd/jenkins/workspace/Lucene-Solr-trunk-Linux/solr/contrib/map-reduce/src/test-files/solr/collection1/../../../contrib/extraction/lib).
   [junit4]   1> 2014-01-30 13:44:34,544 WARN  [TEST-SolrCellMorphlineTest.testSolrCellDocumentTypes2-seed#[A32141060A4CE5F9]] core.SolrResourceLoader (SolrResourceLoader.java:addToClassLoader(170)) - Can't find (or read) directory to add to classloader: ../../../dist/ (resolved as: /mnt/ssd/jenkins/workspace/Lucene-Solr-trunk-Linux/solr/contrib/map-reduce/src/test-files/solr/collection1/../../../dist).
   [junit4]   1> 2014-01-30 13:44:34,544 WARN  [TEST-SolrCellMorphlineTest.testSolrCellDocumentTypes2-seed#[A32141060A4CE5F9]] core.SolrResourceLoader (SolrResourceLoader.java:addToClassLoader(170)) - Can't find (or read) directory to add to classloader: ../../../contrib/clustering/lib/ (resolved as: /mnt/ssd/jenkins/workspace/Lucene-Solr-trunk-Linux/solr/contrib/map-reduce/src/test-files/solr/collection1/../../../contrib/clustering/lib).
   [junit4]   1> 2014-01-30 13:44:34,545 WARN  [TEST-SolrCellMorphlineTest.testSolrCellDocumentTypes2-seed#[A32141060A4CE5F9]] core.SolrResourceLoader (SolrResourceLoader.java:addToClassLoader(170)) - Can't find (or read) directory to add to classloader: ../../../dist/ (resolved as: /mnt/ssd/jenkins/workspace/Lucene-Solr-trunk-Linux/solr/contrib/map-reduce/src/test-files/solr/collection1/../../../dist).
   [junit4]   1> 2014-01-30 13:44:34,545 WARN  [TEST-SolrCellMorphlineTest.testSolrCellDocumentTypes2-seed#[A32141060A4CE5F9]] core.SolrResourceLoader (SolrResourceLoader.java:addToClassLoader(170)) - Can't find (or read) directory to add to classloader: ../../../contrib/langid/lib/ (resolved as: /mnt/ssd/jenkins/workspace/Lucene-Solr-trunk-Linux/solr/contrib/map-reduce/src/test-files/solr/collection1/../../../contrib/langid/lib).
   [junit4]   1> 2014-01-30 13:44:34,546 WARN  [TEST-SolrCellMorphlineTest.testSolrCellDocumentTypes2-seed#[A32141060A4CE5F9]] core.SolrResourceLoader (SolrResourceLoader.java:addToClassLoader(170)) - Can't find (or read) directory to add to classloader: ../../../dist/ (resolved as: /mnt/ssd/jenkins/workspace/Lucene-Solr-trunk-Linux/solr/contrib/map-reduce/src/test-files/solr/collection1/../../../dist).
   [junit4]   1> 2014-01-30 13:44:34,546 WARN  [TEST-SolrCellMorphlineTest.testSolrCellDocumentTypes2-seed#[A32141060A4CE5F9]] core.SolrResourceLoader (SolrResourceLoader.java:addToClassLoader(170)) - Can't find (or read) directory to add to classloader: ../../../contrib/velocity/lib (resolved as: /mnt/ssd/jenkins/workspace/Lucene-Solr-trunk-Linux/solr/contrib/map-reduce/src/test-files/solr/collection1/../../../contrib/velocity/lib).
   [junit4]   1> 2014-01-30 13:44:34,547 WARN  [TEST-SolrCellMorphlineTest.testSolrCellDocumentTypes2-seed#[A32141060A4CE5F9]] core.SolrResourceLoader (SolrResourceLoader.java:addToClassLoader(170)) - Can't find (or read) directory to add to classloader: ../../../dist/ (resolved as: /mnt/ssd/jenkins/workspace/Lucene-Solr-trunk-Linux/solr/contrib/map-reduce/src/test-files/solr/collection1/../../../dist).
   [junit4]   1> 2014-01-30 13:44:34,547 WARN  [TEST-SolrCellMorphlineTest.testSolrCellDocumentTypes2-seed#[A32141060A4CE5F9]] core.SolrResourceLoader (SolrResourceLoader.java:addToClassLoader(170)) - Can't find (or read) directory to add to classloader: /non/existent/dir/yields/warning (resolved as: /non/existent/dir/yields/warning).
   [junit4]   1> 2014-01-30 13:44:34,585 INFO  [TEST-SolrCellMorphlineTest.testSolrCellDocumentTypes2-seed#[A32141060A4CE5F9]] core.SolrConfig (SolrConfig.java:<init>(170)) - Using Lucene MatchVersion: LUCENE_43
   [junit4]   1> 2014-01-30 13:44:34,642 INFO  [TEST-SolrCellMorphlineTest.testSolrCellDocumentTypes2-seed#[A32141060A4CE5F9]] core.Config (SolrConfig.java:<init>(288)) - Loaded SolrConfig: solrconfig.xml
   [junit4]   1> 2014-01-30 13:44:34,642 INFO  [TEST-SolrCellMorphlineTest.testSolrCellDocumentTypes2-seed#[A32141060A4CE5F9]] schema.IndexSchema (IndexSchema.java:readSchema(426)) - Reading Solr Schema from schema.xml
   [junit4]   1> 2014-01-30 13:44:34,651 INFO  [TEST-SolrCellMorphlineTest.testSolrCellDocumentTypes2-seed#[A32141060A4CE5F9]] schema.IndexSchema (IndexSchema.java:readSchema(454)) - [null] Schema name=example
   [junit4]   1> 2014-01-30 13:44:34,995 INFO  [TEST-SolrCellMorphlineTest.testSolrCellDocumentTypes2-seed#[A32141060A4CE5F9]] schema.IndexSchema (IndexSchema.java:readSchema(552)) - unique key field: id
   [junit4]   1> 2014-01-30 13:44:35,005 INFO  [TEST-SolrCellMorphlineTest.testSolrCellDocumentTypes2-seed#[A32141060A4CE5F9]] schema.FileExchangeRateProvider (CurrencyField.java:reload(781)) - Reloading exchange rates from file currency.xml
   [junit4]   1> 2014-01-30 13:44:35,008 INFO  [TEST-SolrCellMorphlineTest.testSolrCellDocumentTypes2-seed#[A32141060A4CE5F9]] schema.FileExchangeRateProvider (CurrencyField.java:reload(781)) - Reloading exchange rates from file currency.xml
   [junit4]   1> 2014-01-30 13:44:35,034 INFO  [TEST-SolrCellMorphlineTest.testSolrCellDocumentTypes2-seed#[A32141060A4CE5F9]] processor.LogUpdateProcessor (LogUpdateProcessorFactory.java:finish(198)) - [collection1] webapp=null path=/update params={} {deleteByQuery=*:* (-1458663037372203008)} 0 1
   [junit4]   1> 2014-01-30 13:44:35,034 INFO  [TEST-SolrCellMorphlineTest.testSolrCellDocumentTypes2-seed#[A32141060A4CE5F9]] update.UpdateHandler (DirectUpdateHandler2.java:commit(521)) - start commit{,optimize=false,openSearcher=true,waitSearcher=true,expungeDeletes=false,softCommit=false,prepareCommit=false}
   [junit4]   1> 2014-01-30 13:44:35,035 INFO  [TEST-SolrCellMorphlineTest.testSolrCellDocumentTypes2-seed#[A32141060A4CE5F9]] update.UpdateHandler (DirectUpdateHandler2.java:commit(561)) - No uncommitted changes. Skipping IW.commit.
   [junit4]   1> 2014-01-30 13:44:35,035 INFO  [TEST-SolrCellMorphlineTest.testSolrCellDocumentTypes2-seed#[A32141060A4CE5F9]] search.SolrIndexSearcher (SolrIndexSearcher.java:<init>(200)) - Opening Searcher@ebdd85 main
   [junit4]   1> 2014-01-30 13:44:35,036 INFO  [TEST-SolrCellMorphlineTest.testSolrCellDocumentTypes2-seed#[A32141060A4CE5F9]] update.UpdateHandler (DirectUpdateHandler2.java:commit(612)) - end_commit_flush
   [junit4]   1> 2014-01-30 13:44:35,036 INFO  [searcherExecutor-5-thread-1] core.SolrCore (QuerySenderListener.java:newSearcher(44)) - QuerySenderListener sending requests to Searcher@ebdd85 main{StandardDirectoryReader(segments_1:1:nrt)}
   [junit4]   1> 2014-01-30 13:44:35,036 INFO  [searcherExecutor-5-thread-1] core.SolrCore (QuerySenderListener.java:newSearcher(91)) - QuerySenderListener done.
   [junit4]   1> 2014-01-30 13:44:35,036 INFO  [searcherExecutor-5-thread-1] core.SolrCore (SolrCore.java:registerSearcher(1867)) - [collection1] Registered new searcher Searcher@ebdd85 main{StandardDirectoryReader(segments_1:1:nrt)}
   [junit4]   1> 2014-01-30 13:44:35,037 INFO  [TEST-SolrCellMorphlineTest.testSolrCellDocumentTypes2-seed#[A32141060A4CE5F9]] processor.LogUpdateProcessor (LogUpdateProcessorFactory.java:finish(198)) - [collection1] webapp=null path=/update params={commit=true&softCommit=false&waitSearcher=true} {commit=} 0 3
   [junit4]   1> 2014-01-30 13:44:35,554 INFO  [TEST-SolrCellMorphlineTest.testSolrCellDocumentTypes2-seed#[A32141060A4CE5F9]] processor.LogUpdateProcessor (LogUpdateProcessorFactory.java:finish(198)) - [collection1] webapp=null path=/update params={} {add=[testPPT_various.ppt#0 (1458663037860839424)]} 0 57
   [junit4]   1> 2014-01-30 13:44:35,557 INFO  [TEST-SolrCellMorphlineTest.testSolrCellDocumentTypes2-seed#[A32141060A4CE5F9]] update.UpdateHandler (DirectUpdateHandler2.java:commit(521)) - start commit{,optimize=false,openSearcher=true,waitSearcher=true,expungeDeletes=false,softCommit=true,prepareCommit=false}
   [junit4]   1> 2014-01-30 13:44:35,642 INFO  [TEST-SolrCellMorphlineTest.testSolrCellDocumentTypes2-seed#[A32141060A4CE5F9]] search.SolrIndexSearcher (SolrIndexSearcher.java:<init>(200)) - Opening Searcher@abf587 main
   [junit4]   1> 2014-01-30 13:44:35,643 INFO  [TEST-SolrCellMorphlineTest.testSolrCellDocumentTypes2-seed#[A32141060A4CE5F9]] update.UpdateHandler (DirectUpdateHandler2.java:commit(612)) - end_commit_flush
   [junit4]   1> 2014-01-30 13:44:35,643 INFO  [searcherExecutor-5-thread-1] core.SolrCore (QuerySenderListener.java:newSearcher(44)) - QuerySenderListener sending requests to Searcher@abf587 main{StandardDirectoryReader(segments_1:3:nrt _0(5.0):C1)}
   [junit4]   1> 2014-01-30 13:44:35,644 INFO  [searcherExecutor-5-thread-1] core.SolrCore (QuerySenderListener.java:newSearcher(91)) - QuerySenderListener done.
   [junit4]   1> 2014-01-30 13:44:35,644 INFO  [searcherExecutor-5-thread-1] core.SolrCore (SolrCore.java:registerSearcher(1867)) - [collection1] Registered new searcher Searcher@abf587 main{StandardDirectoryReader(segments_1:3:nrt _0(5.0):C1)}
   [junit4]   1> 2014-01-30 13:44:35,644 INFO  [TEST-SolrCellMorphlineTest.testSolrCellDocumentTypes2-seed#[A32141060A4CE5F9]] processor.LogUpdateProcessor (LogUpdateProcessorFactory.java:finish(198)) - [collection1] webapp=null path=/update params={commit=true&softCommit=true&waitSearcher=true} {commit=} 0 87
   [junit4]   1> 2014-01-30 13:44:35,654 INFO  [TEST-SolrCellMorphlineTest.testSolrCellDocumentTypes2-seed#[A32141060A4CE5F9]] core.SolrCore (SolrCore.java:execute(1919)) - [collection1] webapp=null path=/select params={q=*%3A*&rows=2147483647} hits=1 status=0 QTime=7 
   [junit4]   1> 2014-01-30 13:44:36,988 INFO  [TEST-SolrCellMorphlineTest.testSolrCellDocumentTypes2-seed#[A32141060A4CE5F9]] processor.LogUpdateProcessor (LogUpdateProcessorFactory.java:finish(198)) - [collection1] webapp=null path=/update params={} {add=[testPPT_various.pptx#0 (1458663039419023360)]} 0 4
   [junit4]   1> 2014-01-30 13:44:36,989 INFO  [TEST-SolrCellMorphlineTest.testSolrCellDocumentTypes2-seed#[A32141060A4CE5F9]] update.UpdateHandler (DirectUpdateHandler2.java:commit(521)) - start commit{,optimize=false,openSearcher=true,waitSearcher=true,expungeDeletes=false,softCommit=true,prepareCommit=false}
   [junit4]   1> 2014-01-30 13:44:37,007 INFO  [TEST-SolrCellMorphlineTest.testSolrCellDocumentTypes2-seed#[A32141060A4CE5F9]] search.SolrIndexSearcher (SolrIndexSearcher.java:<init>(200)) - Opening Searcher@1256c5a main
   [junit4]   1> 2014-01-30 13:44:37,007 INFO  [TEST-SolrCellMorphlineTest.testSolrCellDocumentTypes2-seed#[A32141060A4CE5F9]] update.UpdateHandler (DirectUpdateHandler2.java:commit(612)) - end_commit_flush
   [junit4]   1> 2014-01-30 13:44:37,007 INFO  [searcherExecutor-5-thread-1] core.SolrCore (QuerySenderListener.java:newSearcher(44)) - QuerySenderListener sending requests to Searcher@1256c5a main{StandardDirectoryReader(segments_1:5:nrt _0(5.0):C1 _1(5.0):C1)}
   [junit4]   1> 2014-01-30 13:44:37,008 INFO  [searcherExecutor-5-thread-1] core.SolrCore (QuerySenderListener.java:newSearcher(91)) - QuerySenderListener done.
   [junit4]   1> 2014-01-30 13:44:37,008 INFO  [searcherExecutor-5-thread-1] core.SolrCore (SolrCore.java:registerSearcher(1867)) - [collection1] Registered new searcher Searcher@1256c5a main{StandardDirectoryReader(segments_1:5:nrt _0(5.0):C1 _1(5.0):C1)}
   [junit4]   1> 2014-01-30 13:44:37,009 INFO  [TEST-SolrCellMorphlineTest.testSolrCellDocumentTypes2-seed#[A32141060A4CE5F9]] processor.LogUpdateProcessor (LogUpdateProcessorFactory.java:finish(198)) - [collection1] webapp=null path=/update params={commit=true&softCommit=true&waitSearcher=true} {commit=} 0 20
   [junit4]   1> 2014-01-30 13:44:37,010 INFO  [TEST-SolrCellMorphlineTest.testSolrCellDocumentTypes2-seed#[A32141060A4CE5F9]] core.SolrCore (SolrCore.java:execute(1919)) - [collection1] webapp=null path=/select params={q=*%3A*&rows=2147483647} hits=2 status=0 QTime=1 
   [junit4]   1> 2014-01-30 13:44:37,208 INFO  [TEST-SolrCellMorphlineTest.testSolrCellDocumentTypes2-seed#[A32141060A4CE5F9]] processor.LogUpdateProcessor (LogUpdateProcessorFactory.java:finish(198)) - [collection1] webapp=null path=/update params={} {add=[testEXCEL.xlsx#0 (1458663039650758656)]} 0 3
   [junit4]   1> 2014-01-30 13:44:37,209 INFO  [TEST-SolrCellMorphlineTest.testSolrCellDocumentTypes2-seed#[A32141060A4CE5F9]] update.UpdateHandler (DirectUpdateHandler2.java:commit(521)) - start commit{,optimize=false,openSearcher=true,waitSearcher=true,expungeDeletes=false,softCommit=true,prepareCommit=false}
   [junit4]   1> 2014-01-30 13:44:37,213 INFO  [TEST-SolrCellMorphlineTest.testSolrCellDocumentTypes2-seed#[A32141060A4CE5F9]] search.SolrIndexSearcher (SolrIndexSearcher.java:<init>(200)) - Opening Searcher@2accff main
   [junit4]   1> 2014-01-30 13:44:37,214 INFO  [TEST-SolrCellMorphlineTest.testSolrCellDocumentTypes2-seed#[A32141060A4CE5F9]] update.UpdateHandler (DirectUpdateHandler2.java:commit(612)) - end_commit_flush
   [junit4]   1> 2014-01-30 13:44:37,214 INFO  [searcherExecutor-5-thread-1] core.SolrCore (QuerySenderListener.java:newSearcher(44)) - QuerySenderListener sending requests to Searcher@2accff main{StandardDirectoryReader(segments_1:7:nrt _0(5.0):C1 _1(5.0):C1 _2(5.0):C1)}
   [junit4]   1> 2014-01-30 13:44:37,215 INFO  [searcherExecutor-5-thread-1] core.SolrCore (QuerySenderListener.java:newSearcher(91)) - QuerySenderListener done.
   [junit4]   1> 2014-01-30 13:44:37,215 INFO  [searcherExecutor-5-thread-1] core.SolrCore (SolrCore.java:registerSearcher(1867)) - [collection1] Registered new searcher Searcher@2accff main{StandardDirectoryReader(segments_1:7:nrt _0(5.0):C1 _1(5.0):C1 _2(5.0):C1)}
   [junit4]   1> 2014-01-30 13:44:37,216 INFO  [TEST-SolrCellMorphlineTest.testSolrCellDocumentTypes2-seed#[A32141060A4CE5F9]] processor.LogUpdateProcessor (LogUpdateProcessorFactory.java:finish(198)) - [collection1] webapp=null path=/update params={commit=true&softCommit=true&waitSearcher=true} {commit=} 0 7
   [junit4]   1> 2014-01-30 13:44:37,217 INFO  [TEST-SolrCellMorphlineTest.testSolrCellDocumentTypes2-seed#[A32141060A4CE5F9]] core.SolrCore (SolrCore.java:execute(1919)) - [collection1] webapp=null path=/select params={q=*%3A*&rows=2147483647} hits=3 status=0 QTime=0 
   [junit4]   1> 2014-01-30 13:44:37,219 INFO  [TEST-SolrCellMorphlineTest.testSolrCellDocumentTypes2-seed#[A32141060A4CE5F9]] solr.SolrTestCaseJ4 (SolrTestCaseJ4.java:tearDown(243)) - ###Ending testSolrCellDocumentTypes2
   [junit4]   2> NOTE: reproduce with: ant test  -Dtestcase=SolrCellMorphlineTest -Dtests.method=testSolrCellDocumentTypes2 -Dtests.seed=A32141060A4CE5F9 -Dtests.multiplier=3 -Dtests.slow=true -Dtests.locale=th_TH -Dtests.timezone=Asia/Riyadh -Dtests.file.encoding=US-ASCII
   [junit4] FAILURE 8.78s | SolrCellMorphlineTest.testSolrCellDocumentTypes2 <<<
   [junit4]    > Throwable #1: java.lang.AssertionError: key:ignored_creation_date expected:<[2007-10-01T16:13:56Z]> but was:<[1464-10-01T16:13:56Z]>
   [junit4]    > 	at __randomizedtesting.SeedInfo.seed([A32141060A4CE5F9:28A1FAE60DBA7607]:0)
   [junit4]    > 	at org.apache.solr.morphlines.solr.AbstractSolrMorphlineTestBase.testDocumentTypesInternal(AbstractSolrMorphlineTestBase.java:165)
   [junit4]    > 	at org.apache.solr.morphlines.cell.SolrCellMorphlineTest.testSolrCellDocumentTypes2(SolrCellMorphlineTest.java:255)
   [junit4]    > 	at java.lang.Thread.run(Thread.java:744)
   [junit4]   1> 2014-01-30 13:44:37,253 INFO  [TEST-SolrCellMorphlineTest.testSolrCellDocumentTypes-seed#[A32141060A4CE5F9]] solr.SolrTestCaseJ4 (SolrTestCaseJ4.java:setUp(238)) - ###Starting testSolrCellDocumentTypes
   [junit4]   1> 2014-01-30 13:44:37,282 INFO  [TEST-SolrCellMorphlineTest.testSolrCellDocumentTypes-seed#[A32141060A4CE5F9]] search.SolrIndexSearcher (SolrIndexSearcher.java:<init>(200)) - Opening Searcher@5cc771 realtime
   [junit4]   1> 2014-01-30 13:44:37,283 INFO  [TEST-SolrCellMorphlineTest.testSolrCellDocumentTypes-seed#[A32141060A4CE5F9]] processor.LogUpdateProcessor (LogUpdateProcessorFactory.java:finish(198)) - [collection1] webapp=null path=/update params={} {deleteByQuery=*:* (-1458663039701090304)} 0 29
   [junit4]   1> 2014-01-30 13:44:37,283 INFO  [TEST-SolrCellMorphlineTest.testSolrCellDocumentTypes-seed#[A32141060A4CE5F9]] update.UpdateHandler (DirectUpdateHandler2.java:commit(521)) - start commit{,optimize=false,openSearcher=true,waitSearcher=true,expungeDeletes=false,softCommit=false,prepareCommit=false}
   [junit4]   1> 2014-01-30 13:44:37,284 INFO  [TEST-SolrCellMorphlineTest.testSolrCellDocumentTypes-seed#[A32141060A4CE5F9]] core.SolrCore (SolrDeletionPolicy.java:onCommit(98)) - SolrDeletionPolicy.onCommit: commits: num=2
   [junit4]   1> 	commit{dir=MockDirectoryWrapper(org.apache.lucene.store.RAMDirectory@35210f lockFactory=org.apache.lucene.store.NativeFSLockFactory@12bb98c),segFN=segments_1,generation=1}
   [junit4]   1> 	commit{dir=MockDirectoryWrapper(org.apache.lucene.store.RAMDirectory@35210f lockFactory=org.apache.lucene.store.NativeFSLockFactory@12bb98c),segFN=segments_2,generation=2}
   [junit4]   1> 2014-01-30 13:44:37,285 INFO  [TEST-SolrCellMorphlineTest.testSolrCellDocumentTypes-seed#[A32141060A4CE5F9]] core.SolrCore (SolrDeletionPolicy.java:updateCommits(165)) - newest commit generation = 2
   [junit4]   1> 2014-01-30 13:44:37,285 INFO  [TEST-SolrCellMorphlineTest.testSolrCellDocumentTypes-seed#[A32141060A4CE5F9]] search.SolrIndexSearcher (SolrIndexSearcher.java:<init>(200)) - Opening Searcher@1a6c601 main
   [junit4]   1> 2014-01-30 13:44:37,286 INFO  [TEST-SolrCellMorphlineTest.testSolrCellDocumentTypes-seed#[A32141060A4CE5F9]] update.UpdateHandler (DirectUpdateHandler2.java:commit(612)) - end_commit_flush
   [junit4]   1> 2014-01-30 13:44:37,286 INFO  [searcherExecutor-5-thread-1] core.SolrCore (QuerySenderListener.java:newSearcher(44)) - QuerySenderListener sending requests to Searcher@1a6c601 main{StandardDirectoryReader(segments_1:9:nrt)}
   [junit4]   1> 2014-01-30 13:44:37,287 INFO  [searcherExecutor-5-thread-1] core.SolrCore (QuerySenderListener.java:newSearcher(91)) - QuerySenderListener done.
   [junit4]   1> 2014-01-30 13:44:37,287 INFO  [searcherExecutor-5-thread-1] core.SolrCore (SolrCore.java:registerSearcher(1867)) - [collection1] Registered new searcher Searcher@1a6c601 main{StandardDirectoryReader(segments_1:9:nrt)}
   [junit4]   1> 2014-01-30 13:44:37,339 INFO  [TEST-SolrCellMorphlineTest.testSolrCellDocumentTypes-seed#[A32141060A4CE5F9]] processor.LogUpdateProcessor (LogUpdateProcessorFactory.java:finish(198)) - [collection1] webapp=null path=/update params={commit=true&softCommit=false&waitSearcher=true} {commit=} 0 56
   [junit4]   1> 2014-01-30 13:44:37,353 INFO  [TEST-SolrCellMorphlineTest.testSolrCellDocumentTypes-seed#[A32141060A4CE5F9]] api.MorphlineContext (MorphlineContext.java:importCommandBuilders(75)) - Importing commands
   [junit4]   1> 2014-01-30 13:44:38,109 INFO  [TEST-SolrCellMorphlineTest.testSolrCellDocumentTypes-seed#[A32141060A4CE5F9]] core.SolrResourceLoader (SolrResourceLoader.java:<init>(116)) - new SolrResourceLoader for directory: '/mnt/ssd/jenkins/workspace/Lucene-Solr-trunk-Linux/solr/contrib/map-reduce/src/test-files/solr/collection1/'
   [junit4]   1> 2014-01-30 13:44:38,134 INFO  [TEST-SolrCellMorphlineTest.testSolrCellDocumentTypes-seed#[A32141060A4CE5F9]] core.SolrConfig (SolrConfig.java:initLibs(529)) - Adding specified lib dirs to ClassLoader
   [junit4]   1> 2014-01-30 13:44:38,135 WARN  [TEST-SolrCellMorphlineTest.testSolrCellDocumentTypes-seed#[A32141060A4CE5F9]] core.SolrResourceLoader (SolrResourceLoader.java:addToClassLoader(170)) - Can't find (or read) directory to add to classloader: ../../../contrib/extraction/lib (resolved as: /mnt/ssd/jenkins/workspace/Lucene-Solr-trunk-Linux/solr/contrib/map-reduce/src/test-files/solr/collection1/../../../contrib/extraction/lib).
   [junit4]   1> 2014-01-30 13:44:38,135 WARN  [TEST-SolrCellMorphlineTest.testSolrCellDocumentTypes-seed#[A32141060A4CE5F9]] core.SolrResourceLoader (SolrResourceLoader.java:addToClassLoader(170)) - Can't find (or read) directory to add to classloader: ../../../dist/ (resolved as: /mnt/ssd/jenkins/workspace/Lucene-Solr-trunk-Linux/solr/contrib/map-reduce/src/test-files/solr/collection1/../../../dist).
   [junit4]   1> 2014-01-30 13:44:38,136 WARN  [TEST-SolrCellMorphlineTest.testSolrCellDocumentTypes-seed#[A32141060A4CE5F9]] core.SolrResourceLoader (SolrResourceLoader.java:addToClassLoader(170)) - Can't find (or read) directory to add to classloader: ../../../contrib/clustering/lib/ (resolved as: /mnt/ssd/jenkins/workspace/Lucene-Solr-trunk-Linux/solr/contrib/map-reduce/src/test-files/solr/collection1/../../../contrib/clustering/lib).
   [junit4]   1> 2014-01-30 13:44:38,136 WARN  [TEST-SolrCellMorphlineTest.testSolrCellDocumentTypes-seed#[A32141060A4CE5F9]] core.SolrResourceLoader (SolrResourceLoader.java:addToClassLoader(170)) - Can't find (or read) directory to add to classloader: ../../../dist/ (resolved as: /mnt/ssd/jenkins/workspace/Lucene-Solr-trunk-Linux/solr/contrib/map-reduce/src/test-files/solr/collection1/../../../dist).
   [junit4]   1> 2014-01-30 13:44:38,137 WARN  [TEST-SolrCellMorphlineTest.testSolrCellDocumentTypes-seed#[A32141060A4CE5F9]] core.SolrResourceLoader (SolrResourceLoader.java:addToClassLoader(170)) - Can't find (or read) directory to add to classloader: ../../../contrib/langid/lib/ (resolved as: /mnt/ssd/jenkins/workspace/Lucene-Solr-trunk-Linux/solr/contrib/map-reduce/src/test-files/solr/collection1/../../../contrib/langid/lib).
   [junit4]   1> 2014-01-30 13:44:38,137 WARN  [TEST-SolrCellMorphlineTest.testSolrCellDocumentTypes-seed#[A32141060A4CE5F9]] core.SolrResourceLoader (SolrResourceLoader.java:addToClassLoader(170)) - Can't find (or read) directory to add to classloader: ../../../dist/ (resolved as: /mnt/ssd/jenkins/workspace/Lucene-Solr-trunk-Linux/solr/contrib/map-reduce/src/test-files/solr/collection1/../../../dist).
   [junit4]   1> 2014-01-30 13:44:38,138 WARN  [TEST-SolrCellMorphlineTest.testSolrCellDocumentTypes-seed#[A32141060A4CE5F9]] core.SolrResourceLoader (SolrResourceLoader.java:addToClassLoader(170)) - Can't find (or read) directory to add to classloader: ../../../contrib/velocity/lib (resolved as: /mnt/ssd/jenkins/workspace/Lucene-Solr-trunk-Linux/solr/contrib/map-reduce/src/test-files/solr/collection1/../../../contrib/velocity/lib).
   [junit4]   1> 2014-01-30 13:44:38,138 WARN  [TEST-SolrCellMorphlineTest.testSolrCellDocumentTypes-seed#[A32141060A4CE5F9]] core.SolrResourceLoader (SolrResourceLoader.java:addToClassLoader(170)) - Can't find (or read) directory to add to classloader: ../../../dist/ (resolved as: /mnt/ssd/jenkins/workspace/Lucene-Solr-trunk-Linux/solr/contrib/map-reduce/src/test-files/solr/collection1/../../../dist).
   [junit4]   1> 2014-01-30 13:44:38,139 WARN  [TEST-SolrCellMorphlineTest.testSolrCellDocumentTypes-seed#[A32141060A4CE5F9]] core.SolrResourceLoader (SolrResourceLoader.java:addToClassLoader(170)) - Can't find (or read) directory to add to classloader: /non/existent/dir/yields/warning (resolved as: /non/existent/dir/yields/warning).
   [junit4]   1> 2014-01-30 13:44:38,170 INFO  [TEST-SolrCellMorphlineTest.testSolrCellDocumentTypes-seed#[A32141060A4CE5F9]] core.SolrConfig (SolrConfig.java:<init>(170)) - Using Lucene MatchVersion: LUCENE_43
   [junit4]   1> 2014-01-30 13:44:38,227 INFO  [TEST-SolrCellMorphlineTest.testSolrCellDocumentTypes-seed#[A32141060A4CE5F9]] core.Config (SolrConfig.java:<init>(288)) - Loaded SolrConfig: solrconfig.xml
   [junit4]   1> 2014-01-30 13:44:38,228 INFO  [TEST-SolrCellMorphlineTest.testSolrCellDocumentTypes-seed#[A32141060A4CE5F9]] schema.IndexSchema (IndexSchema.java:readSchema(426)) - Reading Solr Schema from schema.xml
   [junit4]   1> 2014-01-30 13:44:38,237 INFO  [TEST-SolrCellMorphlineTest.testSolrCellDocumentTypes-seed#[A32141060A4CE5F9]] schema.IndexSchema (IndexSchema.java:readSchema(454)) - [null] Schema name=example
   [junit4]   1> 2014-01-30 13:44:38,609 INFO  [TEST-SolrCellMorphlineTest.testSolrCellDocumentTypes-seed#[A32141060A4CE5F9]] schema.IndexSchema (IndexSchema.java:readSchema(552)) - unique key field: id
   [junit4]   1> 2014-01-30 13:44:38,619 INFO  [TEST-SolrCellMorphlineTest.testSolrCellDocumentTypes-seed#[A32141060A4CE5F9]] schema.FileExchangeRateProvider (CurrencyField.java:reload(781)) - Reloading exchange rates from file currency.xml
   [junit4]   1> 2014-01-30 13:44:38,623 INFO  [TEST-SolrCellMorphlineTest.testSolrCellDocumentTypes-seed#[A32141060A4CE5F9]] schema.FileExchangeRateProvider (CurrencyField.java:reload(781)) - Reloading exchange rates from file currency.xml
   [junit4]   1> 2014-01-30 13:44:38,642 INFO  [TEST-SolrCellMorphlineTest.testSolrCellDocumentTypes-seed#[A32141060A4CE5F9]] core.SolrResourceLoader (SolrResourceLoader.java:<init>(116)) - new SolrResourceLoader for directory: '/mnt/ssd/jenkins/workspace/Lucene-Solr-trunk-Linux/solr/contrib/map-reduce/src/test-files/solr/collection1/'
   [junit4]   1> 2014-01-30 13:44:38,662 INFO  [TEST-SolrCellMorphlineTest.testSolrCellDocumentTypes-seed#[A32141060A4CE5F9]] core.SolrConfig (SolrConfig.java:initLibs(529)) - Adding specified lib dirs to ClassLoader
   [junit4]   1> 2014-01-30 13:44:38,663 WARN  [TEST-SolrCellMorphlineTest.testSolrCellDocumentTypes-seed#[A32141060A4CE5F9]] core.SolrResourceLoader (SolrResourceLoader.java:addToClassLoader(170)) - Can't find (or read) directory to add to classloader: ../../../contrib/extraction/lib (resolved as: /mnt/ssd/jenkins/workspace/Lucene-Solr-trunk-Linux/solr/contrib/map-reduce/src/test-files/solr/collection1/../../../contrib/extraction/lib).
   [junit4]   1> 2014-01-30 13:44:38,663 WARN  [TEST-SolrCellMorphlineTest.testSolrCellDocumentTypes-seed#[A32141060A4CE5F9]] core.SolrResourceLoader (SolrResourceLoader.java:addToClassLoader(170)) - Can't find (or read) directory to add to classloader: ../../../dist/ (resolved as: /mnt/ssd/jenkins/workspace/Lucene-Solr-trunk-Linux/solr/contrib/map-reduce/src/test-files/solr/collection1/../../../dist).
   [junit4]   1> 2014-01-30 13:44:38,664 WARN  [TEST-SolrCellMorphlineTest.testSolrCellDocumentTypes-seed#[A32141060A4CE5F9]] core.SolrResourceLoader (SolrResourceLoader.java:addToClassLoader(170)) - Can't find (or read) directory to add to classloader: ../../../contrib/clustering/lib/ (resolved as: /mnt/ssd/jenkins/workspace/Lucene-Solr-trunk-Linux/solr/contrib/map-reduce/src/test-files/solr/collection1/../../../contrib/clustering/lib).
   [junit4]   1> 2014-01-30 13:44:38,664 WARN  [TEST-SolrCellMorphlineTest.testSolrCellDocumentTypes-seed#[A32141060A4CE5F9]] core.SolrResourceLoader (SolrResourceLoader.java:addToClassLoader(170)) - Can't find (or read) directory to add to classloader: ../../../dist/ (resolved as: /mnt/ssd/jenkins/workspace/Lucene-Solr-trunk-Linux/solr/contrib/map-reduce/src/test-files/solr/collection1/../../../dist).
   [junit4]   1> 2014-01-30 13:44:38,664 WARN  [TEST-SolrCellMorphlineTest.testSolrCellDocumentTypes-seed#[A32141060A4CE5F9]] core.SolrResourceLoader (SolrResourceLoader.java:addToClassLoader(170)) - Can't find (or read) directory to add to classloader: ../../../contrib/langid/lib/ (resolved as: /mnt/ssd/jenkins/workspace/Lucene-Solr-trunk-Linux/solr/contrib/map-reduce/src/test-files/solr/collection1/../../../contrib/langid/lib).
   [junit4]   1> 2014-01-30 13:44:38,665 WARN  [TEST-SolrCellMorphlineTest.testSolrCellDocumentTypes-seed#[A32141060A4CE5F9]] core.SolrResourceLoader (SolrResourceLoader.java:addToClassLoader(170)) - Can't find (or read) directory to add to classloader: ../../../dist/ (resolved as: /mnt/ssd/jenkins/workspace/Lucene-Solr-trunk-Linux/solr/contrib/map-reduce/src/test-files/solr/collection1/../../../dist).
   [junit4]   1> 2014-01-30 13:44:38,665 WARN  [TEST-SolrCellMorphlineTest.testSolrCellDocumentTypes-seed#[A32141060A4CE5F9]] core.SolrResourceLoader (SolrResourceLoader.java:addToClassLoader(170)) - Can't find (or read) directory to add to classloader: ../../../contrib/velocity/lib (resolved as: /mnt/ssd/jenkins/workspace/Lucene-Solr-trunk-Linux/solr/contrib/map-reduce/src/test-files/solr/collection1/../../../contrib/velocity/lib).
   [junit4]   1> 2014-01-30 13:44:38,666 WARN  [TEST-SolrCellMorphlineTest.testSolrCellDocumentTypes-seed#[A32141060A4CE5F9]] core.SolrResourceLoader (

[...truncated too long message...]

tor-5-thread-1] core.SolrCore (QuerySenderListener.java:newSearcher(91)) - QuerySenderListener done.
   [junit4]   1> 2014-01-30 13:44:47,507 INFO  [searcherExecutor-5-thread-1] core.SolrCore (SolrCore.java:registerSearcher(1867)) - [collection1] Registered new searcher Searcher@167df6d main{StandardDirectoryReader(segments_4:57:nrt _m(5.0):C1 _n(5.0):C1 _o(5.0):C1)}
   [junit4]   1> 2014-01-30 13:44:47,508 INFO  [TEST-SolrCellMorphlineTest.testSolrCellJPGCompressed-seed#[A32141060A4CE5F9]] processor.LogUpdateProcessor (LogUpdateProcessorFactory.java:finish(198)) - [collection1] webapp=null path=/update params={commit=true&softCommit=true&waitSearcher=true} {commit=} 0 4
   [junit4]   1> 2014-01-30 13:44:47,508 INFO  [TEST-SolrCellMorphlineTest.testSolrCellJPGCompressed-seed#[A32141060A4CE5F9]] core.SolrCore (SolrCore.java:execute(1919)) - [collection1] webapp=null path=/select params={q=*%3A*&rows=2147483647} hits=3 status=0 QTime=0 
   [junit4]   1> 2014-01-30 13:44:47,509 INFO  [TEST-SolrCellMorphlineTest.testSolrCellJPGCompressed-seed#[A32141060A4CE5F9]] update.UpdateHandler (DirectUpdateHandler2.java:commit(521)) - start commit{,optimize=false,openSearcher=true,waitSearcher=true,expungeDeletes=false,softCommit=true,prepareCommit=false}
   [junit4]   1> 2014-01-30 13:44:47,509 INFO  [TEST-SolrCellMorphlineTest.testSolrCellJPGCompressed-seed#[A32141060A4CE5F9]] search.SolrIndexSearcher (SolrIndexSearcher.java:<init>(200)) - Opening Searcher@1f78344 main
   [junit4]   1> 2014-01-30 13:44:47,510 INFO  [TEST-SolrCellMorphlineTest.testSolrCellJPGCompressed-seed#[A32141060A4CE5F9]] update.UpdateHandler (DirectUpdateHandler2.java:commit(612)) - end_commit_flush
   [junit4]   1> 2014-01-30 13:44:47,510 INFO  [searcherExecutor-5-thread-1] core.SolrCore (QuerySenderListener.java:newSearcher(44)) - QuerySenderListener sending requests to Searcher@1f78344 main{StandardDirectoryReader(segments_4:57:nrt _m(5.0):C1 _n(5.0):C1 _o(5.0):C1)}
   [junit4]   1> 2014-01-30 13:44:47,511 INFO  [searcherExecutor-5-thread-1] core.SolrCore (QuerySenderListener.java:newSearcher(91)) - QuerySenderListener done.
   [junit4]   1> 2014-01-30 13:44:47,511 INFO  [searcherExecutor-5-thread-1] core.SolrCore (SolrCore.java:registerSearcher(1867)) - [collection1] Registered new searcher Searcher@1f78344 main{StandardDirectoryReader(segments_4:57:nrt _m(5.0):C1 _n(5.0):C1 _o(5.0):C1)}
   [junit4]   1> 2014-01-30 13:44:47,511 INFO  [TEST-SolrCellMorphlineTest.testSolrCellJPGCompressed-seed#[A32141060A4CE5F9]] processor.LogUpdateProcessor (LogUpdateProcessorFactory.java:finish(198)) - [collection1] webapp=null path=/update params={commit=true&softCommit=true&waitSearcher=true} {commit=} 0 2
   [junit4]   1> 2014-01-30 13:44:47,512 INFO  [TEST-SolrCellMorphlineTest.testSolrCellJPGCompressed-seed#[A32141060A4CE5F9]] core.SolrCore (SolrCore.java:execute(1919)) - [collection1] webapp=null path=/select params={q=*%3A*&rows=2147483647} hits=3 status=0 QTime=0 
   [junit4]   1> 2014-01-30 13:44:47,512 INFO  [TEST-SolrCellMorphlineTest.testSolrCellJPGCompressed-seed#[A32141060A4CE5F9]] solr.SolrTestCaseJ4 (SolrTestCaseJ4.java:tearDown(243)) - ###Ending testSolrCellJPGCompressed
   [junit4]   1> 2014-01-30 13:44:47,514 INFO  [SUITE-SolrCellMorphlineTest-seed#[A32141060A4CE5F9]-worker] solr.SolrTestCaseJ4 (SolrTestCaseJ4.java:deleteCore(559)) - ###deleteCore
   [junit4]   1> 2014-01-30 13:44:47,514 INFO  [SUITE-SolrCellMorphlineTest-seed#[A32141060A4CE5F9]-worker] core.CoreContainer (CoreContainer.java:shutdown(360)) - Shutting down CoreContainer instance=18117062
   [junit4]   1> 2014-01-30 13:44:47,515 INFO  [SUITE-SolrCellMorphlineTest-seed#[A32141060A4CE5F9]-worker] core.SolrCore (SolrCore.java:close(1001)) - [collection1]  CLOSING SolrCore org.apache.solr.core.SolrCore@19974bd
   [junit4]   1> 2014-01-30 13:44:47,516 INFO  [SUITE-SolrCellMorphlineTest-seed#[A32141060A4CE5F9]-worker] update.UpdateHandler (DirectUpdateHandler2.java:close(687)) - closing DirectUpdateHandler2{commits=36,autocommit maxTime=60000ms,autocommits=0,soft autocommit maxTime=1000ms,soft autocommits=0,optimizes=0,rollbacks=0,expungeDeletes=0,docsPending=3,adds=0,deletesById=0,deletesByQuery=0,errors=0,cumulative_adds=41,cumulative_deletesById=0,cumulative_deletesByQuery=9,cumulative_errors=0,transaction_logs_total_size=53339,transaction_logs_total_number=9}
   [junit4]   1> 2014-01-30 13:44:47,516 INFO  [SUITE-SolrCellMorphlineTest-seed#[A32141060A4CE5F9]-worker] update.SolrCoreState (SolrCoreState.java:decrefSolrCoreState(71)) - Closing SolrCoreState
   [junit4]   1> 2014-01-30 13:44:47,517 INFO  [SUITE-SolrCellMorphlineTest-seed#[A32141060A4CE5F9]-worker] update.DefaultSolrCoreState (DefaultSolrCoreState.java:closeIndexWriter(65)) - SolrCoreState ref count has reached 0 - closing IndexWriter
   [junit4]   1> 2014-01-30 13:44:47,517 INFO  [SUITE-SolrCellMorphlineTest-seed#[A32141060A4CE5F9]-worker] update.DefaultSolrCoreState (DefaultSolrCoreState.java:closeIndexWriter(67)) - closing IndexWriter with IndexWriterCloser
   [junit4]   1> 2014-01-30 13:44:47,518 INFO  [SUITE-SolrCellMorphlineTest-seed#[A32141060A4CE5F9]-worker] core.SolrCore (SolrDeletionPolicy.java:onCommit(98)) - SolrDeletionPolicy.onCommit: commits: num=2
   [junit4]   1> 	commit{dir=MockDirectoryWrapper(org.apache.lucene.store.RAMDirectory@35210f lockFactory=org.apache.lucene.store.NativeFSLockFactory@12bb98c),segFN=segments_4,generation=4}
   [junit4]   1> 	commit{dir=MockDirectoryWrapper(org.apache.lucene.store.RAMDirectory@35210f lockFactory=org.apache.lucene.store.NativeFSLockFactory@12bb98c),segFN=segments_5,generation=5}
   [junit4]   1> 2014-01-30 13:44:47,518 INFO  [SUITE-SolrCellMorphlineTest-seed#[A32141060A4CE5F9]-worker] core.SolrCore (SolrDeletionPolicy.java:updateCommits(165)) - newest commit generation = 5
   [junit4]   1> 2014-01-30 13:44:47,519 INFO  [SUITE-SolrCellMorphlineTest-seed#[A32141060A4CE5F9]-worker] core.SolrCore (SolrCore.java:closeSearcher(1884)) - [collection1] Closing main searcher on request.
   [junit4]   1> 2014-01-30 13:44:47,520 INFO  [SUITE-SolrCellMorphlineTest-seed#[A32141060A4CE5F9]-worker] core.CachingDirectoryFactory (CachingDirectoryFactory.java:close(168)) - Closing MockDirectoryFactory - 2 directories currently being tracked
   [junit4]   1> 2014-01-30 13:44:47,521 INFO  [SUITE-SolrCellMorphlineTest-seed#[A32141060A4CE5F9]-worker] core.CachingDirectoryFactory (CachingDirectoryFactory.java:closeCacheValue(235)) - looking to close /mnt/ssd/jenkins/workspace/Lucene-Solr-trunk-Linux/solr/build/contrib/solr-morphlines-cell/test/J0/./solrtest-SolrCellMorphlineTest-1391089464982 [CachedDir<<refCount=0;path=/mnt/ssd/jenkins/workspace/Lucene-Solr-trunk-Linux/solr/build/contrib/solr-morphlines-cell/test/J0/./solrtest-SolrCellMorphlineTest-1391089464982;done=false>>]
   [junit4]   1> 2014-01-30 13:44:47,521 INFO  [SUITE-SolrCellMorphlineTest-seed#[A32141060A4CE5F9]-worker] core.CachingDirectoryFactory (CachingDirectoryFactory.java:close(304)) - Closing directory: /mnt/ssd/jenkins/workspace/Lucene-Solr-trunk-Linux/solr/build/contrib/solr-morphlines-cell/test/J0/./solrtest-SolrCellMorphlineTest-1391089464982
   [junit4]   1> 2014-01-30 13:44:47,521 INFO  [SUITE-SolrCellMorphlineTest-seed#[A32141060A4CE5F9]-worker] core.CachingDirectoryFactory (CachingDirectoryFactory.java:closeCacheValue(235)) - looking to close /mnt/ssd/jenkins/workspace/Lucene-Solr-trunk-Linux/solr/build/contrib/solr-morphlines-cell/test/J0/./solrtest-SolrCellMorphlineTest-1391089464982/index [CachedDir<<refCount=0;path=/mnt/ssd/jenkins/workspace/Lucene-Solr-trunk-Linux/solr/build/contrib/solr-morphlines-cell/test/J0/./solrtest-SolrCellMorphlineTest-1391089464982/index;done=false>>]
   [junit4]   1> 2014-01-30 13:44:47,522 INFO  [SUITE-SolrCellMorphlineTest-seed#[A32141060A4CE5F9]-worker] core.CachingDirectoryFactory (CachingDirectoryFactory.java:close(304)) - Closing directory: /mnt/ssd/jenkins/workspace/Lucene-Solr-trunk-Linux/solr/build/contrib/solr-morphlines-cell/test/J0/./solrtest-SolrCellMorphlineTest-1391089464982/index
   [junit4]   2> NOTE: test params are: codec=Lucene46: {}, docValues:{}, sim=RandomSimilarityProvider(queryNorm=false,coord=crazy): {}, locale=th_TH, timezone=Asia/Riyadh
   [junit4]   2> NOTE: Linux 3.8.0-35-generic i386/Oracle Corporation 1.7.0_60-ea (32-bit)/cpus=8,threads=1,free=65584376,total=223346688
   [junit4]   2> NOTE: All tests run in this JVM: [SolrCellMorphlineTest]
   [junit4] Completed in 23.27s, 5 tests, 1 failure <<< FAILURES!

[...truncated 9 lines...]
BUILD FAILED
/mnt/ssd/jenkins/workspace/Lucene-Solr-trunk-Linux/build.xml:453: The following error occurred while executing this line:
/mnt/ssd/jenkins/workspace/Lucene-Solr-trunk-Linux/build.xml:433: The following error occurred while executing this line:
/mnt/ssd/jenkins/workspace/Lucene-Solr-trunk-Linux/build.xml:39: The following error occurred while executing this line:
/mnt/ssd/jenkins/workspace/Lucene-Solr-trunk-Linux/extra-targets.xml:37: The following error occurred while executing this line:
/mnt/ssd/jenkins/workspace/Lucene-Solr-trunk-Linux/solr/build.xml:209: The following error occurred while executing this line:
/mnt/ssd/jenkins/workspace/Lucene-Solr-trunk-Linux/solr/common-build.xml:441: The following error occurred while executing this line:
/mnt/ssd/jenkins/workspace/Lucene-Solr-trunk-Linux/solr/common-build.xml:491: The following error occurred while executing this line:
/mnt/ssd/jenkins/workspace/Lucene-Solr-trunk-Linux/lucene/common-build.xml:1268: The following error occurred while executing this line:
/mnt/ssd/jenkins/workspace/Lucene-Solr-trunk-Linux/lucene/common-build.xml:901: There were test failures: 1 suite, 5 tests, 1 failure

Total time: 49 minutes 10 seconds
Build step 'Invoke Ant' marked build as failure
Description set: Java: 32bit/jdk1.7.0_60-ea-b03 -client -XX:+UseParallelGC
Archiving artifacts
Recording test results
Email was triggered for: Failure
Sending email for trigger: Failure



Mime
View raw message