lucene-dev mailing list archives

Site index · List index
Message view « Date » · « Thread »
Top « Date » · « Thread »
From Policeman Jenkins Server <jenk...@thetaphi.de>
Subject [JENKINS] Lucene-Solr-4.x-Linux (32bit/jdk1.7.0_51) - Build # 9181 - Failure!
Date Wed, 29 Jan 2014 17:42:45 GMT
Build: http://jenkins.thetaphi.de/job/Lucene-Solr-4.x-Linux/9181/
Java: 32bit/jdk1.7.0_51 -client -XX:+UseParallelGC

2 tests failed.
REGRESSION:  org.apache.solr.cloud.CollectionsAPIDistributedZkTest.testDistribSearch

Error Message:
Still found collection that should be gone

Stack Trace:
java.lang.AssertionError: Still found collection that should be gone
	at __randomizedtesting.SeedInfo.seed([711248A2178AAC89:F0F4C6BA60D5CCB5]:0)
	at org.junit.Assert.fail(Assert.java:93)
	at org.junit.Assert.assertTrue(Assert.java:43)
	at org.junit.Assert.assertFalse(Assert.java:68)
	at org.apache.solr.cloud.CollectionsAPIDistributedZkTest.deleteCollectionWithDownNodes(CollectionsAPIDistributedZkTest.java:395)
	at org.apache.solr.cloud.CollectionsAPIDistributedZkTest.doTest(CollectionsAPIDistributedZkTest.java:203)
	at org.apache.solr.BaseDistributedSearchTestCase.testDistribSearch(BaseDistributedSearchTestCase.java:867)
	at sun.reflect.NativeMethodAccessorImpl.invoke0(Native Method)
	at sun.reflect.NativeMethodAccessorImpl.invoke(NativeMethodAccessorImpl.java:57)
	at sun.reflect.DelegatingMethodAccessorImpl.invoke(DelegatingMethodAccessorImpl.java:43)
	at java.lang.reflect.Method.invoke(Method.java:606)
	at com.carrotsearch.randomizedtesting.RandomizedRunner.invoke(RandomizedRunner.java:1559)
	at com.carrotsearch.randomizedtesting.RandomizedRunner.access$600(RandomizedRunner.java:79)
	at com.carrotsearch.randomizedtesting.RandomizedRunner$6.evaluate(RandomizedRunner.java:737)
	at com.carrotsearch.randomizedtesting.RandomizedRunner$7.evaluate(RandomizedRunner.java:773)
	at com.carrotsearch.randomizedtesting.RandomizedRunner$8.evaluate(RandomizedRunner.java:787)
	at com.carrotsearch.randomizedtesting.rules.SystemPropertiesRestoreRule$1.evaluate(SystemPropertiesRestoreRule.java:53)
	at org.apache.lucene.util.TestRuleSetupTeardownChained$1.evaluate(TestRuleSetupTeardownChained.java:50)
	at org.apache.lucene.util.TestRuleFieldCacheSanity$1.evaluate(TestRuleFieldCacheSanity.java:51)
	at org.apache.lucene.util.AbstractBeforeAfterRule$1.evaluate(AbstractBeforeAfterRule.java:46)
	at com.carrotsearch.randomizedtesting.rules.SystemPropertiesInvariantRule$1.evaluate(SystemPropertiesInvariantRule.java:55)
	at org.apache.lucene.util.TestRuleThreadAndTestName$1.evaluate(TestRuleThreadAndTestName.java:49)
	at org.apache.lucene.util.TestRuleIgnoreAfterMaxFailures$1.evaluate(TestRuleIgnoreAfterMaxFailures.java:70)
	at org.apache.lucene.util.TestRuleMarkFailure$1.evaluate(TestRuleMarkFailure.java:48)
	at com.carrotsearch.randomizedtesting.rules.StatementAdapter.evaluate(StatementAdapter.java:36)
	at com.carrotsearch.randomizedtesting.ThreadLeakControl$StatementRunner.run(ThreadLeakControl.java:358)
	at com.carrotsearch.randomizedtesting.ThreadLeakControl.forkTimeoutingTask(ThreadLeakControl.java:782)
	at com.carrotsearch.randomizedtesting.ThreadLeakControl$3.evaluate(ThreadLeakControl.java:442)
	at com.carrotsearch.randomizedtesting.RandomizedRunner.runSingleTest(RandomizedRunner.java:746)
	at com.carrotsearch.randomizedtesting.RandomizedRunner$3.evaluate(RandomizedRunner.java:648)
	at com.carrotsearch.randomizedtesting.RandomizedRunner$4.evaluate(RandomizedRunner.java:682)
	at com.carrotsearch.randomizedtesting.RandomizedRunner$5.evaluate(RandomizedRunner.java:693)
	at com.carrotsearch.randomizedtesting.rules.StatementAdapter.evaluate(StatementAdapter.java:36)
	at com.carrotsearch.randomizedtesting.rules.SystemPropertiesRestoreRule$1.evaluate(SystemPropertiesRestoreRule.java:53)
	at org.apache.lucene.util.AbstractBeforeAfterRule$1.evaluate(AbstractBeforeAfterRule.java:46)
	at org.apache.lucene.util.TestRuleStoreClassName$1.evaluate(TestRuleStoreClassName.java:42)
	at com.carrotsearch.randomizedtesting.rules.SystemPropertiesInvariantRule$1.evaluate(SystemPropertiesInvariantRule.java:55)
	at com.carrotsearch.randomizedtesting.rules.NoShadowingOrOverridesOnMethodsRule$1.evaluate(NoShadowingOrOverridesOnMethodsRule.java:39)
	at com.carrotsearch.randomizedtesting.rules.NoShadowingOrOverridesOnMethodsRule$1.evaluate(NoShadowingOrOverridesOnMethodsRule.java:39)
	at com.carrotsearch.randomizedtesting.rules.StatementAdapter.evaluate(StatementAdapter.java:36)
	at org.apache.lucene.util.TestRuleAssertionsRequired$1.evaluate(TestRuleAssertionsRequired.java:43)
	at org.apache.lucene.util.TestRuleMarkFailure$1.evaluate(TestRuleMarkFailure.java:48)
	at org.apache.lucene.util.TestRuleIgnoreAfterMaxFailures$1.evaluate(TestRuleIgnoreAfterMaxFailures.java:70)
	at org.apache.lucene.util.TestRuleIgnoreTestSuites$1.evaluate(TestRuleIgnoreTestSuites.java:55)
	at com.carrotsearch.randomizedtesting.rules.StatementAdapter.evaluate(StatementAdapter.java:36)
	at com.carrotsearch.randomizedtesting.ThreadLeakControl$StatementRunner.run(ThreadLeakControl.java:358)
	at java.lang.Thread.run(Thread.java:744)


REGRESSION:  org.apache.solr.cloud.OverseerRolesTest.testDistribSearch

Error Message:
Captured an uncaught exception in thread: Thread[id=2696, name=Overseer-91161665730117642-127.0.0.1:46953_pc_aq%2Fry-n_0000000043, state=RUNNABLE, group=Overseer collection creation process.]

Stack Trace:
com.carrotsearch.randomizedtesting.UncaughtExceptionError: Captured an uncaught exception in thread: Thread[id=2696, name=Overseer-91161665730117642-127.0.0.1:46953_pc_aq%2Fry-n_0000000043, state=RUNNABLE, group=Overseer collection creation process.]
	at __randomizedtesting.SeedInfo.seed([711248A2178AAC89:F0F4C6BA60D5CCB5]:0)
Caused by: org.apache.solr.common.cloud.ZooKeeperException: 
	at __randomizedtesting.SeedInfo.seed([711248A2178AAC89]:0)
	at org.apache.solr.cloud.OverseerCollectionProcessor.run(OverseerCollectionProcessor.java:202)
	at java.lang.Thread.run(Thread.java:744)
Caused by: org.apache.zookeeper.KeeperException$NoNodeException: KeeperErrorCode = NoNode for /overseer/collection-queue-work/qn-0000000004
	at org.apache.zookeeper.KeeperException.create(KeeperException.java:111)
	at org.apache.zookeeper.KeeperException.create(KeeperException.java:51)
	at org.apache.zookeeper.ZooKeeper.getData(ZooKeeper.java:1151)
	at org.apache.solr.common.cloud.SolrZkClient$7.execute(SolrZkClient.java:273)
	at org.apache.solr.common.cloud.SolrZkClient$7.execute(SolrZkClient.java:270)
	at org.apache.solr.common.cloud.ZkCmdExecutor.retryOperation(ZkCmdExecutor.java:73)
	at org.apache.solr.common.cloud.SolrZkClient.getData(SolrZkClient.java:270)
	at org.apache.solr.cloud.DistributedQueue.remove(DistributedQueue.java:192)
	at org.apache.solr.cloud.OverseerCollectionProcessor.run(OverseerCollectionProcessor.java:193)
	... 1 more




Build Log:
[...truncated 10610 lines...]
   [junit4] Suite: org.apache.solr.cloud.OverseerRolesTest
   [junit4]   2> 719095 T2498 oas.BaseDistributedSearchTestCase.initHostContext Setting hostContext system property: /pc_aq/ry
   [junit4]   2> 719098 T2498 oas.SolrTestCaseJ4.setUp ###Starting testDistribSearch
   [junit4]   2> Creating dataDir: /mnt/ssd/jenkins/workspace/Lucene-Solr-4.x-Linux/solr/build/solr-core/test/J0/./solrtest-OverseerRolesTest-1391016627960
   [junit4]   2> 719098 T2498 oasc.ZkTestServer.run STARTING ZK TEST SERVER
   [junit4]   2> 719099 T2499 oasc.ZkTestServer$ZKServerMain.runFromConfig Starting server
   [junit4]   2> 719199 T2498 oasc.ZkTestServer.run start zk server on port:41859
   [junit4]   2> 719200 T2498 oascc.ConnectionManager.waitForConnected Waiting for client to connect to ZooKeeper
   [junit4]   2> 719202 T2505 oascc.ConnectionManager.process Watcher org.apache.solr.common.cloud.ConnectionManager@ed61ec name:ZooKeeperConnection Watcher:127.0.0.1:41859 got event WatchedEvent state:SyncConnected type:None path:null path:null type:None
   [junit4]   2> 719203 T2498 oascc.ConnectionManager.waitForConnected Client is connected to ZooKeeper
   [junit4]   2> 719203 T2498 oascc.SolrZkClient.makePath makePath: /solr
   [junit4]   2> 719206 T2498 oascc.ConnectionManager.waitForConnected Waiting for client to connect to ZooKeeper
   [junit4]   2> 719207 T2507 oascc.ConnectionManager.process Watcher org.apache.solr.common.cloud.ConnectionManager@14ce81c name:ZooKeeperConnection Watcher:127.0.0.1:41859/solr got event WatchedEvent state:SyncConnected type:None path:null path:null type:None
   [junit4]   2> 719207 T2498 oascc.ConnectionManager.waitForConnected Client is connected to ZooKeeper
   [junit4]   2> 719208 T2498 oascc.SolrZkClient.makePath makePath: /collections/collection1
   [junit4]   2> 719210 T2498 oascc.SolrZkClient.makePath makePath: /collections/collection1/shards
   [junit4]   2> 719212 T2498 oascc.SolrZkClient.makePath makePath: /collections/control_collection
   [junit4]   2> 719213 T2498 oascc.SolrZkClient.makePath makePath: /collections/control_collection/shards
   [junit4]   2> 719215 T2498 oasc.AbstractZkTestCase.putConfig put /mnt/ssd/jenkins/workspace/Lucene-Solr-4.x-Linux/solr/build/solr-core/test-files/solr/collection1/conf/solrconfig-tlog.xml to /configs/conf1/solrconfig.xml
   [junit4]   2> 719215 T2498 oascc.SolrZkClient.makePath makePath: /configs/conf1/solrconfig.xml
   [junit4]   2> 719218 T2498 oasc.AbstractZkTestCase.putConfig put /mnt/ssd/jenkins/workspace/Lucene-Solr-4.x-Linux/solr/build/solr-core/test-files/solr/collection1/conf/schema.xml to /configs/conf1/schema.xml
   [junit4]   2> 719219 T2498 oascc.SolrZkClient.makePath makePath: /configs/conf1/schema.xml
   [junit4]   2> 719221 T2498 oasc.AbstractZkTestCase.putConfig put /mnt/ssd/jenkins/workspace/Lucene-Solr-4.x-Linux/solr/build/solr-core/test-files/solr/collection1/conf/solrconfig.snippet.randomindexconfig.xml to /configs/conf1/solrconfig.snippet.randomindexconfig.xml
   [junit4]   2> 719222 T2498 oascc.SolrZkClient.makePath makePath: /configs/conf1/solrconfig.snippet.randomindexconfig.xml
   [junit4]   2> 719224 T2498 oasc.AbstractZkTestCase.putConfig put /mnt/ssd/jenkins/workspace/Lucene-Solr-4.x-Linux/solr/build/solr-core/test-files/solr/collection1/conf/stopwords.txt to /configs/conf1/stopwords.txt
   [junit4]   2> 719224 T2498 oascc.SolrZkClient.makePath makePath: /configs/conf1/stopwords.txt
   [junit4]   2> 719226 T2498 oasc.AbstractZkTestCase.putConfig put /mnt/ssd/jenkins/workspace/Lucene-Solr-4.x-Linux/solr/build/solr-core/test-files/solr/collection1/conf/protwords.txt to /configs/conf1/protwords.txt
   [junit4]   2> 719226 T2498 oascc.SolrZkClient.makePath makePath: /configs/conf1/protwords.txt
   [junit4]   2> 719230 T2498 oasc.AbstractZkTestCase.putConfig put /mnt/ssd/jenkins/workspace/Lucene-Solr-4.x-Linux/solr/build/solr-core/test-files/solr/collection1/conf/currency.xml to /configs/conf1/currency.xml
   [junit4]   2> 719231 T2498 oascc.SolrZkClient.makePath makePath: /configs/conf1/currency.xml
   [junit4]   2> 719232 T2498 oasc.AbstractZkTestCase.putConfig put /mnt/ssd/jenkins/workspace/Lucene-Solr-4.x-Linux/solr/build/solr-core/test-files/solr/collection1/conf/enumsConfig.xml to /configs/conf1/enumsConfig.xml
   [junit4]   2> 719233 T2498 oascc.SolrZkClient.makePath makePath: /configs/conf1/enumsConfig.xml
   [junit4]   2> 719235 T2498 oasc.AbstractZkTestCase.putConfig put /mnt/ssd/jenkins/workspace/Lucene-Solr-4.x-Linux/solr/build/solr-core/test-files/solr/collection1/conf/open-exchange-rates.json to /configs/conf1/open-exchange-rates.json
   [junit4]   2> 719235 T2498 oascc.SolrZkClient.makePath makePath: /configs/conf1/open-exchange-rates.json
   [junit4]   2> 719237 T2498 oasc.AbstractZkTestCase.putConfig put /mnt/ssd/jenkins/workspace/Lucene-Solr-4.x-Linux/solr/build/solr-core/test-files/solr/collection1/conf/mapping-ISOLatin1Accent.txt to /configs/conf1/mapping-ISOLatin1Accent.txt
   [junit4]   2> 719237 T2498 oascc.SolrZkClient.makePath makePath: /configs/conf1/mapping-ISOLatin1Accent.txt
   [junit4]   2> 719239 T2498 oasc.AbstractZkTestCase.putConfig put /mnt/ssd/jenkins/workspace/Lucene-Solr-4.x-Linux/solr/build/solr-core/test-files/solr/collection1/conf/old_synonyms.txt to /configs/conf1/old_synonyms.txt
   [junit4]   2> 719240 T2498 oascc.SolrZkClient.makePath makePath: /configs/conf1/old_synonyms.txt
   [junit4]   2> 719241 T2498 oasc.AbstractZkTestCase.putConfig put /mnt/ssd/jenkins/workspace/Lucene-Solr-4.x-Linux/solr/build/solr-core/test-files/solr/collection1/conf/synonyms.txt to /configs/conf1/synonyms.txt
   [junit4]   2> 719242 T2498 oascc.SolrZkClient.makePath makePath: /configs/conf1/synonyms.txt
   [junit4]   2> 719307 T2498 oejs.Server.doStart jetty-8.1.10.v20130312
   [junit4]   2> 719310 T2498 oejs.AbstractConnector.doStart Started SelectChannelConnector@127.0.0.1:52874
   [junit4]   2> 719310 T2498 oass.SolrDispatchFilter.init SolrDispatchFilter.init()
   [junit4]   2> 719311 T2498 oasc.SolrResourceLoader.locateSolrHome JNDI not configured for solr (NoInitialContextEx)
   [junit4]   2> 719311 T2498 oasc.SolrResourceLoader.locateSolrHome using system property solr.solr.home: ./org.apache.solr.cloud.OverseerRolesTest-controljetty-1391016628106
   [junit4]   2> 719311 T2498 oasc.SolrResourceLoader.<init> new SolrResourceLoader for directory: './org.apache.solr.cloud.OverseerRolesTest-controljetty-1391016628106/'
   [junit4]   2> 719322 T2498 oasc.ConfigSolr.fromFile Loading container configuration from /mnt/ssd/jenkins/workspace/Lucene-Solr-4.x-Linux/solr/build/solr-core/test/J0/./org.apache.solr.cloud.OverseerRolesTest-controljetty-1391016628106/solr.xml
   [junit4]   2> 719363 T2498 oasc.ConfigSolrXml.<init> Config-defined core root directory: 
   [junit4]   2> 719364 T2498 oasc.CoreContainer.<init> New CoreContainer 28081178
   [junit4]   2> 719364 T2498 oasc.CoreContainer.load Loading cores into CoreContainer [instanceDir=./org.apache.solr.cloud.OverseerRolesTest-controljetty-1391016628106/]
   [junit4]   2> 719365 T2498 oashc.HttpShardHandlerFactory.getParameter Setting socketTimeout to: 90000
   [junit4]   2> 719365 T2498 oashc.HttpShardHandlerFactory.getParameter Setting urlScheme to: http://
   [junit4]   2> 719366 T2498 oashc.HttpShardHandlerFactory.getParameter Setting connTimeout to: 15000
   [junit4]   2> 719366 T2498 oashc.HttpShardHandlerFactory.getParameter Setting maxConnectionsPerHost to: 20
   [junit4]   2> 719366 T2498 oashc.HttpShardHandlerFactory.getParameter Setting corePoolSize to: 0
   [junit4]   2> 719367 T2498 oashc.HttpShardHandlerFactory.getParameter Setting maximumPoolSize to: 2147483647
   [junit4]   2> 719367 T2498 oashc.HttpShardHandlerFactory.getParameter Setting maxThreadIdleTime to: 5
   [junit4]   2> 719367 T2498 oashc.HttpShardHandlerFactory.getParameter Setting sizeOfQueue to: -1
   [junit4]   2> 719367 T2498 oashc.HttpShardHandlerFactory.getParameter Setting fairnessPolicy to: false
   [junit4]   2> 719370 T2498 oasl.LogWatcher.createWatcher SLF4J impl is org.slf4j.impl.Log4jLoggerFactory
   [junit4]   2> 719370 T2498 oasl.LogWatcher.newRegisteredLogWatcher Registering Log Listener [Log4j (org.slf4j.impl.Log4jLoggerFactory)]
   [junit4]   2> 719370 T2498 oasc.CoreContainer.load Host Name: 127.0.0.1
   [junit4]   2> 719370 T2498 oasc.ZkContainer.initZooKeeper Zookeeper client=127.0.0.1:41859/solr
   [junit4]   2> 719371 T2498 oasc.ZkController.checkChrootPath zkHost includes chroot
   [junit4]   2> 719372 T2498 oascc.ConnectionManager.waitForConnected Waiting for client to connect to ZooKeeper
   [junit4]   2> 719373 T2518 oascc.ConnectionManager.process Watcher org.apache.solr.common.cloud.ConnectionManager@107bcf4 name:ZooKeeperConnection Watcher:127.0.0.1:41859 got event WatchedEvent state:SyncConnected type:None path:null path:null type:None
   [junit4]   2> 719373 T2498 oascc.ConnectionManager.waitForConnected Client is connected to ZooKeeper
   [junit4]   2> 719375 T2498 oascc.ConnectionManager.waitForConnected Waiting for client to connect to ZooKeeper
   [junit4]   2> 719376 T2520 oascc.ConnectionManager.process Watcher org.apache.solr.common.cloud.ConnectionManager@b8fb7e name:ZooKeeperConnection Watcher:127.0.0.1:41859/solr got event WatchedEvent state:SyncConnected type:None path:null path:null type:None
   [junit4]   2> 719377 T2498 oascc.ConnectionManager.waitForConnected Client is connected to ZooKeeper
   [junit4]   2> 719379 T2498 oascc.SolrZkClient.makePath makePath: /overseer/queue
   [junit4]   2> 719383 T2498 oascc.SolrZkClient.makePath makePath: /overseer/collection-queue-work
   [junit4]   2> 719385 T2498 oascc.SolrZkClient.makePath makePath: /live_nodes
   [junit4]   2> 719386 T2498 oasc.ZkController.createEphemeralLiveNode Register node as live in ZooKeeper:/live_nodes/127.0.0.1:52874_pc_aq%2Fry
   [junit4]   2> 719387 T2498 oascc.SolrZkClient.makePath makePath: /live_nodes/127.0.0.1:52874_pc_aq%2Fry
   [junit4]   2> 719389 T2498 oascc.SolrZkClient.makePath makePath: /overseer_elect
   [junit4]   2> 719391 T2498 oascc.SolrZkClient.makePath makePath: /overseer_elect/election
   [junit4]   2> 719394 T2498 oasc.OverseerElectionContext.runLeaderProcess I am going to be the leader 127.0.0.1:52874_pc_aq%2Fry
   [junit4]   2> 719395 T2498 oascc.SolrZkClient.makePath makePath: /overseer_elect/leader
   [junit4]   2> 719397 T2498 oasc.Overseer.start Overseer (id=91161665730117635-127.0.0.1:52874_pc_aq%2Fry-n_0000000000) starting
   [junit4]   2> 719399 T2498 oascc.SolrZkClient.makePath makePath: /overseer/queue-work
   [junit4]   2> 719401 T2522 oasc.OverseerCollectionProcessor.run Process current queue of collection creations
   [junit4]   2> 719402 T2498 oascc.SolrZkClient.makePath makePath: /clusterstate.json
   [junit4]   2> 719402 T2522 oasc.OverseerCollectionProcessor.prioritizeOverseerNodes prioritizing overseer nodes
   [junit4]   2> 719404 T2498 oascc.SolrZkClient.makePath makePath: /aliases.json
   [junit4]   2> 719406 T2498 oascc.ZkStateReader.createClusterStateWatchersAndUpdate Updating cluster state from ZooKeeper... 
   [junit4]   2> 719408 T2521 oasc.Overseer$ClusterStateUpdater.run Starting to work on the main queue
   [junit4]   2> 719410 T2498 oasc.CorePropertiesLocator.discover Looking for core definitions underneath /mnt/ssd/jenkins/workspace/Lucene-Solr-4.x-Linux/solr/build/solr-core/test/J0/./org.apache.solr.cloud.OverseerRolesTest-controljetty-1391016628106
   [junit4]   2> 719410 T2498 oasc.CorePropertiesLocator.discoverUnder Found core conf in /mnt/ssd/jenkins/workspace/Lucene-Solr-4.x-Linux/solr/build/solr-core/test/J0/./org.apache.solr.cloud.OverseerRolesTest-controljetty-1391016628106/conf/
   [junit4]   2> 719434 T2498 oasc.CorePropertiesLocator.discover Found 1 core definitions
   [junit4]   2> 719435 T2498 oass.SolrDispatchFilter.init user.dir=/mnt/ssd/jenkins/workspace/Lucene-Solr-4.x-Linux/solr/build/solr-core/test/J0
   [junit4]   2> 719436 T2498 oass.SolrDispatchFilter.init SolrDispatchFilter.init() done
   [junit4]   2> 719437 T2498 oascc.ConnectionManager.waitForConnected Waiting for client to connect to ZooKeeper
   [junit4]   2> 719440 T2525 oascc.ConnectionManager.process Watcher org.apache.solr.common.cloud.ConnectionManager@105e5d5 name:ZooKeeperConnection Watcher:127.0.0.1:41859/solr got event WatchedEvent state:SyncConnected type:None path:null path:null type:None
   [junit4]   2> 719440 T2498 oascc.ConnectionManager.waitForConnected Client is connected to ZooKeeper
   [junit4]   2> 719443 T2498 oascc.ZkStateReader.createClusterStateWatchersAndUpdate Updating cluster state from ZooKeeper... 
   [junit4]   2> 719447 T2498 oasc.ChaosMonkey.monkeyLog monkey: init - expire sessions:false cause connection loss:false
   [junit4]   2> 719515 T2498 oasc.AbstractFullDistribZkTestBase.createJettys create jetty 1
   [junit4]   2> 719516 T2498 oejs.Server.doStart jetty-8.1.10.v20130312
   [junit4]   2> 719518 T2498 oejs.AbstractConnector.doStart Started SelectChannelConnector@127.0.0.1:42587
   [junit4]   2> 719519 T2498 oass.SolrDispatchFilter.init SolrDispatchFilter.init()
   [junit4]   2> 719519 T2498 oasc.SolrResourceLoader.locateSolrHome JNDI not configured for solr (NoInitialContextEx)
   [junit4]   2> 719519 T2498 oasc.SolrResourceLoader.locateSolrHome using system property solr.solr.home: ./org.apache.solr.cloud.OverseerRolesTest-jetty1-1391016628309
   [junit4]   2> 719520 T2498 oasc.SolrResourceLoader.<init> new SolrResourceLoader for directory: './org.apache.solr.cloud.OverseerRolesTest-jetty1-1391016628309/'
   [junit4]   2> 719534 T2498 oasc.ConfigSolr.fromFile Loading container configuration from /mnt/ssd/jenkins/workspace/Lucene-Solr-4.x-Linux/solr/build/solr-core/test/J0/./org.apache.solr.cloud.OverseerRolesTest-jetty1-1391016628309/solr.xml
   [junit4]   2> 719575 T2498 oasc.ConfigSolrXml.<init> Config-defined core root directory: 
   [junit4]   2> 719575 T2498 oasc.CoreContainer.<init> New CoreContainer 29240863
   [junit4]   2> 719575 T2498 oasc.CoreContainer.load Loading cores into CoreContainer [instanceDir=./org.apache.solr.cloud.OverseerRolesTest-jetty1-1391016628309/]
   [junit4]   2> 719577 T2498 oashc.HttpShardHandlerFactory.getParameter Setting socketTimeout to: 90000
   [junit4]   2> 719577 T2498 oashc.HttpShardHandlerFactory.getParameter Setting urlScheme to: http://
   [junit4]   2> 719577 T2498 oashc.HttpShardHandlerFactory.getParameter Setting connTimeout to: 15000
   [junit4]   2> 719577 T2498 oashc.HttpShardHandlerFactory.getParameter Setting maxConnectionsPerHost to: 20
   [junit4]   2> 719578 T2498 oashc.HttpShardHandlerFactory.getParameter Setting corePoolSize to: 0
   [junit4]   2> 719578 T2498 oashc.HttpShardHandlerFactory.getParameter Setting maximumPoolSize to: 2147483647
   [junit4]   2> 719578 T2498 oashc.HttpShardHandlerFactory.getParameter Setting maxThreadIdleTime to: 5
   [junit4]   2> 719579 T2498 oashc.HttpShardHandlerFactory.getParameter Setting sizeOfQueue to: -1
   [junit4]   2> 719579 T2498 oashc.HttpShardHandlerFactory.getParameter Setting fairnessPolicy to: false
   [junit4]   2> 719581 T2498 oasl.LogWatcher.createWatcher SLF4J impl is org.slf4j.impl.Log4jLoggerFactory
   [junit4]   2> 719581 T2498 oasl.LogWatcher.newRegisteredLogWatcher Registering Log Listener [Log4j (org.slf4j.impl.Log4jLoggerFactory)]
   [junit4]   2> 719581 T2498 oasc.CoreContainer.load Host Name: 127.0.0.1
   [junit4]   2> 719582 T2498 oasc.ZkContainer.initZooKeeper Zookeeper client=127.0.0.1:41859/solr
   [junit4]   2> 719582 T2498 oasc.ZkController.checkChrootPath zkHost includes chroot
   [junit4]   2> 719583 T2498 oascc.ConnectionManager.waitForConnected Waiting for client to connect to ZooKeeper
   [junit4]   2> 719584 T2536 oascc.ConnectionManager.process Watcher org.apache.solr.common.cloud.ConnectionManager@c60aa2 name:ZooKeeperConnection Watcher:127.0.0.1:41859 got event WatchedEvent state:SyncConnected type:None path:null path:null type:None
   [junit4]   2> 719584 T2498 oascc.ConnectionManager.waitForConnected Client is connected to ZooKeeper
   [junit4]   2> 719586 T2498 oascc.ConnectionManager.waitForConnected Waiting for client to connect to ZooKeeper
   [junit4]   2> 719587 T2538 oascc.ConnectionManager.process Watcher org.apache.solr.common.cloud.ConnectionManager@1a727fc name:ZooKeeperConnection Watcher:127.0.0.1:41859/solr got event WatchedEvent state:SyncConnected type:None path:null path:null type:None
   [junit4]   2> 719587 T2498 oascc.ConnectionManager.waitForConnected Client is connected to ZooKeeper
   [junit4]   2> 719590 T2498 oascc.ZkStateReader.createClusterStateWatchersAndUpdate Updating cluster state from ZooKeeper... 
   [junit4]   2> 720593 T2498 oasc.ZkController.createEphemeralLiveNode Register node as live in ZooKeeper:/live_nodes/127.0.0.1:42587_pc_aq%2Fry
   [junit4]   2> 720594 T2498 oascc.SolrZkClient.makePath makePath: /live_nodes/127.0.0.1:42587_pc_aq%2Fry
   [junit4]   2> 720597 T2520 oascc.ZkStateReader$3.process Updating live nodes... (2)
   [junit4]   2> 720597 T2525 oascc.ZkStateReader$3.process Updating live nodes... (2)
   [junit4]   2> 720598 T2538 oascc.ZkStateReader$3.process Updating live nodes... (2)
   [junit4]   2> 720604 T2498 oasc.CorePropertiesLocator.discover Looking for core definitions underneath /mnt/ssd/jenkins/workspace/Lucene-Solr-4.x-Linux/solr/build/solr-core/test/J0/./org.apache.solr.cloud.OverseerRolesTest-jetty1-1391016628309
   [junit4]   2> 720606 T2498 oasc.CorePropertiesLocator.discoverUnder Found core conf in /mnt/ssd/jenkins/workspace/Lucene-Solr-4.x-Linux/solr/build/solr-core/test/J0/./org.apache.solr.cloud.OverseerRolesTest-jetty1-1391016628309/conf/
   [junit4]   2> 720649 T2498 oasc.CorePropertiesLocator.discover Found 1 core definitions
   [junit4]   2> 720650 T2498 oass.SolrDispatchFilter.init user.dir=/mnt/ssd/jenkins/workspace/Lucene-Solr-4.x-Linux/solr/build/solr-core/test/J0
   [junit4]   2> 720651 T2498 oass.SolrDispatchFilter.init SolrDispatchFilter.init() done
   [junit4]   2> 720741 T2498 oasc.AbstractFullDistribZkTestBase.createJettys create jetty 2
   [junit4]   2> 720742 T2498 oejs.Server.doStart jetty-8.1.10.v20130312
   [junit4]   2> 720743 T2498 oejs.AbstractConnector.doStart Started SelectChannelConnector@127.0.0.1:48251
   [junit4]   2> 720744 T2498 oass.SolrDispatchFilter.init SolrDispatchFilter.init()
   [junit4]   2> 720745 T2498 oasc.SolrResourceLoader.locateSolrHome JNDI not configured for solr (NoInitialContextEx)
   [junit4]   2> 720745 T2498 oasc.SolrResourceLoader.locateSolrHome using system property solr.solr.home: ../../../../../../../../../../mnt/ssd/jenkins/workspace/Lucene-Solr-4.x-Linux/solr/build/solr-core/test/J0/./org.apache.solr.cloud.OverseerRolesTest-jetty2-1391016629513
   [junit4]   2> 720746 T2498 oasc.SolrResourceLoader.<init> new SolrResourceLoader for directory: '../../../../../../../../../../mnt/ssd/jenkins/workspace/Lucene-Solr-4.x-Linux/solr/build/solr-core/test/J0/./org.apache.solr.cloud.OverseerRolesTest-jetty2-1391016629513/'
   [junit4]   2> 720766 T2498 oasc.ConfigSolr.fromFile Loading container configuration from /mnt/ssd/jenkins/workspace/Lucene-Solr-4.x-Linux/solr/build/solr-core/test/J0/../../../../../../../../../../mnt/ssd/jenkins/workspace/Lucene-Solr-4.x-Linux/solr/build/solr-core/test/J0/./org.apache.solr.cloud.OverseerRolesTest-jetty2-1391016629513/solr.xml
   [junit4]   2> 720831 T2498 oasc.ConfigSolrXml.<init> Config-defined core root directory: 
   [junit4]   2> 720832 T2498 oasc.CoreContainer.<init> New CoreContainer 8247321
   [junit4]   2> 720833 T2498 oasc.CoreContainer.load Loading cores into CoreContainer [instanceDir=../../../../../../../../../../mnt/ssd/jenkins/workspace/Lucene-Solr-4.x-Linux/solr/build/solr-core/test/J0/./org.apache.solr.cloud.OverseerRolesTest-jetty2-1391016629513/]
   [junit4]   2> 720834 T2498 oashc.HttpShardHandlerFactory.getParameter Setting socketTimeout to: 90000
   [junit4]   2> 720835 T2498 oashc.HttpShardHandlerFactory.getParameter Setting urlScheme to: http://
   [junit4]   2> 720836 T2498 oashc.HttpShardHandlerFactory.getParameter Setting connTimeout to: 15000
   [junit4]   2> 720836 T2498 oashc.HttpShardHandlerFactory.getParameter Setting maxConnectionsPerHost to: 20
   [junit4]   2> 720837 T2498 oashc.HttpShardHandlerFactory.getParameter Setting corePoolSize to: 0
   [junit4]   2> 720837 T2498 oashc.HttpShardHandlerFactory.getParameter Setting maximumPoolSize to: 2147483647
   [junit4]   2> 720837 T2498 oashc.HttpShardHandlerFactory.getParameter Setting maxThreadIdleTime to: 5
   [junit4]   2> 720838 T2498 oashc.HttpShardHandlerFactory.getParameter Setting sizeOfQueue to: -1
   [junit4]   2> 720838 T2498 oashc.HttpShardHandlerFactory.getParameter Setting fairnessPolicy to: false
   [junit4]   2> 720842 T2498 oasl.LogWatcher.createWatcher SLF4J impl is org.slf4j.impl.Log4jLoggerFactory
   [junit4]   2> 720842 T2498 oasl.LogWatcher.newRegisteredLogWatcher Registering Log Listener [Log4j (org.slf4j.impl.Log4jLoggerFactory)]
   [junit4]   2> 720843 T2498 oasc.CoreContainer.load Host Name: 127.0.0.1
   [junit4]   2> 720843 T2498 oasc.ZkContainer.initZooKeeper Zookeeper client=127.0.0.1:41859/solr
   [junit4]   2> 720844 T2498 oasc.ZkController.checkChrootPath zkHost includes chroot
   [junit4]   2> 720846 T2498 oascc.ConnectionManager.waitForConnected Waiting for client to connect to ZooKeeper
   [junit4]   2> 720847 T2550 oascc.ConnectionManager.process Watcher org.apache.solr.common.cloud.ConnectionManager@1f6650d name:ZooKeeperConnection Watcher:127.0.0.1:41859 got event WatchedEvent state:SyncConnected type:None path:null path:null type:None
   [junit4]   2> 720847 T2498 oascc.ConnectionManager.waitForConnected Client is connected to ZooKeeper
   [junit4]   2> 720851 T2498 oascc.ConnectionManager.waitForConnected Waiting for client to connect to ZooKeeper
   [junit4]   2> 720856 T2552 oascc.ConnectionManager.process Watcher org.apache.solr.common.cloud.ConnectionManager@38b4f4 name:ZooKeeperConnection Watcher:127.0.0.1:41859/solr got event WatchedEvent state:SyncConnected type:None path:null path:null type:None
   [junit4]   2> 720857 T2498 oascc.ConnectionManager.waitForConnected Client is connected to ZooKeeper
   [junit4]   2> 720871 T2498 oascc.ZkStateReader.createClusterStateWatchersAndUpdate Updating cluster state from ZooKeeper... 
   [junit4]   2> 721875 T2498 oasc.ZkController.createEphemeralLiveNode Register node as live in ZooKeeper:/live_nodes/127.0.0.1:48251_pc_aq%2Fry
   [junit4]   2> 721876 T2498 oascc.SolrZkClient.makePath makePath: /live_nodes/127.0.0.1:48251_pc_aq%2Fry
   [junit4]   2> 721879 T2520 oascc.ZkStateReader$3.process Updating live nodes... (3)
   [junit4]   2> 721879 T2538 oascc.ZkStateReader$3.process Updating live nodes... (3)
   [junit4]   2> 721879 T2525 oascc.ZkStateReader$3.process Updating live nodes... (3)
   [junit4]   2> 721879 T2552 oascc.ZkStateReader$3.process Updating live nodes... (3)
   [junit4]   2> 721884 T2498 oasc.CorePropertiesLocator.discover Looking for core definitions underneath /mnt/ssd/jenkins/workspace/Lucene-Solr-4.x-Linux/solr/build/solr-core/test/J0/../../../../../../../../../../mnt/ssd/jenkins/workspace/Lucene-Solr-4.x-Linux/solr/build/solr-core/test/J0/./org.apache.solr.cloud.OverseerRolesTest-jetty2-1391016629513
   [junit4]   2> 721885 T2498 oasc.CorePropertiesLocator.discoverUnder Found core conf in /mnt/ssd/jenkins/workspace/Lucene-Solr-4.x-Linux/solr/build/solr-core/test/J0/../../../../../../../../../../mnt/ssd/jenkins/workspace/Lucene-Solr-4.x-Linux/solr/build/solr-core/test/J0/./org.apache.solr.cloud.OverseerRolesTest-jetty2-1391016629513/conf/
   [junit4]   2> 721917 T2498 oasc.CorePropertiesLocator.discover Found 1 core definitions
   [junit4]   2> 721918 T2498 oass.SolrDispatchFilter.init user.dir=/mnt/ssd/jenkins/workspace/Lucene-Solr-4.x-Linux/solr/build/solr-core/test/J0
   [junit4]   2> 721918 T2498 oass.SolrDispatchFilter.init SolrDispatchFilter.init() done
   [junit4]   2> 721985 T2498 oasc.AbstractFullDistribZkTestBase.createJettys create jetty 3
   [junit4]   2> 721986 T2498 oejs.Server.doStart jetty-8.1.10.v20130312
   [junit4]   2> 721988 T2498 oejs.AbstractConnector.doStart Started SelectChannelConnector@127.0.0.1:46953
   [junit4]   2> 721988 T2498 oass.SolrDispatchFilter.init SolrDispatchFilter.init()
   [junit4]   2> 721988 T2498 oasc.SolrResourceLoader.locateSolrHome JNDI not configured for solr (NoInitialContextEx)
   [junit4]   2> 721989 T2498 oasc.SolrResourceLoader.locateSolrHome using system property solr.solr.home: ./org.apache.solr.cloud.OverseerRolesTest-jetty3-1391016630780
   [junit4]   2> 721989 T2498 oasc.SolrResourceLoader.<init> new SolrResourceLoader for directory: './org.apache.solr.cloud.OverseerRolesTest-jetty3-1391016630780/'
   [junit4]   2> 722001 T2498 oasc.ConfigSolr.fromFile Loading container configuration from /mnt/ssd/jenkins/workspace/Lucene-Solr-4.x-Linux/solr/build/solr-core/test/J0/./org.apache.solr.cloud.OverseerRolesTest-jetty3-1391016630780/solr.xml
   [junit4]   2> 722052 T2498 oasc.ConfigSolrXml.<init> Config-defined core root directory: 
   [junit4]   2> 722052 T2498 oasc.CoreContainer.<init> New CoreContainer 17495179
   [junit4]   2> 722053 T2498 oasc.CoreContainer.load Loading cores into CoreContainer [instanceDir=./org.apache.solr.cloud.OverseerRolesTest-jetty3-1391016630780/]
   [junit4]   2> 722054 T2498 oashc.HttpShardHandlerFactory.getParameter Setting socketTimeout to: 90000
   [junit4]   2> 722054 T2498 oashc.HttpShardHandlerFactory.getParameter Setting urlScheme to: http://
   [junit4]   2> 722054 T2498 oashc.HttpShardHandlerFactory.getParameter Setting connTimeout to: 15000
   [junit4]   2> 722055 T2498 oashc.HttpShardHandlerFactory.getParameter Setting maxConnectionsPerHost to: 20
   [junit4]   2> 722055 T2498 oashc.HttpShardHandlerFactory.getParameter Setting corePoolSize to: 0
   [junit4]   2> 722055 T2498 oashc.HttpShardHandlerFactory.getParameter Setting maximumPoolSize to: 2147483647
   [junit4]   2> 722056 T2498 oashc.HttpShardHandlerFactory.getParameter Setting maxThreadIdleTime to: 5
   [junit4]   2> 722056 T2498 oashc.HttpShardHandlerFactory.getParameter Setting sizeOfQueue to: -1
   [junit4]   2> 722056 T2498 oashc.HttpShardHandlerFactory.getParameter Setting fairnessPolicy to: false
   [junit4]   2> 722058 T2498 oasl.LogWatcher.createWatcher SLF4J impl is org.slf4j.impl.Log4jLoggerFactory
   [junit4]   2> 722059 T2498 oasl.LogWatcher.newRegisteredLogWatcher Registering Log Listener [Log4j (org.slf4j.impl.Log4jLoggerFactory)]
   [junit4]   2> 722059 T2498 oasc.CoreContainer.load Host Name: 127.0.0.1
   [junit4]   2> 722060 T2498 oasc.ZkContainer.initZooKeeper Zookeeper client=127.0.0.1:41859/solr
   [junit4]   2> 722060 T2498 oasc.ZkController.checkChrootPath zkHost includes chroot
   [junit4]   2> 722061 T2498 oascc.ConnectionManager.waitForConnected Waiting for client to connect to ZooKeeper
   [junit4]   2> 722062 T2564 oascc.ConnectionManager.process Watcher org.apache.solr.common.cloud.ConnectionManager@3cf82a name:ZooKeeperConnection Watcher:127.0.0.1:41859 got event WatchedEvent state:SyncConnected type:None path:null path:null type:None
   [junit4]   2> 722062 T2498 oascc.ConnectionManager.waitForConnected Client is connected to ZooKeeper
   [junit4]   2> 722064 T2498 oascc.ConnectionManager.waitForConnected Waiting for client to connect to ZooKeeper
   [junit4]   2> 722065 T2566 oascc.ConnectionManager.process Watcher org.apache.solr.common.cloud.ConnectionManager@16d2b7d name:ZooKeeperConnection Watcher:127.0.0.1:41859/solr got event WatchedEvent state:SyncConnected type:None path:null path:null type:None
   [junit4]   2> 722065 T2498 oascc.ConnectionManager.waitForConnected Client is connected to ZooKeeper
   [junit4]   2> 722070 T2498 oascc.ZkStateReader.createClusterStateWatchersAndUpdate Updating cluster state from ZooKeeper... 
   [junit4]   2> 723073 T2498 oasc.ZkController.createEphemeralLiveNode Register node as live in ZooKeeper:/live_nodes/127.0.0.1:46953_pc_aq%2Fry
   [junit4]   2> 723076 T2498 oascc.SolrZkClient.makePath makePath: /live_nodes/127.0.0.1:46953_pc_aq%2Fry
   [junit4]   2> 723080 T2520 oascc.ZkStateReader$3.process Updating live nodes... (4)
   [junit4]   2> 723081 T2525 oascc.ZkStateReader$3.process Updating live nodes... (4)
   [junit4]   2> 723081 T2566 oascc.ZkStateReader$3.process Updating live nodes... (4)
   [junit4]   2> 723081 T2552 oascc.ZkStateReader$3.process Updating live nodes... (4)
   [junit4]   2> 723080 T2538 oascc.ZkStateReader$3.process Updating live nodes... (4)
   [junit4]   2> 723092 T2498 oasc.CorePropertiesLocator.discover Looking for core definitions underneath /mnt/ssd/jenkins/workspace/Lucene-Solr-4.x-Linux/solr/build/solr-core/test/J0/./org.apache.solr.cloud.OverseerRolesTest-jetty3-1391016630780
   [junit4]   2> 723094 T2498 oasc.CorePropertiesLocator.discoverUnder Found core conf in /mnt/ssd/jenkins/workspace/Lucene-Solr-4.x-Linux/solr/build/solr-core/test/J0/./org.apache.solr.cloud.OverseerRolesTest-jetty3-1391016630780/conf/
   [junit4]   2> 723131 T2498 oasc.CorePropertiesLocator.discover Found 1 core definitions
   [junit4]   2> 723132 T2498 oass.SolrDispatchFilter.init user.dir=/mnt/ssd/jenkins/workspace/Lucene-Solr-4.x-Linux/solr/build/solr-core/test/J0
   [junit4]   2> 723132 T2498 oass.SolrDispatchFilter.init SolrDispatchFilter.init() done
   [junit4]   2> 723205 T2498 oasc.AbstractFullDistribZkTestBase.createJettys create jetty 4
   [junit4]   2> 723205 T2498 oejs.Server.doStart jetty-8.1.10.v20130312
   [junit4]   2> 723207 T2498 oejs.AbstractConnector.doStart Started SelectChannelConnector@127.0.0.1:33467
   [junit4]   2> 723208 T2498 oass.SolrDispatchFilter.init SolrDispatchFilter.init()
   [junit4]   2> 723208 T2498 oasc.SolrResourceLoader.locateSolrHome JNDI not configured for solr (NoInitialContextEx)
   [junit4]   2> 723209 T2498 oasc.SolrResourceLoader.locateSolrHome using system property solr.solr.home: ../../../../../../../../../../mnt/ssd/jenkins/workspace/Lucene-Solr-4.x-Linux/solr/build/solr-core/test/J0/./org.apache.solr.cloud.OverseerRolesTest-jetty4-1391016631995
   [junit4]   2> 723209 T2498 oasc.SolrResourceLoader.<init> new SolrResourceLoader for directory: '../../../../../../../../../../mnt/ssd/jenkins/workspace/Lucene-Solr-4.x-Linux/solr/build/solr-core/test/J0/./org.apache.solr.cloud.OverseerRolesTest-jetty4-1391016631995/'
   [junit4]   2> 723223 T2498 oasc.ConfigSolr.fromFile Loading container configuration from /mnt/ssd/jenkins/workspace/Lucene-Solr-4.x-Linux/solr/build/solr-core/test/J0/../../../../../../../../../../mnt/ssd/jenkins/workspace/Lucene-Solr-4.x-Linux/solr/build/solr-core/test/J0/./org.apache.solr.cloud.OverseerRolesTest-jetty4-1391016631995/solr.xml
   [junit4]   2> 723277 T2498 oasc.ConfigSolrXml.<init> Config-defined core root directory: 
   [junit4]   2> 723277 T2498 oasc.CoreContainer.<init> New CoreContainer 15502310
   [junit4]   2> 723278 T2498 oasc.CoreContainer.load Loading cores into CoreContainer [instanceDir=../../../../../../../../../../mnt/ssd/jenkins/workspace/Lucene-Solr-4.x-Linux/solr/build/solr-core/test/J0/./org.apache.solr.cloud.OverseerRolesTest-jetty4-1391016631995/]
   [junit4]   2> 723279 T2498 oashc.HttpShardHandlerFactory.getParameter Setting socketTimeout to: 90000
   [junit4]   2> 723279 T2498 oashc.HttpShardHandlerFactory.getParameter Setting urlScheme to: http://
   [junit4]   2> 723280 T2498 oashc.HttpShardHandlerFactory.getParameter Setting connTimeout to: 15000
   [junit4]   2> 723280 T2498 oashc.HttpShardHandlerFactory.getParameter Setting maxConnectionsPerHost to: 20
   [junit4]   2> 723280 T2498 oashc.HttpShardHandlerFactory.getParameter Setting corePoolSize to: 0
   [junit4]   2> 723280 T2498 oashc.HttpShardHandlerFactory.getParameter Setting maximumPoolSize to: 2147483647
   [junit4]   2> 723281 T2498 oashc.HttpShardHandlerFactory.getParameter Setting maxThreadIdleTime to: 5
   [junit4]   2> 723281 T2498 oashc.HttpShardHandlerFactory.getParameter Setting sizeOfQueue to: -1
   [junit4]   2> 723281 T2498 oashc.HttpShardHandlerFactory.getParameter Setting fairnessPolicy to: false
   [junit4]   2> 723283 T2498 oasl.LogWatcher.createWatcher SLF4J impl is org.slf4j.impl.Log4jLoggerFactory
   [junit4]   2> 723284 T2498 oasl.LogWatcher.newRegisteredLogWatcher Registering Log Listener [Log4j (org.slf4j.impl.Log4jLoggerFactory)]
   [junit4]   2> 723284 T2498 oasc.CoreContainer.load Host Name: 127.0.0.1
   [junit4]   2> 723284 T2498 oasc.ZkContainer.initZooKeeper Zookeeper client=127.0.0.1:41859/solr
   [junit4]   2> 723285 T2498 oasc.ZkController.checkChrootPath zkHost includes chroot
   [junit4]   2> 723285 T2498 oascc.ConnectionManager.waitForConnected Waiting for client to connect to ZooKeeper
   [junit4]   2> 723287 T2578 oascc.ConnectionManager.process Watcher org.apache.solr.common.cloud.ConnectionManager@1d4d28b name:ZooKeeperConnection Watcher:127.0.0.1:41859 got event WatchedEvent state:SyncConnected type:None path:null path:null type:None
   [junit4]   2> 723287 T2498 oascc.ConnectionManager.waitForConnected Client is connected to ZooKeeper
   [junit4]   2> 723289 T2498 oascc.ConnectionManager.waitForConnected Waiting for client to connect to ZooKeeper
   [junit4]   2> 723290 T2580 oascc.ConnectionManager.process Watcher org.apache.solr.common.cloud.ConnectionManager@50773f name:ZooKeeperConnection Watcher:127.0.0.1:41859/solr got event WatchedEvent state:SyncConnected type:None path:null path:null type:None
   [junit4]   2> 723290 T2498 oascc.ConnectionManager.waitForConnected Client is connected to ZooKeeper
   [junit4]   2> 723293 T2498 oascc.ZkStateReader.createClusterStateWatchersAndUpdate Updating cluster state from ZooKeeper... 
   [junit4]   2> 724296 T2498 oasc.ZkController.createEphemeralLiveNode Register node as live in ZooKeeper:/live_nodes/127.0.0.1:33467_pc_aq%2Fry
   [junit4]   2> 724297 T2498 oascc.SolrZkClient.makePath makePath: /live_nodes/127.0.0.1:33467_pc_aq%2Fry
   [junit4]   2> 724300 T2525 oascc.ZkStateReader$3.process Updating live nodes... (5)
   [junit4]   2> 724301 T2552 oascc.ZkStateReader$3.process Updating live nodes... (5)
   [junit4]   2> 724301 T2538 oascc.ZkStateReader$3.process Updating live nodes... (5)
   [junit4]   2> 724301 T2580 oascc.ZkStateReader$3.process Updating live nodes... (5)
   [junit4]   2> 724301 T2566 oascc.ZkStateReader$3.process Updating live nodes... (5)
   [junit4]   2> 724301 T2520 oascc.ZkStateReader$3.process Updating live nodes... (5)
   [junit4]   2> 724306 T2498 oasc.CorePropertiesLocator.discover Looking for core definitions underneath /mnt/ssd/jenkins/workspace/Lucene-Solr-4.x-Linux/solr/build/solr-core/test/J0/../../../../../../../../../../mnt/ssd/jenkins/workspace/Lucene-Solr-4.x-Linux/solr/build/solr-core/test/J0/./org.apache.solr.cloud.OverseerRolesTest-jetty4-1391016631995
   [junit4]   2> 724307 T2498 oasc.CorePropertiesLocator.discoverUnder Found core conf in /mnt/ssd/jenkins/workspace/Lucene-Solr-4.x-Linux/solr/build/solr-core/test/J0/../../../../../../../../../../mnt/ssd/jenkins/workspace/Lucene-Solr-4.x-Linux/solr/build/solr-core/test/J0/./org.apache.solr.cloud.OverseerRolesTest-jetty4-1391016631995/conf/
   [junit4]   2> 724339 T2498 oasc.CorePropertiesLocator.discover Found 1 core definitions
   [junit4]   2> 724339 T2498 oass.SolrDispatchFilter.init user.dir=/mnt/ssd/jenkins/workspace/Lucene-Solr-4.x-Linux/solr/build/solr-core/test/J0
   [junit4]   2> 724340 T2498 oass.SolrDispatchFilter.init SolrDispatchFilter.init() done
   [junit4]   2> 724406 T2498 oasc.AbstractFullDistribZkTestBase.createJettys create jetty 5
   [junit4]   2> 724407 T2498 oejs.Server.doStart jetty-8.1.10.v20130312
   [junit4]   2> 724409 T2498 oejs.AbstractConnector.doStart Started SelectChannelConnector@127.0.0.1:48336
   [junit4]   2> 724409 T2498 oass.SolrDispatchFilter.init SolrDispatchFilter.init()
   [junit4]   2> 724409 T2498 oasc.SolrResourceLoader.locateSolrHome JNDI not configured for solr (NoInitialContextEx)
   [junit4]   2> 724410 T2498 oasc.SolrResourceLoader.locateSolrHome using system property solr.solr.home: ./org.apache.solr.cloud.OverseerRolesTest-jetty5-1391016633202
   [junit4]   2> 724410 T2498 oasc.SolrResourceLoader.<init> new SolrResourceLoader for directory: './org.apache.solr.cloud.OverseerRolesTest-jetty5-1391016633202/'
   [junit4]   2> 724422 T2498 oasc.ConfigSolr.fromFile Loading container configuration from /mnt/ssd/jenkins/workspace/Lucene-Solr-4.x-Linux/solr/build/solr-core/test/J0/./org.apache.solr.cloud.OverseerRolesTest-jetty5-1391016633202/solr.xml
   [junit4]   2> 724462 T2498 oasc.ConfigSolrXml.<init> Config-defined core root directory: 
   [junit4]   2> 724463 T2498 oasc.CoreContainer.<init> New CoreContainer 6343187
   [junit4]   2> 724463 T2498 oasc.CoreContainer.load Loading cores into CoreContainer [instanceDir=./org.apache.solr.cloud.OverseerRolesTest-jetty5-1391016633202/]
   [junit4]   2> 724464 T2498 oashc.HttpShardHandlerFactory.getParameter Setting socketTimeout to: 90000
   [junit4]   2> 724465 T2498 oashc.HttpShardHandlerFactory.getParameter Setting urlScheme to: http://
   [junit4]   2> 724465 T2498 oashc.HttpShardHandlerFactory.getParameter Setting connTimeout to: 15000
   [junit4]   2> 724465 T2498 oashc.HttpShardHandlerFactory.getParameter Setting maxConnectionsPerHost to: 20
   [junit4]   2> 724466 T2498 oashc.HttpShardHandlerFactory.getParameter Setting corePoolSize to: 0
   [junit4]   2> 724466 T2498 oashc.HttpShardHandlerFactory.getParameter Setting maximumPoolSize to: 2147483647
   [junit4]   2> 724466 T2498 oashc.HttpShardHandlerFactory.getParameter Setting maxThreadIdleTime to: 5
   [junit4]   2> 724466 T2498 oashc.HttpShardHandlerFactory.getParameter Setting sizeOfQueue to: -1
   [junit4]   2> 724467 T2498 oashc.HttpShardHandlerFactory.getParameter Setting fairnessPolicy to: false
   [junit4]   2> 724469 T2498 oasl.LogWatcher.createWatcher SLF4J impl is org.slf4j.impl.Log4jLoggerFactory
   [junit4]   2> 724469 T2498 oasl.LogWatcher.newRegisteredLogWatcher Registering Log Listener [Log4j (org.slf4j.impl.Log4jLoggerFactory)]
   [junit4]   2> 724469 T2498 oasc.CoreContainer.load Host Name: 127.0.0.1
   [junit4]   2> 724470 T2498 oasc.ZkContainer.initZooKeeper Zookeeper client=127.0.0.1:41859/solr
   [junit4]   2> 724470 T2498 oasc.ZkController.checkChrootPath zkHost includes chroot
   [junit4]   2> 724471 T2498 oascc.ConnectionManager.waitForConnected Waiting for client to connect to ZooKeeper
   [junit4]   2> 724472 T2592 oascc.ConnectionManager.process Watcher org.apache.solr.common.cloud.ConnectionManager@72c770 name:ZooKeeperConnection Watcher:127.0.0.1:41859 got event WatchedEvent state:SyncConnected type:None path:null path:null type:None
   [junit4]   2> 724472 T2498 oascc.ConnectionManager.waitForConnected Client is connected to ZooKeeper
   [junit4]   2> 724474 T2498 oascc.ConnectionManager.waitForConnected Waiting for client to connect to ZooKeeper
   [junit4]   2> 724475 T2594 oascc.ConnectionManager.process Watcher org.apache.solr.common.cloud.ConnectionManager@18a0867 name:ZooKeeperConnection Watcher:127.0.0.1:41859/solr got event WatchedEvent state:SyncConnected type:None path:null path:null type:None
   [junit4]   2> 724475 T2498 oascc.ConnectionManager.waitForConnected Client is connected to ZooKeeper
   [junit4]   2> 724477 T2498 oascc.ZkStateReader.createClusterStateWatchersAndUpdate Updating cluster state from ZooKeeper... 
   [junit4]   2> 725482 T2498 oasc.ZkController.createEphemeralLiveNode Register node as live in ZooKeeper:/live_nodes/127.0.0.1:48336_pc_aq%2Fry
   [junit4]   2> 725483 T2498 oascc.SolrZkClient.makePath makePath: /live_nodes/127.0.0.1:48336_pc_aq%2Fry
   [junit4]   2> 725488 T2566 oascc.ZkStateReader$3.process Updating live nodes... (6)
   [junit4]   2> 725488 T2538 oascc.ZkStateReader$3.process Updating live nodes... (6)
   [junit4]   2> 725488 T2594 oascc.ZkStateReader$3.process Updating live nodes... (6)
   [junit4]   2> 725488 T2580 oascc.ZkStateReader$3.process Updating live nodes... (6)
   [junit4]   2> 725488 T2520 oascc.ZkStateReader$3.process Updating live nodes... (6)
   [junit4]   2> 725488 T2552 oascc.ZkStateReader$3.process Updating live nodes... (6)
   [junit4]   2> 725488 T2525 oascc.ZkStateReader$3.process Updating live nodes... (6)
   [junit4]   2> 725496 T2498 oasc.CorePropertiesLocator.discover Looking for core definitions underneath /mnt/ssd/jenkins/workspace/Lucene-Solr-4.x-Linux/solr/build/solr-core/test/J0/./org.apache.solr.cloud.OverseerRolesTest-jetty5-1391016633202
   [junit4]   2> 725497 T2498 oasc.CorePropertiesLocator.discoverUnder Found core conf in /mnt/ssd/jenkins/workspace/Lucene-Solr-4.x-Linux/solr/build/solr-core/test/J0/./org.apache.solr.cloud.OverseerRolesTest-jetty5-1391016633202/conf/
   [junit4]   2> 725522 T2498 oasc.CorePropertiesLocator.discover Found 1 core definitions
   [junit4]   2> 725523 T2498 oass.SolrDispatchFilter.init user.dir=/mnt/ssd/jenkins/workspace/Lucene-Solr-4.x-Linux/solr/build/solr-core/test/J0
   [junit4]   2> 725523 T2498 oass.SolrDispatchFilter.init SolrDispatchFilter.init() done
   [junit4]   2> 725595 T2498 oasc.AbstractFullDistribZkTestBase.createJettys create jetty 6
   [junit4]   2> 725596 T2498 oejs.Server.doStart jetty-8.1.10.v20130312
   [junit4]   2> 725598 T2498 oejs.AbstractConnector.doStart Started SelectChannelConnector@127.0.0.1:38887
   [junit4]   2> 725598 T2498 oass.SolrDispatchFilter.init SolrDispatchFilter.init()
   [junit4]   2> 725598 T2498 oasc.SolrResourceLoader.locateSolrHome JNDI not configured for solr (NoInitialContextEx)
   [junit4]   2> 725599 T2498 oasc.SolrResourceLoader.locateSolrHome using system property solr.solr.home: ../../../../../../../../../../mnt/ssd/jenkins/workspace/Lucene-Solr-4.x-Linux/solr/build/solr-core/test/J0/./org.apache.solr.cloud.OverseerRolesTest-jetty6-1391016634386
   [junit4]   2> 725599 T2498 oasc.SolrResourceLoader.<init> new SolrResourceLoader for directory: '../../../../../../../../../../mnt/ssd/jenkins/workspace/Lucene-Solr-4.x-Linux/solr/build/solr-core/test/J0/./org.apache.solr.cloud.OverseerRolesTest-jetty6-1391016634386/'
   [junit4]   2> 725611 T2498 oasc.ConfigSolr.fromFile Loading container configuration from /mnt/ssd/jenkins/workspace/Lucene-Solr-4.x-Linux/solr/build/solr-core/test/J0/../../../../../../../../../../mnt/ssd/jenkins/workspace/Lucene-Solr-4.x-Linux/solr/build/solr-core/test/J0/./org.apache.solr.cloud.OverseerRolesTest-jetty6-1391016634386/solr.xml
   [junit4]   2> 725653 T2498 oasc.ConfigSolrXml.<init> Config-defined core root directory: 
   [junit4]   2> 725653 T2498 oasc.CoreContainer.<init> New CoreContainer 14641999
   [junit4]   2> 725654 T2498 oasc.CoreContainer.load Loading cores into CoreContainer [instanceDir=../../../../../../../../../../mnt/ssd/jenkins/workspace/Lucene-Solr-4.x-Linux/solr/build/solr-core/test/J0/./org.apache.solr.cloud.OverseerRolesTest-jetty6-1391016634386/]
   [junit4]   2> 725655 T2498 oashc.HttpShardHandlerFactory.getParameter Setting socketTimeout to: 90000
   [junit4]   2> 725655 T2498 oashc.HttpShardHandlerFactory.getParameter Setting urlScheme to: http://
   [junit4]   2> 725656 T2498 oashc.HttpShardHandlerFactory.getParameter Setting connTimeout to: 15000
   [junit4]   2> 725656 T2498 oashc.HttpShardHandlerFactory.getParameter Setting maxConnectionsPerHost to: 20
   [junit4]   2> 725656 T2498 oashc.HttpShardHandlerFactory.getParameter Setting corePoolSize to: 0
   [junit4]   2> 725656 T2498 oashc.HttpShardHandlerFactory.getParameter Setting maximumPoolSize to: 2147483647
   [junit4]   2> 725657 T2498 oashc.HttpShardHandlerFactory.getParameter Setting maxThreadIdleTime to: 5
   [junit4]   2> 725657 T2498 oashc.HttpShardHandlerFactory.getParameter Setting sizeOfQueue to: -1
   [junit4]   2> 725657 T2498 oashc.HttpShardHandlerFactory.getParameter Setting fairnessPolicy to: false
   [junit4]   2> 725659 T2498 oasl.LogWatcher.createWatcher SLF4J impl is org.slf4j.impl.Log4jLoggerFactory
   [junit4]   2> 725660 T2498 oasl.LogWatcher.newRegisteredLogWatcher Registering Log Listener [Log4j (org.slf4j.impl.Log4jLoggerFactory)]
   [junit4]   2> 725660 T2498 oasc.CoreContainer.load Host Name: 127.0.0.1
   [junit4]   2> 725660 T2498 oasc.ZkContainer.initZooKeeper Zookeeper client=127.0.0.1:41859/solr
   [junit4]   2> 725661 T2498 oasc.ZkController.checkChrootPath zkHost includes chroot
   [junit4]   2> 725661 T2498 oascc.ConnectionManager.waitForConnected Waiting for client to connect to ZooKeeper
   [junit4]   2> 725663 T2606 oascc.ConnectionManager.process Watcher org.apache.solr.common.cloud.ConnectionManager@1fe247f name:ZooKeeperConnection Watcher:127.0.0.1:41859 got event WatchedEvent state:SyncConnected type:None path:null path:null type:None
   [junit4]   2> 725664 T2498 oascc.ConnectionManager.waitForConnected Client is connected to ZooKeeper
   [junit4]   2> 725665 T2498 oascc.ConnectionManager.waitForConnected Waiting for client to connect to ZooKeeper
   [junit4]   2> 725666 T2608 oascc.ConnectionManager.process Watcher org.apache.solr.common.cloud.ConnectionManager@1d55d1c name:ZooKeeperConnection Watcher:127.0.0.1:41859/solr got event WatchedEvent state:SyncConnected type:None path:null path:null type:None
   [junit4]   2> 725667 T2498 oascc.ConnectionManager.waitForConnected Client is connected to ZooKeeper
   [junit4]   2> 725670 T2498 oascc.ZkStateReader.createClusterStateWatchersAndUpdate Updating cluster state from ZooKeeper... 
   [junit4]   2> 726672 T2498 oasc.ZkController.createEphemeralLiveNode Register node as live in ZooKeeper:/live_nodes/127.0.0.1:38887_pc_aq%2Fry
   [junit4]   2> 726673 T2498 oascc.SolrZkClient.makePath makePath: /live_nodes/127.0.0.1:38887_pc_aq%2Fry
   [junit4]   2> 726677 T2525 oascc.ZkStateReader$3.process Updating live nodes... (7)
   [junit4]   2> 726677 T2566 oascc.ZkStateReader$3.process Updating live nodes... (7)
   [junit4]   2> 726677 T2538 oascc.ZkStateReader$3.process Updating live nodes... (7)
   [junit4]   2> 726677 T2552 oascc.ZkStateReader$3.process Updating live nodes... (7)
   [junit4]   2> 726678 T2594 oascc.ZkStateReader$3.process Updating live nodes... (7)
   [junit4]   2> 726678 T2520 oascc.ZkStateReader$3.process Updating live nodes... (7)
   [junit4]   2> 726677 T2608 oascc.ZkStateReader$3.process Updating live nodes... (7)
   [junit4]   2> 726677 T2580 oascc.ZkStateReader$3.process Updating live nodes... (7)
   [junit4]   2> 726682 T2498 oasc.CorePropertiesLocator.discover Looking for core definitions underneath /mnt/ssd/jenkins/workspace/Lucene-Solr-4.x-Linux/solr/build/solr-core/test/J0/../../../../../../../../../../mnt/ssd/jenkins/workspace/Lucene-Solr-4.x-Linux/solr/build/solr-core/test/J0/./org.apache.solr.cloud.OverseerRolesTest-jetty6-1391016634386
   [junit4]   2> 726683 T2498 oasc.CorePropertiesLocator.discoverUnder Found core conf in /mnt/ssd/jenkins/workspace/Lucene-Solr-4.x-Linux/solr/build/solr-core/test/J0/../../../../../../../../../../mnt/ssd/jenkins/workspace/Lucene-Solr-4.x-Linux/solr/build/solr-core/test/J0/./org.apache.solr.cloud.OverseerRolesTest-jetty6-1391016634386/conf/
   [junit4]   2> 726724 T2498 oasc.CorePropertiesLocator.discover Found 1 core definitions
   [junit4]   2> 726724 T2498 oass.SolrDispatchFilter.init user.dir=/mnt/ssd/jenkins/workspace/Lucene-Solr-4.x-Linux/solr/build/solr-core/test/J0
   [junit4]   2> 726725 T2498 oass.SolrDispatchFilter.init SolrDispatchFilter.init() done
   [junit4]   2> 726726 T2498 oascc.ConnectionManager.waitForConnected Waiting for client to connect to ZooKeeper
   [junit4]   2> 726727 T2611 oascc.ConnectionManager.process Watcher org.apache.solr.common.cloud.ConnectionManager@159752b name:ZooKeeperConnection Watcher:127.0.0.1:41859/solr got event WatchedEvent state:SyncConnected type:None path:null path:null type:None
   [junit4]   2> 726727 T2498 oascc.ConnectionManager.waitForConnected Client is connected to ZooKeeper
   [junit4]   2> 726728 T2498 oascc.ZkStateReader.createClusterStateWatchersAndUpdate Updating cluster state from ZooKeeper... 
   [junit4]   2> 726731 T2498 oascc.ConnectionManager.waitForConnected Waiting for client to connect to ZooKeeper
   [junit4]   2> 726732 T2613 oascc.ConnectionManager.process Watcher org.apache.solr.common.cloud.ConnectionManager@1d92ec2 name:ZooKeeperConnection Watcher:127.0.0.1:41859/solr got event WatchedEvent state:SyncConnected type:None path:null path:null type:None
   [junit4]   2> 726732 T2498 oascc.ConnectionManager.waitForConnected Client is connected to ZooKeeper
   [junit4]   2> 726733 T2498 oascc.ZkStateReader.createClusterStateWatchersAndUpdate Updating cluster state from ZooKeeper... 
   [junit4]   2> 726736 T2559 oasha.CollectionsHandler.handleCreateAction Creating Collection : wt=javabin&numShards=4&replicationFactor=2&maxShardsPerNode=2&version=2&action=CREATE&name=testOverseerCol
   [junit4]   2> 726737 T2520 oasc.DistributedQueue$LatchChildWatcher.process LatchChildWatcher fired on path: /overseer/collection-queue-work state: SyncConnected type NodeChildrenChanged
   [junit4]   2> 726739 T2522 oasc.OverseerCollectionProcessor.run Overseer Collection Processor: Get the message id:/overseer/collection-queue-work/qn-0000000000 message:{
   [junit4]   2> 	  "operation":"createcollection",
   [junit4]   2> 	  "fromApi":"true",
   [junit4]   2> 	  "name":"testOverseerCol",
   [junit4]   2> 	  "replicationFactor":"2",
   [junit4]   2> 	  "numShards":"4",
   [junit4]   2> 	  "maxShardsPerNode":"2"}
   [junit4]   2> 726739 T2522 oasc.OverseerCollectionProcessor.processMessage WARN OverseerCollectionProcessor.processMessage : createcollection , {
   [junit4]   2> 	  "operation":"createcollection",
   [junit4]   2> 	  "fromApi":"true",
   [junit4]   2> 	  "name":"testOverseerCol",
   [junit4]   2> 	  "replicationFactor":"2",
   [junit4]   2> 	  "numShards":"4",
   [junit4]   2> 	  "maxShardsPerNode":"2"}
   [junit4]   2> 726740 T2522 oasc.OverseerCollectionProcessor.createConfNode Only one config set found in zk - using it:conf1
   [junit4]   2> 726740 T2522 oasc.OverseerCollectionProcessor.createConfNode creating collections conf node /collections/testOverseerCol 
   [junit4]   2> 726740 T2522 oascc.SolrZkClient.makePath makePath: /collections/testOverseerCol
   [junit4]   2> 726745 T2520 oasc.DistributedQueue$LatchChildWatcher.process LatchChildWatcher fired on path: /overseer/queue state: SyncConnected type NodeChildrenChanged
   [junit4]   2> 726746 T2521 oascc.ZkStateReader.updateClusterState Updating cloud state from ZooKeeper... 
   [junit4]   2> 726747 T2521 oasc.Overseer$ClusterStateUpdater.buildCollection building a new collection: testOverseerCol
   [junit4]   2> 726747 T2521 oasc.Overseer$ClusterStateUpdater.createCollection Create collection testOverseerCol with shards [shard1, shard2, shard3, shard4]
   [junit4]   2> 726749 T2520 oasc.DistributedQueue$LatchChildWatcher.process LatchChildWatcher fired on path: /overseer/queue state: SyncConnected type NodeChildrenChanged
   [junit4]   2> 726750 T2566 oascc.ZkStateReader$2.process A cluster state change: WatchedEvent state:SyncConnected type:NodeDataChanged path:/clusterstate.json, has occurred - updating... (live nodes size: 7)
   [junit4]   2> 726750 T2594 oascc.ZkStateReader$2.process A cluster state change: WatchedEvent state:SyncConnected type:NodeDataChanged path:/clusterstate.json, has occurred - updating... (live nodes size: 7)
   [junit4]   2> 726750 T2608 oascc.ZkStateReader$2.process A cluster state change: WatchedEvent state:SyncConnected type:NodeDataChanged path:/clusterstate.json, has occurred - updating... (live nodes size: 7)
   [junit4]   2> 726750 T2613 oascc.ZkStateReader$2.process A cluster state change: WatchedEvent state:SyncConnected type:NodeDataChanged path:/clusterstate.json, has occurred - updating... (live nodes size: 7)
   [junit4]   2> 726750 T2538 oascc.ZkStateReader$2.process A cluster state change: WatchedEvent state:SyncConnected type:NodeDataChanged path:/clusterstate.json, has occurred - updating... (live nodes size: 7)
   [junit4]   2> 726750 T2552 oascc.ZkStateReader$2.process A cluster state change: WatchedEvent state:SyncConnected type:NodeDataChanged path:/clusterstate.json, has occurred - updating... (live nodes size: 7)
   [junit4]   2> 726750 T2611 oascc.ZkStateReader$2.process A cluster state change: WatchedEvent state:SyncConnected type:NodeDataChanged path:/clusterstate.json, has occurred - updating... (live nodes size: 7)
   [junit4]   2> 726750 T2525 oascc.ZkStateReader$2.process A cluster state change: WatchedEvent state:SyncConnected type:NodeDataChanged path:/clusterstate.json, has occurred - updating... (live nodes size: 7)
   [junit4]   2> 726750 T2580 oascc.ZkStateReader$2.process A cluster state change: WatchedEvent state:SyncConnected type:NodeDataChanged path:/clusterstate.json, has occurred - updating... (live nodes size: 7)
   [junit4]   2> 726750 T2520 oascc.ZkStateReader$2.process A cluster state change: WatchedEvent state:SyncConnected type:NodeDataChanged path:/clusterstate.json, has occurred - updating... (live nodes size: 7)
   [junit4]   2> 726845 T2522 oasc.OverseerCollectionProcessor.createCollection going to create cores replicas shardNames [shard1, shard2, shard3, shard4] , repFactor : 2
   [junit4]   2> 726845 T2522 oasc.OverseerCollectionProcessor.createCollection Creating shard testOverseerCol_shard1_replica1 as part of slice shard1 of collection testOverseerCol on 127.0.0.1:46953_pc_aq%2Fry
   [junit4]   2> 726846 T2522 oasc.OverseerCollectionProcessor.createCollection Creating shard testOverseerCol_shard1_replica2 as part of slice shard1 of collection testOverseerCol on 127.0.0.1:52874_pc_aq%2Fry
   [junit4]   2> 726847 T2522 oasc.OverseerCollectionProcessor.createCollection Creating shard testOverseerCol_shard2_replica1 as part of slice shard2 of collection testOverseerCol on 127.0.0.1:42587_pc_aq%2Fry
   [junit4]   2> 726847 T2522 oasc.OverseerCollectionProcessor.createCollection Creating shard testOverseerCol_shard2_replica2 as part of slice shard2 of collection testOverseerCol on 127.0.0.1:33467_pc_aq%2Fry
   [junit4]   2> 726848 T2522 oasc.OverseerCollectionProcessor.createCollection Creating shard testOverseerCol_shard3_replica1 as part of slice shard3 of collection testOverseerCol on 127.0.0.1:48336_pc_aq%2Fry
   [junit4]   2> 726848 T2522 oasc.OverseerCollectionProcessor.createCollection Creating shard testOverseerCol_shard3_replica2 as part of slice shard3 of collection testOverseerCol on 127.0.0.1:48251_pc_aq%2Fry
   [junit4]   2> 726848 T2522 oasc.OverseerCollectionProcessor.createCollection Creating shard testOverseerCol_shard4_replica1 as part of slice shard4 of collection testOverseerCol on 127.0.0.1:38887_pc_aq%2Fry
   [junit4]   2> 726849 T2522 oasc.OverseerCollectionProcessor.createCollection Creating shard testOverseerCol_shard4_replica2 as part of slice shard4 of collection testOverseerCol on 127.0.0.1:46953_pc_aq%2Fry
   [junit4]   2> 726851 T2515 oasc.ZkController.publish publishing core=testOverseerCol_shard1_replica2 state=down
   [junit4]   2> 726851 T2531 oasc.ZkController.publish publishing core=testOverseerCol_shard2_replica1 state=down
   [junit4]   2> 726851 T2561 oasc.ZkController.publish publishing core=testOverseerCol_shard4_replica2 state=down
   [junit4]   2> 726852 T2515 oasc.ZkController.waitForCoreNodeName look for our core node name
   [junit4]   2> 726851 T2560 oasc.ZkController.publish publishing core=testOverseerCol_shard1_replica1 state=down
   [junit4]   2> 726851 T2576 oasc.ZkController.publish publishing core=testOverseerCol_shard2_replica2 state=down
   [junit4]   2> 726851 T2590 oasc.ZkController.publish publishing core=testOverseerCol_shard3_replica1 state=down
   [junit4]   2> 726851 T2546 oasc.ZkController.publish publishing core=testOverseerCol_shard3_replica2 state=down
   [junit4]   2> 726851 T2601 oasc.ZkController.publish publishing core=testOverseerCol_shard4_replica1 state=down
   [junit4]   2> 726853 T2561 oasc.ZkController.waitForCoreNodeName look for our core node name
   [junit4]   2> 726852 T2531 oasc.ZkController.waitForCoreNodeName look for our core node name
   [junit4]   2> 726852 T2520 oasc.DistributedQueue$LatchChildWatcher.process LatchChildWatcher fired on path: /overseer/queue state: SyncConnected type NodeChildrenChanged
   [junit4]   2> 726856 T2560 oasc.ZkController.waitForCoreNodeName look for our core node name
   [junit4]   2> 726856 T2590 oasc.ZkController.waitForCoreNodeName look for our core node name
   [junit4]   2> 726856 T2576 oasc.ZkController.waitForCoreNodeName look for our core node name
   [junit4]   2> 726857 T2601 oasc.ZkController.waitForCoreNodeName look for our core node name
   [junit4]   2> 726857 T2521 oascc.ZkStateReader.updateClusterState Updating cloud state from ZooKeeper... 
   [junit4]   2> 726856 T2546 oasc.ZkController.waitForCoreNodeName look for our core node name
   [junit4]   2> 726858 T2521 oasc.Overseer$ClusterStateUpdater.updateState Update state numShards=4 message={
   [junit4]   2> 	  "operation":"state",
   [junit4]   2> 	  "state":"down",
   [junit4]   2> 	  "base_url":"http://127.0.0.1:52874/pc_aq/ry",
   [junit4]   2> 	  "core":"testOverseerCol_shard1_replica2",
   [junit4]   2> 	  "roles":null,
   [junit4]   2> 	  "node_name":"127.0.0.1:52874_pc_aq%2Fry",
   [junit4]   2> 	  "shard":"shard1",
   [junit4]   2> 	  "shard_range":null,
   [junit4]   2> 	  "shard_state":"active",
   [junit4]   2> 	  "shard_parent":null,
   [junit4]   2> 	  "collection":"testOverseerCol",
   [junit4]   2> 	  "numShards":"4",
   [junit4]   2> 	  "core_node_name":null}
   [junit4]   2> 726860 T2520 oasc.DistributedQueue$LatchChildWatcher.process LatchChildWatcher fired on path: /overseer/queue state: SyncConnected type NodeChildrenChanged
   [junit4]   2> 726861 T2521 oasc.Overseer$ClusterStateUpdater.updateState Update state numShards=4 message={
   [junit4]   2> 	  "operation":"state",
   [junit4]   2> 	  "state":"down",
   [junit4]   2> 	  "base_url":"http://127.0.0.1:42587/pc_aq/ry",
   [junit4]   2> 	  "core":"testOverseerCol_shard2_replica1",
   [junit4]   2> 	  "roles":null,
   [junit4]   2> 	  "node_name":"127.0.0.1:42587_pc_aq%2Fry",
   [junit4]   2> 	  "shard":"shard2",
   [junit4]   2> 	  "shard_range":null,
   [junit4]   2> 	  "shard_state":"active",
   [junit4]   2> 	  "shard_parent":null,
   [junit4]   2> 	  "collection":"testOverseerCol",
   [junit4]   2> 	  "numShards":"4",
   [junit4]   2> 	  "core_node_name":null}
   [junit4]   2> 726863 T2520 oasc.DistributedQueue$LatchChildWatcher.process LatchChildWatcher fired on path: /overseer/queue state: SyncConnected type NodeChildrenChanged
   [junit4]   2> 726864 T2521 oasc.Overseer$ClusterStateUpdater.updateState Update state numShards=4 message={
   [junit4]   2> 	  "operation":"state",
   [junit4]   2> 	  "state":"down",
   [junit4]   2> 	  "base_url":"http://127.0.0.1:46953/pc_aq/ry",
   [junit4]   2> 	  "core":"testOverseerCol_shard4_replica2",
   [junit4]   2> 	  "roles":null,
   [junit4]   2> 	  "node_name":"127.0.0.1:46953_pc_aq%2Fry",
   [junit4]   2> 	  "shard":"shard4",
   [junit4]   2> 	  "shard_range":null,
   [junit4]   2> 	  "shard_state":"active",
   [junit4]   2> 	  "shard_parent":null,
   [junit4]   2> 	  "collection":"testOverseerCol",
   [junit4]   2> 	  "numShards":"4",
   [junit4]   2> 	  "core_node_name":null}
   [junit4]   2> 726866 T2520 oasc.DistributedQueue$LatchChildWatcher.process LatchChildWatcher fired on path: /overseer/queue state: SyncConnected type NodeChildrenChanged
   [junit4]   2> 726867 T2521 oasc.Overseer$ClusterStateUpdater.updateState Update state numShards=4 message={
   [junit4]   2> 	  "operation":"state",
   [junit4]   2> 	  "state":"down",
   [junit4]   2> 	  "base_url":"http://127.0.0.1:46953/pc_aq/ry",
   [junit4]   2> 	  "core":"testOverseerCol_shard1_replica1",
   [junit4]   2> 	  "roles":null,
   [junit4]   2> 	  "node_name":"127.0.0.1:46953_pc_aq%2Fry",
   [junit4]   2> 	  "shard":"shard1",
   [junit4]   2> 	  "shard_range":null,
   [junit4]   2> 	  "shard_state":"active",
   [junit4]   2> 	  "shard_parent":null,
   [junit4]   2> 	  "collection":"testOverseerCol",
   [junit4]   2> 	  "numShards":"4",
   [junit4]   2> 	  "core_node_name":null}
   [junit4]   2> 726872 T2520 oasc.DistributedQueue$LatchChildWatcher.process LatchChildWatcher fired on path: /overseer/queue state: SyncConnected type NodeChildrenChanged
   [junit4]   2> 726873 T2521 oasc.Overseer$ClusterStateUpdater.updateState Update state numShards=4 message={
   [junit4]   2> 	  "operation":"state",
   [junit4]   2> 	  "state":"down",
   [junit4]   2> 	  "base_url":"http://127.0.0.1:33467/pc_aq/ry",
   [junit4]   2> 	  "core":"testOverseerCol_shard2_replica2",
   [junit4]   2> 	  "roles":null,
   [junit4]   2> 	  "node_name":"127.0.0.1:33467_pc_aq%2Fry",
   [junit4]   2> 	  "shard":"shard2",
   [junit4]   2> 	  "shard_range":null,
   [junit4]   2> 	  "shard_state":"active",
   [junit4]   2> 	  "shard_parent":null,
   [junit4]   2> 	  "collection":"testOverseerCol",
   [junit4]   2> 	  "numShards":"4",
   [junit4]   2> 	  "core_node_name":null}
   [junit4]   2> 726875 T2520 oasc.DistributedQueue$LatchChildWatcher.process LatchChildWatcher fired on path: /overseer/queue state: SyncConnected type NodeChildrenChanged
   [junit4]   2> 726876 T2521 oasc.Overseer$ClusterStateUpdater.updateState Update state numShards=4 message={
   [junit4]   2> 	  "operation":"state",
   [junit4]   2> 	  "state":"down",
   [junit4]   2> 	  "base_url":"http://127.0.0.1:48336/pc_aq/ry",
   [junit4]   2> 	  "core":"testOverseerCol_shard3_replica1",
   [junit4]   2> 	  "roles":null,
   [junit4]   2> 	  "node_name":"127.0.0.1:48336_pc_aq%2Fry",
   [junit4]   2> 	  "shard":"shard3",
   [junit4]   2> 	  "shard_range":null,
   [junit4]   2> 	  "shard_state":"active",
   [junit4]   2> 	  "shard_parent":null,
   [junit4]   2> 	  "collection":"testOverseerCol",
   [junit4]   2> 	  "numShards":"4",
   [junit4]   2> 	  "core_node_name":null}
   [junit4]   2> 726878 T2520 oasc.DistributedQueue$LatchChildWatcher.process LatchChildWatcher fired on path: /overseer/queue state: SyncConnected type NodeChildrenChanged
   [junit4]   2> 726879 T2521 oasc.Overseer$ClusterStateUpdater.updateState Update state numShards=4 message={
   [junit4]   2> 	  "operation":"state",
   [junit4]   2> 	  "state":"down",
   [junit4]   2> 	  "base_url":"http://127.0.0.1:48251/pc_aq/ry",
   [junit4]   2> 	  "core":"testOverseerCol_shard3_replica2",
   [junit4]   2> 	  "roles":null,
   [junit4]   2> 	  "node_name":"127.0.0.1:48251_pc_aq%2Fry",
   [junit4]   2> 	  "shard":"shard3",
   [junit4]   2> 	  "shard_range":null,
   [junit4]   2> 	  "shard_state":"active",
   [junit4]   2> 	  "shard_parent":null,
   [junit4]   2> 	  "collection":"testOverseerCol",
   [junit4]   2> 	  "numShards":"4",
   [junit4]   2> 	  "core_node_name":null}
   [junit4]   2> 726880 T2520 oasc.DistributedQueue$LatchChildWatcher.process LatchChildWatcher fired on path: /overseer/queue state: SyncConnected type NodeChildrenChanged
   [junit4]   2> 726881 T2521 oasc.Overseer$ClusterStateUpdater.updateState Update state numShards=4 message={
   [junit4]   2> 	  "operation":"state",
   [junit4]   2> 	  "state":"down",
   [junit4]   2> 	  "base_url":"http://127.0.0.1:38887/pc_aq/ry",
   [junit4]   2> 	  "core":"testOverseerCol_shard4_replica1",
   [junit4]   2> 	  "roles":null,
   [junit4]   2> 	  "node_name":"127.0.0.1:38887_pc_aq%2Fry",
   [junit4]   2> 	  "shard":"shard4",
   [junit4]   2> 	  "shard_range":null,
   [junit4]   2> 	  "shard_state":"active",
   [junit4]   2> 	  "shard_parent":null,
   [junit4]   2> 	  "collection":"testOverseerCol",
   [junit4]   2> 	  "numShards":"4",
   [junit4]   2> 	  "core_node_name":null}
   [junit4]   2> 726883 T2520 oasc.DistributedQueue$LatchChildWatcher.process LatchChildWatcher fired on path: /overseer/queue state: SyncConnected type NodeChildrenChanged
   [junit4]   2> 726986 T2611 oascc.ZkStateReader$2.process A cluster state change: WatchedEvent state:SyncConnected type:NodeDataChanged path:/clusterstate.json, has occurred - updating... (live nodes size: 7)
   [junit4]   2> 726986 T2538 oascc.ZkStateReader$2.process A cluster state change: WatchedEvent state:SyncConnected type:NodeDataChanged path:/clusterstate.json, has occurred - updating... (live nodes size: 7)
   [junit4]   2> 726986 T2608 oascc.ZkStateReader$2.process A cluster state change: WatchedEvent state:SyncConnected type:NodeDataChanged path:/clusterstate.json, has occurred - updating... (live nodes size: 7)
   [junit4]   2> 726986 T2594 oascc.ZkStateReader$2.process A cluster state change: WatchedEvent state:SyncConnected type:NodeDataChanged path:/clusterstate.json, has occurred - updating... (live nodes size: 7)
   [junit4]   2> 726986 T2566 oascc.ZkStateReader$2.process A cluster state change: WatchedEvent state:SyncConnected type:NodeDataChanged path:/clusterstate.json, has occurred - updating... (live nodes size: 7)
   [junit4]   2> 726986 T2613 oascc.ZkStateReader$2.process A cluster state change: WatchedEvent state:SyncConnected type:NodeDataChanged path:/clusterstate.json, has occurred - updating... (live nodes size: 7)
   [junit4]   2> 726986 T2525 oascc.ZkStateReader$2.process A cluster state change: WatchedEvent state:SyncConnected type:NodeDataChanged path:/clusterstate.json, has occurred - updating... (live nodes size: 7)
   [junit4]   2> 726986 T2520 oascc.ZkStateReader$2.process A cluster state change: WatchedEvent state:SyncConnected type:NodeDataChanged path:/clusterstate.json, has occurred - updating... (live nodes size: 7)
   [junit4]   2> 726986 T2552 oascc.ZkStateReader$2.process A cluster state change: WatchedEvent state:SyncConnected type:NodeDataChanged path:/clusterstate.json, has occurred - updating... (live nodes size: 7)
   [junit4]   2> 726986 T2580 oascc.ZkStateReader$2.process A cluster state change: WatchedEvent state:SyncConnected type:NodeDataChanged path:/clusterstate.json, has occurred - updating... (live nodes size: 7)
   [junit4]   2> 727853 T2515 oasc.ZkController.waitForShardId waiting to find shard id in clusterstate for testOverseerCol_shard1_replica2
   [junit4]   2> 727853 T2515 oasc.CoreContainer.create Creating SolrCore 'testOverseerCol_shard1_replica2' using instanceDir: ./org.apache.solr.cloud.OverseerRolesTest-controljetty-1391016628106/testOverseerCol_shard1_replica2
   [junit4]   2> 727854 T2515 oasc.ZkController.createCollectionZkNode Check for collection zkNode:testOverseerCol
   [junit4]   2> 727854 T2561 oasc.ZkController.waitForShardId waiting to find shard id in clusterstate for testOverseerCol_shard4_replica2
   [junit4]   2> 727855 T2531 oasc.ZkController.waitForShardId waiting to find shard id in clusterstate for testOverseerCol_shard2_replica1
   [junit4]   2> 727855 T2515 oasc.ZkController.createCollectionZkNode Collection zkNode exists
   [junit4]   2> 727855 T2515 oascc.ZkStateReader.readConfigName Load collection config from:/collections/testOverseerCol
   [junit4]   2> 727856 T2531 oasc.CoreContainer.create Creating SolrCore 'testOverseerCol_shard2_replica1' using instanceDir: ./org.apache.solr.cloud.OverseerRolesTest-jetty1-1391016628309/testOverseerCol_shard2_replica1
   [junit4]   2> 727855 T2561 oasc.CoreContainer.create Creating SolrCore 'testOverseerCol_shard4_replica2' using instanceDir: ./org.apache.solr.cloud.OverseerRolesTest-jetty3-1391016630780/testOverseerCol_shard4_replica2
   [junit4]   2> 727856 T2561 oasc.ZkController.createCollectionZkNode Check for collection zkNode:testOverseerCol
   [junit4]   2> 727856 T2531 oasc.ZkController.createCollectionZkNode Check for collection zkNode:testOverseerCol
   [junit4]   2> 727857 T2561 oasc.ZkController.createCollectionZkNode Collection zkNode exists
   [junit4]   2> 727857 T2576 oasc.ZkController.waitForShardId waiting to find shard id in clusterstate for testOverseerCol_shard2_replica2
   [junit4]   2> 727857 T2590 oasc.ZkController.waitForShardId waiting to find shard id in clusterstate for testOverseerCol_shard3_replica1
   [junit4]   2> 727858 T2576 oasc.CoreContainer.create Creating SolrCore 'testOverseerCol_shard2_replica2' using instanceDir: ../../../../../../../../../../mnt/ssd/jenkins/workspace/Lucene-Solr-4.x-Linux/solr/build/solr-core/test/J0/./org.apache.solr.cloud.OverseerRolesTest-jetty4-1391016631995/testOverseerCol_shard2_replica2
   [junit4]   2> 727857 T2515 oasc.SolrResourceLoader.<init> new SolrResourceLoader for directory: './org.apache.solr.cloud.OverseerRolesTest-controljetty-1391016628106/testOverseerCol_shard1_replica2/'
   [junit4]   2> 727857 T2560 oasc.ZkController.waitForShardId waiting to find shard id in clusterstate for testOverseerCol_shard1_replica1
   [junit4]   2> 727859 T2576 oasc.ZkController.createCollectionZkNode Check for collection zkNode:testOverseerCol
   [junit4]   2> 727860 T2560 oasc.CoreContainer.create Creating SolrCore 'testOverseerCol_shard1_replica1' using instanceDir: ./org.apache.solr.cloud.OverseerRolesTest-jetty3-1391016630780/testOverseerCol_shard1_replica1
   [junit4]   2> 727860 T2576 oasc.ZkController.createCollectionZkNode Collection zkNode exists
   [junit4]   2> 727861 T2576 oascc.ZkStateReader.readConfigName Load collection config from:/collections/testOverseerCol
   [junit4]   2> 727859 T2590 oasc.CoreContainer.create Creating SolrCore 'testOverseerCol_shard3_replica1' using instanceDir: ./org.apache.solr.cloud.OverseerRolesTest-jetty5-1391016633202/testOverseerCol_shard3_replica1
   [junit4]   2> 727861 T2590 oasc.ZkController.createCollectionZkNode Check for collection zkNode:testOverseerCol
   [junit4]   2> 727858 T2546 oasc.ZkController.waitForShardId waiting to find shard id in clusterstate for testOverseerCol_shard3_replica2
   [junit4]   2> 727858 T2531 oasc.ZkController.createCollectionZkNode Collection zkNode exists
   [junit4]   2> 727863 T2531 oascc.ZkStateReader.readConfigName Load collection config from:/collections/testOverseerCol
   [junit4]   2> 727858 T2601 oasc.ZkController.waitForShardId waiting to find shard id in clusterstate for testOverseerCol_shard4_replica1
   [junit4]   2> 727857 T2561 oascc.ZkStateReader.readConfigName Load collection config from:/collections/testOverseerCol
   [junit4]   2> 727864 T2601 oasc.CoreContainer.create Creating SolrCore 'testOverseerCol_shard4_replica1' using instanceDir: ../../../../../../../../../../mnt/ssd/jenkins/workspace/Lucene-Solr-4.x-Linux/solr/build/solr-core/test/J0/./org.apache.solr.cloud.OverseerRolesTest-jetty6-1391016634386/testOverseerCol_shard4_replica1
   [junit4]   2> 727864 T2601 oasc.ZkController.createCollectionZkNode Check for collection zkNode:testOverseerCol
   [junit4]   2> 727863 T2590 oasc.ZkController.createCollectionZkNode Collection zkNode exists
   [junit4]   2> 727865 T2590 oascc.ZkStateReader.readConfigName Load collection config from:/collections/testOverseerCol
   [junit4]   2> 727863 T2546 oasc.CoreContainer.create Creating SolrCore 'testOverseerCol_shard3_replica2' using instanceDir: ../../../../../../../../../../mnt/ssd/jenkins/workspace/Lucene-Solr-4.x-Linux/solr/build/solr-core/test/J0/./org.apache.solr.cloud.OverseerRolesTest-jetty2-1391016629513/testOverseerCol_shard3_replica2
   [junit4]   2> 727866 T2546 oasc.ZkController.createCollectionZkNode Check for collection zkNode:testOverseerCol
   [junit4]   2> 727862 T2576 oasc.SolrResourceLoader.<init> new SolrResourceLoader for directory: '../../../../../../../../../../mnt/ssd/jenkins/workspace/Lucene-Solr-4.x-Linux/solr/build/solr-core/test/J0/./org.apache.solr.cloud.OverseerRolesTest-jetty4-1391016631995/testOverseerCol_shard2_replica2/'
   [junit4]   2> 727860 T2560 oasc.ZkController.createCollectionZkNode Check for collection zkNode:testOverseerCol
   [junit4]   2> 727867 T2590 oasc.SolrResourceLoader.<init> new SolrResourceLoader for directory: './org.apache.solr.cloud.OverseerRolesTest-jetty5-1391016633202/testOverseerCol_shard3_replica1/'
   [junit4]   2> 727865 T2601 oasc.ZkController.createCollectionZkNode Collection zkNode exists
   [junit4]   2> 727868 T2601 oascc.ZkStateReader.readConfigName Load collection config from:/collections/testOverseerCol
   [junit4]   2> 727865 T2561 oasc.SolrResourceLoader.<init> new SolrResourceLoader for directory: './org.apache.solr.cloud.OverseerRolesTest-jetty3-1391016630780/testOverseerCol_shard4_replica2/'
   [junit4]   2> 727864 T2531 oasc.SolrResourceLoader.<init> new SolrResourceLoader for directory: './org.apache.solr.cloud.OverseerRolesTest-jetty1-1391016628309/testOverseerCol_shard2_replica1/'
   [junit4]   2> 727885 T2546 oasc.ZkController.createCollectionZkNode Collection zkNode exists
   [junit4]   2> 727886 T2546 oascc.ZkStateReader.readConfigName Load collection config from:/collections/testOverseerCol
   [junit4]   2> 727886 T2560 oasc.ZkController.createCollectionZkNode Collection zkNode exists
   [junit4]   2> 727886 T2601 oasc.SolrResourceLoader.<init> new SolrResourceLoader for directory: '../../../../../../../../../../mnt/ssd/jenkins/workspace/Lucene-Solr-4.x-Linux/solr/build/solr-core/test/J0/./org.apache.solr.cloud.OverseerRolesTest-jetty6-1391016634386/testOverseerCol_shard4_replica1/'
   [junit4]   2> 727887 T2560 oascc.ZkStateReader.readConfigName Load collection config from:/collections/testOverseerCol
   [junit4]   2> 727888 T2546 oasc.SolrResourceLoader.<init> new SolrResourceLoader for directory: '../../../../../../../../../../mnt/ssd/jenkins/workspace/Lucene-Solr-4.x-Linux/solr/build/solr-core/test/J0/./org.apache.solr.cloud.OverseerRolesTest-jetty2-1391016629513/testOverseerCol_shard3_replica2/'
   [junit4]   2> 727889 T2560 oasc.SolrResourceLoader.<init> new SolrResourceLoader for directory: './org.apache.solr.cloud.OverseerRolesTest-jetty3-1391016630780/testOverseerCol_shard1_replica1/'
   [junit4]   2> 727976 T2531 oasc.SolrConfig.<init> Using Lucene MatchVersion: LUCENE_47
   [junit4]   2> 727978 T2601 oasc.SolrConfig.<init> Using Lucene MatchVersion: LUCENE_47
   [junit4]   2> 727980 T2515 oasc.SolrConfig.<init> Using Lucene MatchVersion: LUCENE_47
   [junit4]   2> 727993 T2561 oasc.SolrConfig.<init> Using Lucene MatchVersion: LUCENE_47
   [junit4]   2> 728002 T2590 oasc.SolrConfig.<init> Using Lucene MatchVersion: LUCENE_47
   [junit4]   2> 728021 T2576 oasc.SolrConfig.<init> Using Lucene MatchVersion: LUCENE_47
   [junit4]   2> 728023 T2560 oasc.SolrConfig.<init> Using Lucene MatchVersion: LUCENE_47
   [junit4]   2> 728036 T2546 oasc.SolrConfig.<init> Using Lucene MatchVersion: LUCENE_47
   [junit4]   2> 728100 T2601 oasc.SolrConfig.<init> Loaded SolrConfig: solrconfig.xml
   [junit4]   2> 728116 T2601 oass.IndexSchema.readSchema Reading Solr Schema from schema.xml
   [junit4]   2> 728132 T2515 oasc.SolrConfig.<init> Loaded SolrConfig: solrconfig.xml
   [junit4]   2> 728133 T2561 oasc.SolrConfig.<init> Loaded SolrConfig: solrconfig.xml
   [junit4]   2> 728134 T2515 oass.IndexSchema.readSchema Reading Solr Schema from schema.xml
   [junit4]   2> 728135 T2561 oass.IndexSchema.readSchema Reading Solr Schema from schema.xml
   [junit4]   2> 728138 T2531 oasc.SolrConfig.<init> Loaded SolrConfig: solrconfig.xml
   [junit4]   2> 728141 T2531 oass.IndexSchema.readSchema Reading Solr Schema from schema.xml
   [junit4]   2> 728143 T2601 oass.IndexSchema.readSchema [testOverseerCol_shard4_replica1] Schema name=test
   [junit4]   2> 728149 T2561 oass.IndexSchema.readSchema [testOverseerCol_shard4_replica2] Schema name=test
   [junit4]   2> 728149 T2515 oass.IndexSchema.readSchema [testOverseerCol_shard1_replica2] Schema name=test
   [junit4]   2> 728151 T2576 oasc.SolrConfig.<init> Loaded SolrConfig: solrconfig.xml
   [junit4]   2> 728156 T2531 oass.IndexSchema.readSchema [testOverseerCol_shard2_replica1] Schema name=test
   [junit4]   2> 728157 T2590 oasc.SolrConfig.<init> Loaded SolrConfig: solrconfig.xml
   [junit4]   2> 728159 T2590 oass.IndexSchema.readSchema Reading Solr Schema from schema.xml
   [junit4]   2> 728159 T2576 oass.IndexSchema.readSchema Reading Solr Schema from schema.xml
   [junit4]   2> 728168 T2560 oasc.SolrConfig.<init> Loaded SolrConfig: solrconfig.xml
   [junit4]   2> 728172 T2546 oasc.SolrConfig.<init> Loaded SolrConfig: solrconfig.xml
   [junit4]   2> 728174 T2560 oass.IndexSchema.readSchema Reading Solr Schema from schema.xml
   [junit4]   2> 728175 T2546 oass.IndexSchema.readSchema Reading Solr Schema from schema.xml
   [junit4]   2> 728179 T2590 oass.IndexSchema.readSchema [testOverseerCol_shard3_replica1] Schema name=test
   [junit4]   2> 728189 T2546 oass.IndexSchema.readSchema [testOverseerCol_shard3_replica2] Schema name=test
   [junit4]   2> 728192 T2576 oass.IndexSchema.readSchema [testOverseerCol_shard2_replica2] Schema name=test
   [junit4]   2> 728194 T2560 oass.IndexSchema.readSchema [testOverseerCol_shard1_replica1] Schema name=test
   [junit4]   2> 729227 T2531 oass.ByteField.init WARN ByteField is deprecated and will be removed in 5.0. You should use TrieIntField instead.
   [junit4]   2> 729227 T2531 oass.ShortField.init WARN ShortField is deprecated and will be removed in 5.0. You should use TrieIntField instead.
   [junit4]   2> 729228 T2531 oass.OpenExchangeRatesOrgProvider.init Initialized with rates=open-exchange-rates.json, refreshInterval=1440.
   [junit4]   2> 729239 T2531 oass.IndexSchema.readSchema default search field in schema is text
   [junit4]   2> 729242 T2601 oass.ByteField.init WARN ByteField is deprecated and will be removed in 5.0. You should use TrieIntField instead.
   [junit4]   2> 729242 T2601 oass.ShortField.init WARN ShortField is deprecated and will be removed in 5.0. You should use TrieIntField instead.
   [junit4]   2> 729243 T2601 oass.OpenExchangeRatesOrgProvider.init Initialized with rates=open-exchange-rates.json, refreshInterval=1440.
   [junit4]   2> 729244 T2531 oass.IndexSchema.readSchema unique key field: id
   [junit4]   2> 729258 T2531 oass.FileExchangeRateProvider.reload Reloading exchange rates from file currency.xml
   [junit4]   2> 729261 T2601 oass.IndexSchema.readSchema default search field in schema is text
   [junit4]   2> 729262 T2531 oass.FileExchangeRateProvider.reload Reloading exchange rates from file currency.xml
   [junit4]   2> 729264 T2601 oass.IndexSchema.readSchema unique key field: id
   [junit4]   2> 729267 T2531 oass.OpenExchangeRatesOrgProvider.reload Reloading exchange rates from open-exchange-rates.json
   [junit4]   2> 729269 T2531 oass.OpenExchangeRatesOrgProvider$OpenExchangeRates.<init> WARN Unknown key IMPORTANT NOTE
   [junit4]   2> 729269 T2531 oass.OpenExchangeRatesOrgProvider$OpenExchangeRates.<init> WARN Expected key, got STRING
   [junit4]   2> 729269 T2531 oass.OpenExchangeRatesOrgProvider.reload Reloading exchange rates from open-exchange-rates.json
   [junit4]   2> 729271 T2531 oass.OpenExchangeRatesOrgProvider$OpenExchangeRates.<init> WARN Unknown key IMPORTANT NOTE
   [junit4]   2> 729272 T2531 oass.OpenExchangeRatesOrgProvider$OpenExchangeRates.<init> WARN Expected key, got STRING
   [junit4]   2> 729272 T2531 oasc.SolrCore.initDirectoryFactory org.apache.solr.core.MockDirectoryFactory
   [junit4]   2> 729272 T2531 oasc.SolrCore.<init> [testOverseerCol_shard2_replica1] Opening new SolrCore at ./org.apache.solr.cloud.OverseerRolesTest-jetty1-1391016628309/testOverseerCol_shard2_replica1/, dataDir=./org.apache.solr.cloud.OverseerRolesTest-jetty1-1391016628309/testOverseerCol_shard2_replica1/data/
   [junit4]   2> 729273 T2531 oasc.JmxMonitoredMap.<init> JMX monitoring is enabled. Adding Solr mbeans to JMX Server: com.sun.jmx.mbeanserver.JmxMBeanServer@fc019f
   [junit4]   2> 729274 T2531 oasc.CachingDirectoryFactory.get return new directory for ./org.apache.solr.cloud.OverseerRolesTest-jetty1-1391016628309/testOverseerCol_shard2_replica1/data
   [junit4]   2> 729275 T2531 oasc.SolrCore.getNewIndexDir New index directory detected: old=null new=./org.apache.solr.cloud.OverseerRolesTest-jetty1-1391016628309/testOverseerCol_shard2_replica1/data/index/
   [junit4]   2> 729275 T2531 oasc.SolrCore.initIndex WARN [testOverseerCol_shard2_replica1] Solr index directory './org.apache.solr.cloud.OverseerRolesTest-jetty1-1391016628309/testOverseerCol_shard2_replica1/data/index' doesn't exist. Creating new index...
   [junit4]   2> 729276 T2531 oasc.CachingDirectoryFactory.get return new directory for ./org.apache.solr.cloud.OverseerRolesTest-jetty1-1391016628309/testOverseerCol_shard2_replica1/data/index
   [junit4]   2> 729277 T2531 oasu.RandomMergePolicy.<init> RandomMergePolicy wrapping class org.apache.lucene.index.TieredMergePolicy: [TieredMergePolicy: maxMergeAtOnce=48, maxMergeAtOnceExplicit=21, maxMergedSegmentMB=99.6044921875, floorSegmentMB=0.3701171875, forceMergeDeletesPctAllowed=14.57949748481832, segmentsPerTier=38.0, maxCFSSegmentSizeMB=8.796093022207999E12, noCFSRatio=1.0
   [junit4]   2> 729278 T2531 oasc.SolrDeletionPolicy.onCommit SolrDeletionPolicy.onCommit: commits: num=1
   [junit4]   2> 		commit{dir=MockDirectoryWrapper(org.apache.lucene.store.RAMDirectory@1defc6a lockFactory=org.apache.lucene.store.SingleInstanceLockFactory@213383),segFN=segments_1,generation=1}
   [junit4]   2> 729278 T2531 oasc.SolrDeletionPolicy.updateCommits newest commit generation = 1
   [junit4]   2> 729282 T2515 oass.ByteField.init WARN ByteField is deprecated and will be removed in 5.0. You should use TrieIntField instead.
   [junit4]   2> 729285 T2515 oass.ShortField.init WARN ShortField is deprecated and will be removed in 5.0. You should use TrieIntField instead.
   [junit4]   2> 729286 T2515 oass.OpenExchangeRatesOrgProvider.init Initialized with rates=open-exchange-rates.json, refreshInterval=1440.
   [junit4]   2> 729284 T2601 oass.FileExchangeRateProvider.reload Reloading exchange rates from file currency.xml
   [junit4]   2> 729283 T2531 oasup.UpdateRequestProcessorChain.init creating updateRequestProcessorChain "nodistrib"
   [junit4]   2> 729291 T2531 oasup.UpdateRequestProcessorChain.init creating updateRequestProcessorChain "dedupe"
   [junit4]   2> 729292 T2531 oasup.UpdateRequestProcessorChain.init inserting DistributedUpdateProcessorFactory into updateRequestProcessorChain "dedupe"
   [junit4]   2> 729292 T2531 oasup.UpdateRequestProcessorChain.init creating updateRequestProcessorChain "stored_sig"
   [junit4]   2> 729293 T2531 oasup.UpdateRequestProcessorChain.init inserting DistributedUpdateProcessorFactory into updateRequestProcessorChain "stored_sig"
   [junit4]   2> 729293 T2531 oasup.UpdateRequestProcessorChain.init creating updateRequestProcessorChain "distrib-dup-test-chain-explicit"
   [junit4]   2> 729294 T2531 oasup.UpdateRequestProcessorChain.init creating updateRequestProcessorChain "distrib-dup-test-chain-implicit"
   [junit4]   2> 729294 T2531 oasup.UpdateRequestProcessorChain.init inserting DistributedUpdateProcessorFactory into updateRequestProcessorChain "distrib-dup-test-chain-implicit"
   [junit4]   2> 729295 T2531 oasc.SolrCore.loadUpdateProcessorChains no updateRequestProcessorChain defined as default, creating implicit default
   [junit4]   2> 729296 T2601 oass.FileExchangeRateProvider.reload Reloading exchange rates from file currency.xml
   [junit4]   2> 729296 T2531 oas

[...truncated too long message...]

ption.java:51)
   [junit4]   2> 		at org.apache.zookeeper.ZooKeeper.exists(ZooKeeper.java:1041)
   [junit4]   2> 		at org.apache.solr.common.cloud.SolrZkClient$3.execute(SolrZkClient.java:205)
   [junit4]   2> 		at org.apache.solr.common.cloud.SolrZkClient$3.execute(SolrZkClient.java:202)
   [junit4]   2> 		at org.apache.solr.common.cloud.ZkCmdExecutor.retryOperation(ZkCmdExecutor.java:73)
   [junit4]   2> 		at org.apache.solr.common.cloud.SolrZkClient.exists(SolrZkClient.java:202)
   [junit4]   2> 		at org.apache.solr.common.cloud.SolrZkClient.makePath(SolrZkClient.java:413)
   [junit4]   2> 		at org.apache.solr.common.cloud.SolrZkClient.makePath(SolrZkClient.java:382)
   [junit4]   2> 		at org.apache.solr.common.cloud.SolrZkClient.makePath(SolrZkClient.java:369)
   [junit4]   2> 		at org.apache.solr.cloud.ShardLeaderElectionContextBase.runLeaderProcess(ElectionContext.java:112)
   [junit4]   2> 		at org.apache.solr.cloud.ShardLeaderElectionContext.runLeaderProcess(ElectionContext.java:273)
   [junit4]   2> 		at org.apache.solr.cloud.LeaderElector.runIamLeaderProcess(LeaderElector.java:164)
   [junit4]   2> 		at org.apache.solr.cloud.LeaderElector.checkIfIamLeader(LeaderElector.java:108)
   [junit4]   2> 		at org.apache.solr.cloud.LeaderElector.access$000(LeaderElector.java:55)
   [junit4]   2> 		at org.apache.solr.cloud.LeaderElector$1.process(LeaderElector.java:137)
   [junit4]   2> 		at org.apache.zookeeper.ClientCnxn$EventThread.processEvent(ClientCnxn.java:519)
   [junit4]   2> 		at org.apache.zookeeper.ClientCnxn$EventThread.run(ClientCnxn.java:495)
   [junit4]   2> 	
   [junit4]   2> 1082529 T3273 oasc.LeaderElector$1.process WARN  org.apache.zookeeper.KeeperException$SessionExpiredException: KeeperErrorCode = Session expired for /collections/awholynewcollection_1/leader_elect/shard2/election/91161675372757006-core_node6-n_0000000003
   [junit4]   2> 	at org.apache.zookeeper.KeeperException.create(KeeperException.java:127)
   [junit4]   2> 	at org.apache.zookeeper.KeeperException.create(KeeperException.java:51)
   [junit4]   2> 	at org.apache.zookeeper.ZooKeeper.delete(ZooKeeper.java:873)
   [junit4]   2> 	at org.apache.solr.common.cloud.SolrZkClient$2.execute(SolrZkClient.java:173)
   [junit4]   2> 	at org.apache.solr.common.cloud.SolrZkClient$2.execute(SolrZkClient.java:170)
   [junit4]   2> 	at org.apache.solr.common.cloud.ZkCmdExecutor.retryOperation(ZkCmdExecutor.java:73)
   [junit4]   2> 	at org.apache.solr.common.cloud.SolrZkClient.delete(SolrZkClient.java:170)
   [junit4]   2> 	at org.apache.solr.cloud.ElectionContext.cancelElection(ElectionContext.java:67)
   [junit4]   2> 	at org.apache.solr.cloud.ShardLeaderElectionContext.runLeaderProcess(ElectionContext.java:293)
   [junit4]   2> 	at org.apache.solr.cloud.LeaderElector.runIamLeaderProcess(LeaderElector.java:164)
   [junit4]   2> 	at org.apache.solr.cloud.LeaderElector.checkIfIamLeader(LeaderElector.java:108)
   [junit4]   2> 	at org.apache.solr.cloud.LeaderElector.access$000(LeaderElector.java:55)
   [junit4]   2> 	at org.apache.solr.cloud.LeaderElector$1.process(LeaderElector.java:137)
   [junit4]   2> 	at org.apache.zookeeper.ClientCnxn$EventThread.processEvent(ClientCnxn.java:519)
   [junit4]   2> 	at org.apache.zookeeper.ClientCnxn$EventThread.run(ClientCnxn.java:495)
   [junit4]   2> 
   [junit4]   2> 1082529 T3273 oascc.ZkStateReader$3.process WARN ZooKeeper watch triggered, but Solr cannot talk to ZK
   [junit4]   2> 1082529 T3273 oasc.DistributedQueue$LatchChildWatcher.process LatchChildWatcher fired on path: /overseer/queue state: SyncConnected type NodeChildrenChanged
   [junit4]   2> 1082530 T3273 oascc.ZkStateReader$2.process A cluster state change: WatchedEvent state:SyncConnected type:NodeDataChanged path:/clusterstate.json, has occurred - updating... (live nodes size: 1)
   [junit4]   2> 1082530 T3273 oascc.ZkStateReader$2.process WARN ZooKeeper watch triggered, but Solr cannot talk to ZK
   [junit4]   2> 1082530 T3273 oasc.DistributedQueue$LatchChildWatcher.process LatchChildWatcher fired on path: /overseer/queue state: SyncConnected type NodeChildrenChanged
   [junit4]   2> 1082530 T3273 oasc.DistributedQueue$LatchChildWatcher.process LatchChildWatcher fired on path: /overseer/queue state: SyncConnected type NodeChildrenChanged
   [junit4]   2> 1082530 T3273 oasc.DistributedQueue$LatchChildWatcher.process LatchChildWatcher fired on path: /overseer/queue state: SyncConnected type NodeChildrenChanged
   [junit4]   2> 1082530 T3273 oasc.DistributedQueue$LatchChildWatcher.process LatchChildWatcher fired on path: /overseer/queue state: SyncConnected type NodeChildrenChanged
   [junit4]   2> 1082531 T3273 oasc.DistributedQueue$LatchChildWatcher.process LatchChildWatcher fired on path: /overseer/queue state: SyncConnected type NodeChildrenChanged
   [junit4]   2> 1082531 T3273 oasc.DistributedQueue$LatchChildWatcher.process LatchChildWatcher fired on path: /overseer/queue state: SyncConnected type NodeChildrenChanged
   [junit4]   2> 1082531 T3273 oasc.DistributedQueue$LatchChildWatcher.process LatchChildWatcher fired on path: /overseer/queue state: SyncConnected type NodeChildrenChanged
   [junit4]   2> 1082531 T3273 oasc.DistributedQueue$LatchChildWatcher.process LatchChildWatcher fired on path: /overseer/queue state: SyncConnected type NodeChildrenChanged
   [junit4]   2> 1082531 T3273 oasc.DistributedQueue$LatchChildWatcher.process LatchChildWatcher fired on path: /overseer/queue state: SyncConnected type NodeChildrenChanged
   [junit4]   2> 1082531 T3273 oasc.DistributedQueue$LatchChildWatcher.process LatchChildWatcher fired on path: /overseer/queue state: SyncConnected type NodeChildrenChanged
   [junit4]   2> 1082531 T3273 oasc.DistributedQueue$LatchChildWatcher.process LatchChildWatcher fired on path: /overseer/queue state: SyncConnected type NodeChildrenChanged
   [junit4]   2> 1082532 T3273 oasc.DistributedQueue$LatchChildWatcher.process LatchChildWatcher fired on path: /overseer/queue state: SyncConnected type NodeChildrenChanged
   [junit4]   2> 1082532 T3273 oasc.DistributedQueue$LatchChildWatcher.process LatchChildWatcher fired on path: /overseer/queue state: SyncConnected type NodeChildrenChanged
   [junit4]   2> NOTE: test params are: codec=Lucene45, sim=RandomSimilarityProvider(queryNorm=true,coord=yes): {}, locale=en_CA, timezone=America/Caracas
   [junit4]   2> NOTE: Linux 3.8.0-35-generic i386/Oracle Corporation 1.7.0_51 (32-bit)/cpus=8,threads=5,free=49027384,total=332398592
   [junit4]   2> NOTE: All tests run in this JVM: [TestStressVersions, TestDocBasedVersionConstraints, TestLFUCache, DOMUtilTest, TestSort, DistributedDebugComponentTest, TestReplicationHandler, UpdateParamsTest, TestCollationFieldDocValues, TestSolrQueryParserResource, BlockCacheTest, TestSolrIndexConfig, TestTrie, StatelessScriptUpdateProcessorFactoryTest, SearchHandlerTest, TestClassNameShortening, TestConfig, TestHighFrequencyDictionaryFactory, SuggesterTest, TestSolrXml, TestCoreContainer, ReturnFieldsTest, MBeansHandlerTest, TestDistributedMissingSort, CSVRequestHandlerTest, TestRandomDVFaceting, CopyFieldTest, EnumFieldTest, QueryEqualityTest, UpdateRequestProcessorFactoryTest, UnloadDistributedZkTest, TestSolrXmlPersistence, TestFieldTypeCollectionResource, TestSolrQueryParser, TestSchemaVersionResource, RecoveryZkTest, TestCloudManagedSchema, TestPostingsSolrHighlighter, TestReversedWildcardFilterFactory, TestCollapseQParserPlugin, SampleTest, TestPerFieldSimilarity, UUIDFieldTest, TestFunctionQuery, TestSolrXmlPersistor, SimpleFacetsTest, DistributedTermsComponentTest, TestLRUCache, ChangedSchemaMergeTest, PreAnalyzedUpdateProcessorTest, TestBadConfig, SchemaVersionSpecificBehaviorTest, BJQParserTest, TestWriterPerf, DateMathParserTest, TestBM25SimilarityFactory, FileBasedSpellCheckerTest, DeleteReplicaTest, SliceStateTest, LoggingHandlerTest, FastVectorHighlighterTest, TestDocSet, TestPHPSerializedResponseWriter, HdfsLockFactoryTest, SystemInfoHandlerTest, ResourceLoaderTest, DistribCursorPagingTest, EchoParamsTest, TestAnalyzeInfixSuggestions, WordBreakSolrSpellCheckerTest, TestShardHandlerFactory, TestMaxScoreQueryParser, RegexBoostProcessorTest, HdfsBasicDistributedZk2Test, ScriptEngineTest, TestRealTimeGet, ShardRoutingTest, TestDocumentBuilder, CoreAdminCreateDiscoverTest, TestInfoStreamLogging, OverseerRolesTest, AutoCommitTest, TestAddFieldRealTimeGet, TestLMJelinekMercerSimilarityFactory, TermVectorComponentTest, TestReloadAndDeleteDocs, ClusterStateUpdateTest, BasicDistributedZkTest, CollectionsAPIDistributedZkTest]
   [junit4] Completed on J0 in 217.11s, 1 test, 1 failure <<< FAILURES!

[...truncated 526 lines...]
BUILD FAILED
/mnt/ssd/jenkins/workspace/Lucene-Solr-4.x-Linux/build.xml:459: The following error occurred while executing this line:
/mnt/ssd/jenkins/workspace/Lucene-Solr-4.x-Linux/build.xml:439: The following error occurred while executing this line:
/mnt/ssd/jenkins/workspace/Lucene-Solr-4.x-Linux/build.xml:39: The following error occurred while executing this line:
/mnt/ssd/jenkins/workspace/Lucene-Solr-4.x-Linux/extra-targets.xml:37: The following error occurred while executing this line:
/mnt/ssd/jenkins/workspace/Lucene-Solr-4.x-Linux/solr/build.xml:189: The following error occurred while executing this line:
/mnt/ssd/jenkins/workspace/Lucene-Solr-4.x-Linux/solr/common-build.xml:491: The following error occurred while executing this line:
/mnt/ssd/jenkins/workspace/Lucene-Solr-4.x-Linux/lucene/common-build.xml:1308: The following error occurred while executing this line:
/mnt/ssd/jenkins/workspace/Lucene-Solr-4.x-Linux/lucene/common-build.xml:941: There were test failures: 355 suites, 1549 tests, 1 error, 1 failure, 35 ignored (7 assumptions)

Total time: 49 minutes 2 seconds
Build step 'Invoke Ant' marked build as failure
Description set: Java: 32bit/jdk1.7.0_51 -client -XX:+UseParallelGC
Archiving artifacts
Recording test results
Email was triggered for: Failure
Sending email for trigger: Failure



Mime
View raw message