lucene-dev mailing list archives

Site index · List index
Message view « Date » · « Thread »
Top « Date » · « Thread »
From Simon Willnauer <sim...@apache.org>
Subject Re: [JENKINS] Lucene-4x-Linux-Java6-64-test-only - Build # 7221 - Failure!
Date Fri, 20 Dec 2013 16:07:20 GMT
I committed a fix for this via https://issues.apache.org/jira/browse/LUCENE-5374

On Fri, Dec 20, 2013 at 11:34 AM,  <builder@flonkings.com> wrote:
> Build: builds.flonkings.com/job/Lucene-4x-Linux-Java6-64-test-only/7221/
>
> 1 tests failed.
> REGRESSION:  org.apache.lucene.index.TestIndexWriterWithThreads.testRollbackAndCommitWithThreads
>
> Error Message:
> Captured an uncaught exception in thread: Thread[id=52, name=Thread-30, state=RUNNABLE,
group=TGRP-TestIndexWriterWithThreads]
>
> Stack Trace:
> com.carrotsearch.randomizedtesting.UncaughtExceptionError: Captured an uncaught exception
in thread: Thread[id=52, name=Thread-30, state=RUNNABLE, group=TGRP-TestIndexWriterWithThreads]
> Caused by: java.lang.RuntimeException: org.apache.lucene.store.AlreadyClosedException:
this IndexWriter is closed
>         at __randomizedtesting.SeedInfo.seed([9F426806DBDEDA51]:0)
>         at org.apache.lucene.index.TestIndexWriterWithThreads$1.run(TestIndexWriterWithThreads.java:619)
> Caused by: org.apache.lucene.store.AlreadyClosedException: this IndexWriter is closed
>         at org.apache.lucene.index.IndexWriter.ensureOpen(IndexWriter.java:645)
>         at org.apache.lucene.index.IndexWriter.numDeletedDocs(IndexWriter.java:622)
>         at org.apache.lucene.index.IndexWriter.segString(IndexWriter.java:4265)
>         at org.apache.lucene.index.IndexWriter.publishFlushedSegment(IndexWriter.java:2324)
>         at org.apache.lucene.index.DocumentsWriterFlushQueue$FlushTicket.publishFlushedSegment(DocumentsWriterFlushQueue.java:198)
>         at org.apache.lucene.index.DocumentsWriterFlushQueue$FlushTicket.finishFlush(DocumentsWriterFlushQueue.java:213)
>         at org.apache.lucene.index.DocumentsWriterFlushQueue$SegmentFlushTicket.publish(DocumentsWriterFlushQueue.java:249)
>         at org.apache.lucene.index.DocumentsWriterFlushQueue.innerPurge(DocumentsWriterFlushQueue.java:116)
>         at org.apache.lucene.index.DocumentsWriterFlushQueue.forcePurge(DocumentsWriterFlushQueue.java:138)
>         at org.apache.lucene.index.DocumentsWriter.purgeBuffer(DocumentsWriter.java:185)
>         at org.apache.lucene.index.IndexWriter.purge(IndexWriter.java:4634)
>         at org.apache.lucene.index.DocumentsWriter$ForcedPurgeEvent.process(DocumentsWriter.java:701)
>         at org.apache.lucene.index.IndexWriter.processEvents(IndexWriter.java:4665)
>         at org.apache.lucene.index.IndexWriter.processEvents(IndexWriter.java:4657)
>         at org.apache.lucene.index.IndexWriter.closeInternal(IndexWriter.java:1067)
>         at org.apache.lucene.index.IndexWriter.rollbackInternal(IndexWriter.java:2106)
>         at org.apache.lucene.index.IndexWriter.rollback(IndexWriter.java:2024)
>         at org.apache.lucene.index.TestIndexWriterWithThreads$1.run(TestIndexWriterWithThreads.java:575)
>
>
>
>
> Build Log:
> [...truncated 321 lines...]
>    [junit4] Suite: org.apache.lucene.index.TestIndexWriterWithThreads
>    [junit4]   2> 20.12.2013 5:59:52 com.carrotsearch.randomizedtesting.RandomizedRunner$QueueUncaughtExceptionsHandler
uncaughtException
>    [junit4]   2> WARNING: Uncaught exception in thread: Thread[Thread-33,5,TGRP-TestIndexWriterWithThreads]
>    [junit4]   2> java.lang.RuntimeException: org.apache.lucene.store.AlreadyClosedException:
this IndexWriter is closed
>    [junit4]   2>        at __randomizedtesting.SeedInfo.seed([9F426806DBDEDA51]:0)
>    [junit4]   2>        at org.apache.lucene.index.TestIndexWriterWithThreads$1.run(TestIndexWriterWithThreads.java:619)
>    [junit4]   2> Caused by: org.apache.lucene.store.AlreadyClosedException: this IndexWriter
is closed
>    [junit4]   2>        at org.apache.lucene.index.IndexWriter.ensureOpen(IndexWriter.java:645)
>    [junit4]   2>        at org.apache.lucene.index.IndexWriter.ensureOpen(IndexWriter.java:659)
>    [junit4]   2>        at org.apache.lucene.index.IndexWriter.rollback(IndexWriter.java:2018)
>    [junit4]   2>        at org.apache.lucene.index.TestIndexWriterWithThreads$1.run(TestIndexWriterWithThreads.java:575)
>    [junit4]   2> 20.12.2013 5:59:52 com.carrotsearch.randomizedtesting.RandomizedRunner$QueueUncaughtExceptionsHandler
uncaughtException
>    [junit4]   2> WARNING: Uncaught exception in thread: Thread[Thread-31,5,TGRP-TestIndexWriterWithThreads]
>    [junit4]   2> java.lang.RuntimeException: org.apache.lucene.store.AlreadyClosedException:
this IndexWriter is closed
>    [junit4]   2>        at __randomizedtesting.SeedInfo.seed([9F426806DBDEDA51]:0)
>    [junit4]   2>        at org.apache.lucene.index.TestIndexWriterWithThreads$1.run(TestIndexWriterWithThreads.java:619)
>    [junit4]   2> Caused by: org.apache.lucene.store.AlreadyClosedException: this IndexWriter
is closed
>    [junit4]   2>        at org.apache.lucene.index.IndexWriter.ensureOpen(IndexWriter.java:645)
>    [junit4]   2>        at org.apache.lucene.index.IndexWriter.ensureOpen(IndexWriter.java:659)
>    [junit4]   2>        at org.apache.lucene.index.IndexWriter.rollback(IndexWriter.java:2018)
>    [junit4]   2>        at org.apache.lucene.index.TestIndexWriterWithThreads$1.run(TestIndexWriterWithThreads.java:575)
>    [junit4]   2> 20.12.2013 5:59:52 com.carrotsearch.randomizedtesting.RandomizedRunner$QueueUncaughtExceptionsHandler
uncaughtException
>    [junit4]   2> WARNING: Uncaught exception in thread: Thread[Thread-30,5,TGRP-TestIndexWriterWithThreads]
>    [junit4]   2> java.lang.RuntimeException: org.apache.lucene.store.AlreadyClosedException:
this IndexWriter is closed
>    [junit4]   2>        at __randomizedtesting.SeedInfo.seed([9F426806DBDEDA51]:0)
>    [junit4]   2>        at org.apache.lucene.index.TestIndexWriterWithThreads$1.run(TestIndexWriterWithThreads.java:619)
>    [junit4]   2> Caused by: org.apache.lucene.store.AlreadyClosedException: this IndexWriter
is closed
>    [junit4]   2>        at org.apache.lucene.index.IndexWriter.ensureOpen(IndexWriter.java:645)
>    [junit4]   2>        at org.apache.lucene.index.IndexWriter.numDeletedDocs(IndexWriter.java:622)
>    [junit4]   2>        at org.apache.lucene.index.IndexWriter.segString(IndexWriter.java:4265)
>    [junit4]   2>        at org.apache.lucene.index.IndexWriter.publishFlushedSegment(IndexWriter.java:2324)
>    [junit4]   2>        at org.apache.lucene.index.DocumentsWriterFlushQueue$FlushTicket.publishFlushedSegment(DocumentsWriterFlushQueue.java:198)
>    [junit4]   2>        at org.apache.lucene.index.DocumentsWriterFlushQueue$FlushTicket.finishFlush(DocumentsWriterFlushQueue.java:213)
>    [junit4]   2>        at org.apache.lucene.index.DocumentsWriterFlushQueue$SegmentFlushTicket.publish(DocumentsWriterFlushQueue.java:249)
>    [junit4]   2>        at org.apache.lucene.index.DocumentsWriterFlushQueue.innerPurge(DocumentsWriterFlushQueue.java:116)
>    [junit4]   2>        at org.apache.lucene.index.DocumentsWriterFlushQueue.forcePurge(DocumentsWriterFlushQueue.java:138)
>    [junit4]   2>        at org.apache.lucene.index.DocumentsWriter.purgeBuffer(DocumentsWriter.java:185)
>    [junit4]   2>        at org.apache.lucene.index.IndexWriter.purge(IndexWriter.java:4634)
>    [junit4]   2>        at org.apache.lucene.index.DocumentsWriter$ForcedPurgeEvent.process(DocumentsWriter.java:701)
>    [junit4]   2>        at org.apache.lucene.index.IndexWriter.processEvents(IndexWriter.java:4665)
>    [junit4]   2>        at org.apache.lucene.index.IndexWriter.processEvents(IndexWriter.java:4657)
>    [junit4]   2>        at org.apache.lucene.index.IndexWriter.closeInternal(IndexWriter.java:1067)
>    [junit4]   2>        at org.apache.lucene.index.IndexWriter.rollbackInternal(IndexWriter.java:2106)
>    [junit4]   2>        at org.apache.lucene.index.IndexWriter.rollback(IndexWriter.java:2024)
>    [junit4]   2>        at org.apache.lucene.index.TestIndexWriterWithThreads$1.run(TestIndexWriterWithThreads.java:575)
>    [junit4]   2> 20.12.2013 5:59:52 com.carrotsearch.randomizedtesting.RandomizedRunner$QueueUncaughtExceptionsHandler
uncaughtException
>    [junit4]   2> WARNING: Uncaught exception in thread: Thread[Thread-29,5,TGRP-TestIndexWriterWithThreads]
>    [junit4]   2> java.lang.RuntimeException: org.apache.lucene.store.AlreadyClosedException:
this IndexWriter is closed
>    [junit4]   2>        at __randomizedtesting.SeedInfo.seed([9F426806DBDEDA51]:0)
>    [junit4]   2>        at org.apache.lucene.index.TestIndexWriterWithThreads$1.run(TestIndexWriterWithThreads.java:619)
>    [junit4]   2> Caused by: org.apache.lucene.store.AlreadyClosedException: this IndexWriter
is closed
>    [junit4]   2>        at org.apache.lucene.index.IndexWriter.ensureOpen(IndexWriter.java:645)
>    [junit4]   2>        at org.apache.lucene.index.IndexWriter.ensureOpen(IndexWriter.java:659)
>    [junit4]   2>        at org.apache.lucene.index.IndexWriter.rollback(IndexWriter.java:2018)
>    [junit4]   2>        at org.apache.lucene.index.TestIndexWriterWithThreads$1.run(TestIndexWriterWithThreads.java:575)
>    [junit4]   2> NOTE: reproduce with: ant test  -Dtestcase=TestIndexWriterWithThreads
-Dtests.method=testRollbackAndCommitWithThreads -Dtests.seed=9F426806DBDEDA51 -Dtests.slow=true
-Dtests.locale=sk_SK -Dtests.timezone=America/Caracas -Dtests.file.encoding=US-ASCII
>    [junit4] ERROR   0.64s J2 | TestIndexWriterWithThreads.testRollbackAndCommitWithThreads
<<<
>    [junit4]    > Throwable #1: java.lang.AssertionError
>    [junit4]    >        at org.apache.lucene.index.TestIndexWriterWithThreads.testRollbackAndCommitWithThreads(TestIndexWriterWithThreads.java:631)
>    [junit4]    >        at java.lang.Thread.run(Thread.java:662)Throwable #2: com.carrotsearch.randomizedtesting.UncaughtExceptionError:
Captured an uncaught exception in thread: Thread[id=52, name=Thread-30, state=RUNNABLE, group=TGRP-TestIndexWriterWithThreads]
>    [junit4]    > Caused by: java.lang.RuntimeException: org.apache.lucene.store.AlreadyClosedException:
this IndexWriter is closed
>    [junit4]    >        at __randomizedtesting.SeedInfo.seed([9F426806DBDEDA51]:0)
>    [junit4]    >        at org.apache.lucene.index.TestIndexWriterWithThreads$1.run(TestIndexWriterWithThreads.java:619)
>    [junit4]    > Caused by: org.apache.lucene.store.AlreadyClosedException: this IndexWriter
is closed
>    [junit4]    >        at org.apache.lucene.index.IndexWriter.ensureOpen(IndexWriter.java:645)
>    [junit4]    >        at org.apache.lucene.index.IndexWriter.numDeletedDocs(IndexWriter.java:622)
>    [junit4]    >        at org.apache.lucene.index.IndexWriter.segString(IndexWriter.java:4265)
>    [junit4]    >        at org.apache.lucene.index.IndexWriter.publishFlushedSegment(IndexWriter.java:2324)
>    [junit4]    >        at org.apache.lucene.index.DocumentsWriterFlushQueue$FlushTicket.publishFlushedSegment(DocumentsWriterFlushQueue.java:198)
>    [junit4]    >        at org.apache.lucene.index.DocumentsWriterFlushQueue$FlushTicket.finishFlush(DocumentsWriterFlushQueue.java:213)
>    [junit4]    >        at org.apache.lucene.index.DocumentsWriterFlushQueue$SegmentFlushTicket.publish(DocumentsWriterFlushQueue.java:249)
>    [junit4]    >        at org.apache.lucene.index.DocumentsWriterFlushQueue.innerPurge(DocumentsWriterFlushQueue.java:116)
>    [junit4]    >        at org.apache.lucene.index.DocumentsWriterFlushQueue.forcePurge(DocumentsWriterFlushQueue.java:138)
>    [junit4]    >        at org.apache.lucene.index.DocumentsWriter.purgeBuffer(DocumentsWriter.java:185)
>    [junit4]    >        at org.apache.lucene.index.IndexWriter.purge(IndexWriter.java:4634)
>    [junit4]    >        at org.apache.lucene.index.DocumentsWriter$ForcedPurgeEvent.process(DocumentsWriter.java:701)
>    [junit4]    >        at org.apache.lucene.index.IndexWriter.processEvents(IndexWriter.java:4665)
>    [junit4]    >        at org.apache.lucene.index.IndexWriter.processEvents(IndexWriter.java:4657)
>    [junit4]    >        at org.apache.lucene.index.IndexWriter.closeInternal(IndexWriter.java:1067)
>    [junit4]    >        at org.apache.lucene.index.IndexWriter.rollbackInternal(IndexWriter.java:2106)
>    [junit4]    >        at org.apache.lucene.index.IndexWriter.rollback(IndexWriter.java:2024)
>    [junit4]    >        at org.apache.lucene.index.TestIndexWriterWithThreads$1.run(TestIndexWriterWithThreads.java:575)Throwable
#3: com.carrotsearch.randomizedtesting.UncaughtExceptionError: Captured an uncaught exception
in thread: Thread[id=51, name=Thread-29, state=RUNNABLE, group=TGRP-TestIndexWriterWithThreads]
>    [junit4]    > Caused by: java.lang.RuntimeException: org.apache.lucene.store.AlreadyClosedException:
this IndexWriter is closed
>    [junit4]    >        at __randomizedtesting.SeedInfo.seed([9F426806DBDEDA51]:0)
>    [junit4]    >        at org.apache.lucene.index.TestIndexWriterWithThreads$1.run(TestIndexWriterWithThreads.java:619)
>    [junit4]    > Caused by: org.apache.lucene.store.AlreadyClosedException: this IndexWriter
is closed
>    [junit4]    >        at org.apache.lucene.index.IndexWriter.ensureOpen(IndexWriter.java:645)
>    [junit4]    >        at org.apache.lucene.index.IndexWriter.ensureOpen(IndexWriter.java:659)
>    [junit4]    >        at org.apache.lucene.index.IndexWriter.rollback(IndexWriter.java:2018)
>    [junit4]    >        at org.apache.lucene.index.TestIndexWriterWithThreads$1.run(TestIndexWriterWithThreads.java:575)Throwable
#4: com.carrotsearch.randomizedtesting.UncaughtExceptionError: Captured an uncaught exception
in thread: Thread[id=53, name=Thread-31, state=RUNNABLE, group=TGRP-TestIndexWriterWithThreads]
>    [junit4]    > Caused by: java.lang.RuntimeException: org.apache.lucene.store.AlreadyClosedException:
this IndexWriter is closed
>    [junit4]    >        at __randomizedtesting.SeedInfo.seed([9F426806DBDEDA51]:0)
>    [junit4]    >        at org.apache.lucene.index.TestIndexWriterWithThreads$1.run(TestIndexWriterWithThreads.java:619)
>    [junit4]    > Caused by: org.apache.lucene.store.AlreadyClosedException: this IndexWriter
is closed
>    [junit4]    >        at org.apache.lucene.index.IndexWriter.ensureOpen(IndexWriter.java:645)
>    [junit4]    >        at org.apache.lucene.index.IndexWriter.ensureOpen(IndexWriter.java:659)
>    [junit4]    >        at org.apache.lucene.index.IndexWriter.rollback(IndexWriter.java:2018)
>    [junit4]    >        at org.apache.lucene.index.TestIndexWriterWithThreads$1.run(TestIndexWriterWithThreads.java:575)Throwable
#5: com.carrotsearch.randomizedtesting.UncaughtExceptionError: Captured an uncaught exception
in thread: Thread[id=55, name=Thread-33, state=RUNNABLE, group=TGRP-TestIndexWriterWithThreads]
>    [junit4]    > Caused by: java.lang.RuntimeException: org.apache.lucene.store.AlreadyClosedException:
this IndexWriter is closed
>    [junit4]    >        at __randomizedtesting.SeedInfo.seed([9F426806DBDEDA51]:0)
>    [junit4]    >        at org.apache.lucene.index.TestIndexWriterWithThreads$1.run(TestIndexWriterWithThreads.java:619)
>    [junit4]    > Caused by: org.apache.lucene.store.AlreadyClosedException: this IndexWriter
is closed
>    [junit4]    >        at org.apache.lucene.index.IndexWriter.ensureOpen(IndexWriter.java:645)
>    [junit4]    >        at org.apache.lucene.index.IndexWriter.ensureOpen(IndexWriter.java:659)
>    [junit4]    >        at org.apache.lucene.index.IndexWriter.rollback(IndexWriter.java:2018)
>    [junit4]    >        at org.apache.lucene.index.TestIndexWriterWithThreads$1.run(TestIndexWriterWithThreads.java:575)
>    [junit4]   2> NOTE: test params are: codec=Lucene46: {field=PostingsFormat(name=Lucene41WithOrds),
docid=Lucene41(blocksize=128), body=PostingsFormat(name=Lucene41WithOrds), title=Pulsing41(freqCutoff=8
minBlockSize=100 maxBlockSize=256), titleTokenized=PostingsFormat(name=Direct), date=PostingsFormat(name=Lucene41WithOrds)},
docValues:{titleDV=DocValuesFormat(name=Asserting), dv=DocValuesFormat(name=Asserting)}, sim=RandomSimilarityProvider(queryNorm=true,coord=no):
{field=DFR GB2, body=IB SPL-L3(800.0), titleTokenized=DFR I(ne)BZ(0.3)}, locale=sk_SK, timezone=America/Caracas
>    [junit4]   2> NOTE: Linux 3.2.0-26-generic amd64/Sun Microsystems Inc. 1.6.0_45
(64-bit)/cpus=8,threads=1,free=142656568,total=234946560
>    [junit4]   2> NOTE: All tests run in this JVM: [TestMultiLevelSkipList, TestParallelTermEnum,
TestDocValuesFormat, TestFieldValueFilter, TestRecyclingByteBlockAllocator, TestBlockPostingsFormat2,
TestIndexWriterWithThreads]
>    [junit4] Completed on J2 in 9.26s, 12 tests, 1 error <<< FAILURES!
>
> [...truncated 1148 lines...]
> BUILD FAILED
> /var/lib/jenkins/workspace/Lucene-4x-Linux-Java6-64-test-only/checkout/lucene/build.xml:49:
The following error occurred while executing this line:
> /var/lib/jenkins/workspace/Lucene-4x-Linux-Java6-64-test-only/checkout/lucene/common-build.xml:1307:
The following error occurred while executing this line:
> /var/lib/jenkins/workspace/Lucene-4x-Linux-Java6-64-test-only/checkout/lucene/common-build.xml:940:
There were test failures: 379 suites, 2758 tests, 1 error, 106 ignored (93 assumptions)
>
> Total time: 5 minutes 42 seconds
> Build step 'Invoke Ant' marked build as failure
> Recording test results
> Email was triggered for: Failure
> Sending email for trigger: Failure
>

---------------------------------------------------------------------
To unsubscribe, e-mail: dev-unsubscribe@lucene.apache.org
For additional commands, e-mail: dev-help@lucene.apache.org


Mime
View raw message