lucene-dev mailing list archives

Site index · List index
Message view « Date » · « Thread »
Top « Date » · « Thread »
From Apache Jenkins Server <jenk...@builds.apache.org>
Subject [JENKINS] Lucene-Solr-NightlyTests-trunk - Build # 456 - Still Failing
Date Mon, 02 Dec 2013 22:35:10 GMT
Build: https://builds.apache.org/job/Lucene-Solr-NightlyTests-trunk/456/

6 tests failed.
REGRESSION:  org.apache.solr.analytics.expression.ExpressionTest.negateTest

Error Message:
Caught exception in getStatResult, xPath = /response/lst[@name='stats']/lst[@name='nr']/double[@name='sum']  raw data: <?xml version="1.0" encoding="UTF-8"?> <response>  <lst name="responseHeader">   <int name="status">0</int>   <int name="QTime">22</int> </lst> <result name="response" numFound="100" start="0"> </result> <lst name="stats">   <lst name="stats_fields"/> </lst> <lst name="stats">   <lst name="dr">     <long name="count">100</long>     <null name="mc"/>     <null name="mean"/>     <null name="su"/>     <null name="sum"/>     <null name="unique"/>   </lst>   <lst name="cr">     <str name="ccmax">this is the secondstr9</str>     <str name="ccmin">this is the firststr0</str>     <str name="csmax">this is the second</str>     <str name="csmin">this is the first</str>     <str name="max">str9</str>     <str name="min">str0</str>   </lst>   <lst name="pr">     <long name="count">100</long>     <null name="mc"/>     <null name="mean"/>     <null name="su"/>     <null name="sum"/>     <null name="unique"/>   </lst>   <lst name="nr">     <double name="c">-100.0</double>     <long name="count">100</long>     <null name="s"/>     <null name="sum"/>   </lst>   <lst name="dmr">     <str name="cma">+2MONTHS</str>     <str name="cme">+2YEARS</str>     <date name="dmma">1812-02-29T23:59:59Z</date>     <date name="dmme">1807-12-31T23:59:59Z</date>     <date name="max">1811-12-31T23:59:59Z</date>     <date name="median">1805-12-31T23:59:59Z</date>   </lst>   <lst name="csr">     <str name="cs1">this is the first</str>     <str name="cs2">this is the second</str>     <str name="cs3">this is the third</str>   </lst>   <lst name="cdr">     <date name="cd1">1800-12-31T23:59:59Z</date>     <date name="cd2">1804-06-30T23:59:59Z</date>     <str name="cs1">1800-12-31T23:59:59Z</str>     <str name="cs2">1804-06-30T23:59:59Z</str>   </lst>   <lst name="rr">     <str name="max">str9</str>     <str name="min">str0</str>     <str name="rmax">9rts</str>     <str name="rmin">0rts</str>   </lst>   <lst name="cnr">     <double name="c10">10.0</double>     <double name="c8">8.0</double>   </lst>   <lst name="mr">     <long name="count">100</long>     <null name="mcm"/>     <null name="mean"/>     <null name="median"/>     <null name="su"/>     <null name="sum"/>     <null name="unique"/>   </lst>   <lst name="ar">     <long name="count">100</long>     <null name="mcm"/>     <null name="mean"/>     <null name="median"/>     <null name="su"/>     <null name="sum"/>     <null name="unique"/>   </lst>   <lst name="avr">     <double name="c">100.0</double>     <long name="count">100</long>     <null name="s"/>     <null name="sum"/>   </lst> </lst> </response> 

Stack Trace:
java.lang.AssertionError: Caught exception in getStatResult, xPath = /response/lst[@name='stats']/lst[@name='nr']/double[@name='sum'] 
raw data: <?xml version="1.0" encoding="UTF-8"?>
<response>

<lst name="responseHeader">
  <int name="status">0</int>
  <int name="QTime">22</int>
</lst>
<result name="response" numFound="100" start="0">
</result>
<lst name="stats">
  <lst name="stats_fields"/>
</lst>
<lst name="stats">
  <lst name="dr">
    <long name="count">100</long>
    <null name="mc"/>
    <null name="mean"/>
    <null name="su"/>
    <null name="sum"/>
    <null name="unique"/>
  </lst>
  <lst name="cr">
    <str name="ccmax">this is the secondstr9</str>
    <str name="ccmin">this is the firststr0</str>
    <str name="csmax">this is the second</str>
    <str name="csmin">this is the first</str>
    <str name="max">str9</str>
    <str name="min">str0</str>
  </lst>
  <lst name="pr">
    <long name="count">100</long>
    <null name="mc"/>
    <null name="mean"/>
    <null name="su"/>
    <null name="sum"/>
    <null name="unique"/>
  </lst>
  <lst name="nr">
    <double name="c">-100.0</double>
    <long name="count">100</long>
    <null name="s"/>
    <null name="sum"/>
  </lst>
  <lst name="dmr">
    <str name="cma">+2MONTHS</str>
    <str name="cme">+2YEARS</str>
    <date name="dmma">1812-02-29T23:59:59Z</date>
    <date name="dmme">1807-12-31T23:59:59Z</date>
    <date name="max">1811-12-31T23:59:59Z</date>
    <date name="median">1805-12-31T23:59:59Z</date>
  </lst>
  <lst name="csr">
    <str name="cs1">this is the first</str>
    <str name="cs2">this is the second</str>
    <str name="cs3">this is the third</str>
  </lst>
  <lst name="cdr">
    <date name="cd1">1800-12-31T23:59:59Z</date>
    <date name="cd2">1804-06-30T23:59:59Z</date>
    <str name="cs1">1800-12-31T23:59:59Z</str>
    <str name="cs2">1804-06-30T23:59:59Z</str>
  </lst>
  <lst name="rr">
    <str name="max">str9</str>
    <str name="min">str0</str>
    <str name="rmax">9rts</str>
    <str name="rmin">0rts</str>
  </lst>
  <lst name="cnr">
    <double name="c10">10.0</double>
    <double name="c8">8.0</double>
  </lst>
  <lst name="mr">
    <long name="count">100</long>
    <null name="mcm"/>
    <null name="mean"/>
    <null name="median"/>
    <null name="su"/>
    <null name="sum"/>
    <null name="unique"/>
  </lst>
  <lst name="ar">
    <long name="count">100</long>
    <null name="mcm"/>
    <null name="mean"/>
    <null name="median"/>
    <null name="su"/>
    <null name="sum"/>
    <null name="unique"/>
  </lst>
  <lst name="avr">
    <double name="c">100.0</double>
    <long name="count">100</long>
    <null name="s"/>
    <null name="sum"/>
  </lst>
</lst>
</response>

	at __randomizedtesting.SeedInfo.seed([2F7E4A527AF5F39D:277622F7DED8A32D]:0)
	at org.junit.Assert.fail(Assert.java:93)
	at org.apache.solr.analytics.AbstractAnalyticsStatsTest.getStatResult(AbstractAnalyticsStatsTest.java:113)
	at org.apache.solr.analytics.expression.ExpressionTest.negateTest(ExpressionTest.java:132)
	at sun.reflect.NativeMethodAccessorImpl.invoke0(Native Method)
	at sun.reflect.NativeMethodAccessorImpl.invoke(NativeMethodAccessorImpl.java:57)
	at sun.reflect.DelegatingMethodAccessorImpl.invoke(DelegatingMethodAccessorImpl.java:43)
	at java.lang.reflect.Method.invoke(Method.java:606)
	at com.carrotsearch.randomizedtesting.RandomizedRunner.invoke(RandomizedRunner.java:1559)
	at com.carrotsearch.randomizedtesting.RandomizedRunner.access$600(RandomizedRunner.java:79)
	at com.carrotsearch.randomizedtesting.RandomizedRunner$6.evaluate(RandomizedRunner.java:737)
	at com.carrotsearch.randomizedtesting.RandomizedRunner$7.evaluate(RandomizedRunner.java:773)
	at com.carrotsearch.randomizedtesting.RandomizedRunner$8.evaluate(RandomizedRunner.java:787)
	at com.carrotsearch.randomizedtesting.rules.SystemPropertiesRestoreRule$1.evaluate(SystemPropertiesRestoreRule.java:53)
	at org.apache.lucene.util.TestRuleSetupTeardownChained$1.evaluate(TestRuleSetupTeardownChained.java:50)
	at org.apache.lucene.util.TestRuleFieldCacheSanity$1.evaluate(TestRuleFieldCacheSanity.java:51)
	at org.apache.lucene.util.AbstractBeforeAfterRule$1.evaluate(AbstractBeforeAfterRule.java:46)
	at com.carrotsearch.randomizedtesting.rules.SystemPropertiesInvariantRule$1.evaluate(SystemPropertiesInvariantRule.java:55)
	at org.apache.lucene.util.TestRuleThreadAndTestName$1.evaluate(TestRuleThreadAndTestName.java:49)
	at org.apache.lucene.util.TestRuleIgnoreAfterMaxFailures$1.evaluate(TestRuleIgnoreAfterMaxFailures.java:70)
	at org.apache.lucene.util.TestRuleMarkFailure$1.evaluate(TestRuleMarkFailure.java:48)
	at com.carrotsearch.randomizedtesting.rules.StatementAdapter.evaluate(StatementAdapter.java:36)
	at com.carrotsearch.randomizedtesting.ThreadLeakControl$StatementRunner.run(ThreadLeakControl.java:358)
	at com.carrotsearch.randomizedtesting.ThreadLeakControl.forkTimeoutingTask(ThreadLeakControl.java:782)
	at com.carrotsearch.randomizedtesting.ThreadLeakControl$3.evaluate(ThreadLeakControl.java:442)
	at com.carrotsearch.randomizedtesting.RandomizedRunner.runSingleTest(RandomizedRunner.java:746)
	at com.carrotsearch.randomizedtesting.RandomizedRunner$3.evaluate(RandomizedRunner.java:648)
	at com.carrotsearch.randomizedtesting.RandomizedRunner$4.evaluate(RandomizedRunner.java:682)
	at com.carrotsearch.randomizedtesting.RandomizedRunner$5.evaluate(RandomizedRunner.java:693)
	at com.carrotsearch.randomizedtesting.rules.StatementAdapter.evaluate(StatementAdapter.java:36)
	at com.carrotsearch.randomizedtesting.rules.SystemPropertiesRestoreRule$1.evaluate(SystemPropertiesRestoreRule.java:53)
	at org.apache.lucene.util.AbstractBeforeAfterRule$1.evaluate(AbstractBeforeAfterRule.java:46)
	at org.apache.lucene.util.TestRuleStoreClassName$1.evaluate(TestRuleStoreClassName.java:42)
	at com.carrotsearch.randomizedtesting.rules.SystemPropertiesInvariantRule$1.evaluate(SystemPropertiesInvariantRule.java:55)
	at com.carrotsearch.randomizedtesting.rules.NoShadowingOrOverridesOnMethodsRule$1.evaluate(NoShadowingOrOverridesOnMethodsRule.java:39)
	at com.carrotsearch.randomizedtesting.rules.NoShadowingOrOverridesOnMethodsRule$1.evaluate(NoShadowingOrOverridesOnMethodsRule.java:39)
	at com.carrotsearch.randomizedtesting.rules.StatementAdapter.evaluate(StatementAdapter.java:36)
	at org.apache.lucene.util.TestRuleAssertionsRequired$1.evaluate(TestRuleAssertionsRequired.java:43)
	at org.apache.lucene.util.TestRuleMarkFailure$1.evaluate(TestRuleMarkFailure.java:48)
	at org.apache.lucene.util.TestRuleIgnoreAfterMaxFailures$1.evaluate(TestRuleIgnoreAfterMaxFailures.java:70)
	at org.apache.lucene.util.TestRuleIgnoreTestSuites$1.evaluate(TestRuleIgnoreTestSuites.java:55)
	at com.carrotsearch.randomizedtesting.rules.StatementAdapter.evaluate(StatementAdapter.java:36)
	at com.carrotsearch.randomizedtesting.ThreadLeakControl$StatementRunner.run(ThreadLeakControl.java:358)
	at java.lang.Thread.run(Thread.java:724)


REGRESSION:  org.apache.solr.analytics.expression.ExpressionTest.absoluteValueTest

Error Message:
Caught exception in getStatResult, xPath = /response/lst[@name='stats']/lst[@name='avr']/double[@name='sum']  raw data: <?xml version="1.0" encoding="UTF-8"?> <response>  <lst name="responseHeader">   <int name="status">0</int>   <int name="QTime">22</int> </lst> <result name="response" numFound="100" start="0"> </result> <lst name="stats">   <lst name="stats_fields"/> </lst> <lst name="stats">   <lst name="dr">     <long name="count">100</long>     <null name="mc"/>     <null name="mean"/>     <null name="su"/>     <null name="sum"/>     <null name="unique"/>   </lst>   <lst name="cr">     <str name="ccmax">this is the secondstr9</str>     <str name="ccmin">this is the firststr0</str>     <str name="csmax">this is the second</str>     <str name="csmin">this is the first</str>     <str name="max">str9</str>     <str name="min">str0</str>   </lst>   <lst name="pr">     <long name="count">100</long>     <null name="mc"/>     <null name="mean"/>     <null name="su"/>     <null name="sum"/>     <null name="unique"/>   </lst>   <lst name="nr">     <double name="c">-100.0</double>     <long name="count">100</long>     <null name="s"/>     <null name="sum"/>   </lst>   <lst name="dmr">     <str name="cma">+2MONTHS</str>     <str name="cme">+2YEARS</str>     <date name="dmma">1812-02-29T23:59:59Z</date>     <date name="dmme">1807-12-31T23:59:59Z</date>     <date name="max">1811-12-31T23:59:59Z</date>     <date name="median">1805-12-31T23:59:59Z</date>   </lst>   <lst name="csr">     <str name="cs1">this is the first</str>     <str name="cs2">this is the second</str>     <str name="cs3">this is the third</str>   </lst>   <lst name="cdr">     <date name="cd1">1800-12-31T23:59:59Z</date>     <date name="cd2">1804-06-30T23:59:59Z</date>     <str name="cs1">1800-12-31T23:59:59Z</str>     <str name="cs2">1804-06-30T23:59:59Z</str>   </lst>   <lst name="rr">     <str name="max">str9</str>     <str name="min">str0</str>     <str name="rmax">9rts</str>     <str name="rmin">0rts</str>   </lst>   <lst name="cnr">     <double name="c10">10.0</double>     <double name="c8">8.0</double>   </lst>   <lst name="mr">     <long name="count">100</long>     <null name="mcm"/>     <null name="mean"/>     <null name="median"/>     <null name="su"/>     <null name="sum"/>     <null name="unique"/>   </lst>   <lst name="ar">     <long name="count">100</long>     <null name="mcm"/>     <null name="mean"/>     <null name="median"/>     <null name="su"/>     <null name="sum"/>     <null name="unique"/>   </lst>   <lst name="avr">     <double name="c">100.0</double>     <long name="count">100</long>     <null name="s"/>     <null name="sum"/>   </lst> </lst> </response> 

Stack Trace:
java.lang.AssertionError: Caught exception in getStatResult, xPath = /response/lst[@name='stats']/lst[@name='avr']/double[@name='sum'] 
raw data: <?xml version="1.0" encoding="UTF-8"?>
<response>

<lst name="responseHeader">
  <int name="status">0</int>
  <int name="QTime">22</int>
</lst>
<result name="response" numFound="100" start="0">
</result>
<lst name="stats">
  <lst name="stats_fields"/>
</lst>
<lst name="stats">
  <lst name="dr">
    <long name="count">100</long>
    <null name="mc"/>
    <null name="mean"/>
    <null name="su"/>
    <null name="sum"/>
    <null name="unique"/>
  </lst>
  <lst name="cr">
    <str name="ccmax">this is the secondstr9</str>
    <str name="ccmin">this is the firststr0</str>
    <str name="csmax">this is the second</str>
    <str name="csmin">this is the first</str>
    <str name="max">str9</str>
    <str name="min">str0</str>
  </lst>
  <lst name="pr">
    <long name="count">100</long>
    <null name="mc"/>
    <null name="mean"/>
    <null name="su"/>
    <null name="sum"/>
    <null name="unique"/>
  </lst>
  <lst name="nr">
    <double name="c">-100.0</double>
    <long name="count">100</long>
    <null name="s"/>
    <null name="sum"/>
  </lst>
  <lst name="dmr">
    <str name="cma">+2MONTHS</str>
    <str name="cme">+2YEARS</str>
    <date name="dmma">1812-02-29T23:59:59Z</date>
    <date name="dmme">1807-12-31T23:59:59Z</date>
    <date name="max">1811-12-31T23:59:59Z</date>
    <date name="median">1805-12-31T23:59:59Z</date>
  </lst>
  <lst name="csr">
    <str name="cs1">this is the first</str>
    <str name="cs2">this is the second</str>
    <str name="cs3">this is the third</str>
  </lst>
  <lst name="cdr">
    <date name="cd1">1800-12-31T23:59:59Z</date>
    <date name="cd2">1804-06-30T23:59:59Z</date>
    <str name="cs1">1800-12-31T23:59:59Z</str>
    <str name="cs2">1804-06-30T23:59:59Z</str>
  </lst>
  <lst name="rr">
    <str name="max">str9</str>
    <str name="min">str0</str>
    <str name="rmax">9rts</str>
    <str name="rmin">0rts</str>
  </lst>
  <lst name="cnr">
    <double name="c10">10.0</double>
    <double name="c8">8.0</double>
  </lst>
  <lst name="mr">
    <long name="count">100</long>
    <null name="mcm"/>
    <null name="mean"/>
    <null name="median"/>
    <null name="su"/>
    <null name="sum"/>
    <null name="unique"/>
  </lst>
  <lst name="ar">
    <long name="count">100</long>
    <null name="mcm"/>
    <null name="mean"/>
    <null name="median"/>
    <null name="su"/>
    <null name="sum"/>
    <null name="unique"/>
  </lst>
  <lst name="avr">
    <double name="c">100.0</double>
    <long name="count">100</long>
    <null name="s"/>
    <null name="sum"/>
  </lst>
</lst>
</response>

	at __randomizedtesting.SeedInfo.seed([2F7E4A527AF5F39D:ED26A47B768ABFB]:0)
	at org.junit.Assert.fail(Assert.java:93)
	at org.apache.solr.analytics.AbstractAnalyticsStatsTest.getStatResult(AbstractAnalyticsStatsTest.java:113)
	at org.apache.solr.analytics.expression.ExpressionTest.absoluteValueTest(ExpressionTest.java:143)
	at sun.reflect.NativeMethodAccessorImpl.invoke0(Native Method)
	at sun.reflect.NativeMethodAccessorImpl.invoke(NativeMethodAccessorImpl.java:57)
	at sun.reflect.DelegatingMethodAccessorImpl.invoke(DelegatingMethodAccessorImpl.java:43)
	at java.lang.reflect.Method.invoke(Method.java:606)
	at com.carrotsearch.randomizedtesting.RandomizedRunner.invoke(RandomizedRunner.java:1559)
	at com.carrotsearch.randomizedtesting.RandomizedRunner.access$600(RandomizedRunner.java:79)
	at com.carrotsearch.randomizedtesting.RandomizedRunner$6.evaluate(RandomizedRunner.java:737)
	at com.carrotsearch.randomizedtesting.RandomizedRunner$7.evaluate(RandomizedRunner.java:773)
	at com.carrotsearch.randomizedtesting.RandomizedRunner$8.evaluate(RandomizedRunner.java:787)
	at com.carrotsearch.randomizedtesting.rules.SystemPropertiesRestoreRule$1.evaluate(SystemPropertiesRestoreRule.java:53)
	at org.apache.lucene.util.TestRuleSetupTeardownChained$1.evaluate(TestRuleSetupTeardownChained.java:50)
	at org.apache.lucene.util.TestRuleFieldCacheSanity$1.evaluate(TestRuleFieldCacheSanity.java:51)
	at org.apache.lucene.util.AbstractBeforeAfterRule$1.evaluate(AbstractBeforeAfterRule.java:46)
	at com.carrotsearch.randomizedtesting.rules.SystemPropertiesInvariantRule$1.evaluate(SystemPropertiesInvariantRule.java:55)
	at org.apache.lucene.util.TestRuleThreadAndTestName$1.evaluate(TestRuleThreadAndTestName.java:49)
	at org.apache.lucene.util.TestRuleIgnoreAfterMaxFailures$1.evaluate(TestRuleIgnoreAfterMaxFailures.java:70)
	at org.apache.lucene.util.TestRuleMarkFailure$1.evaluate(TestRuleMarkFailure.java:48)
	at com.carrotsearch.randomizedtesting.rules.StatementAdapter.evaluate(StatementAdapter.java:36)
	at com.carrotsearch.randomizedtesting.ThreadLeakControl$StatementRunner.run(ThreadLeakControl.java:358)
	at com.carrotsearch.randomizedtesting.ThreadLeakControl.forkTimeoutingTask(ThreadLeakControl.java:782)
	at com.carrotsearch.randomizedtesting.ThreadLeakControl$3.evaluate(ThreadLeakControl.java:442)
	at com.carrotsearch.randomizedtesting.RandomizedRunner.runSingleTest(RandomizedRunner.java:746)
	at com.carrotsearch.randomizedtesting.RandomizedRunner$3.evaluate(RandomizedRunner.java:648)
	at com.carrotsearch.randomizedtesting.RandomizedRunner$4.evaluate(RandomizedRunner.java:682)
	at com.carrotsearch.randomizedtesting.RandomizedRunner$5.evaluate(RandomizedRunner.java:693)
	at com.carrotsearch.randomizedtesting.rules.StatementAdapter.evaluate(StatementAdapter.java:36)
	at com.carrotsearch.randomizedtesting.rules.SystemPropertiesRestoreRule$1.evaluate(SystemPropertiesRestoreRule.java:53)
	at org.apache.lucene.util.AbstractBeforeAfterRule$1.evaluate(AbstractBeforeAfterRule.java:46)
	at org.apache.lucene.util.TestRuleStoreClassName$1.evaluate(TestRuleStoreClassName.java:42)
	at com.carrotsearch.randomizedtesting.rules.SystemPropertiesInvariantRule$1.evaluate(SystemPropertiesInvariantRule.java:55)
	at com.carrotsearch.randomizedtesting.rules.NoShadowingOrOverridesOnMethodsRule$1.evaluate(NoShadowingOrOverridesOnMethodsRule.java:39)
	at com.carrotsearch.randomizedtesting.rules.NoShadowingOrOverridesOnMethodsRule$1.evaluate(NoShadowingOrOverridesOnMethodsRule.java:39)
	at com.carrotsearch.randomizedtesting.rules.StatementAdapter.evaluate(StatementAdapter.java:36)
	at org.apache.lucene.util.TestRuleAssertionsRequired$1.evaluate(TestRuleAssertionsRequired.java:43)
	at org.apache.lucene.util.TestRuleMarkFailure$1.evaluate(TestRuleMarkFailure.java:48)
	at org.apache.lucene.util.TestRuleIgnoreAfterMaxFailures$1.evaluate(TestRuleIgnoreAfterMaxFailures.java:70)
	at org.apache.lucene.util.TestRuleIgnoreTestSuites$1.evaluate(TestRuleIgnoreTestSuites.java:55)
	at com.carrotsearch.randomizedtesting.rules.StatementAdapter.evaluate(StatementAdapter.java:36)
	at com.carrotsearch.randomizedtesting.ThreadLeakControl$StatementRunner.run(ThreadLeakControl.java:358)
	at java.lang.Thread.run(Thread.java:724)


REGRESSION:  org.apache.solr.analytics.expression.ExpressionTest.multiplyTest

Error Message:
Caught exception in getStatResult, xPath = /response/lst[@name='stats']/lst[@name='mr']/double[@name='sum']  raw data: <?xml version="1.0" encoding="UTF-8"?> <response>  <lst name="responseHeader">   <int name="status">0</int>   <int name="QTime">22</int> </lst> <result name="response" numFound="100" start="0"> </result> <lst name="stats">   <lst name="stats_fields"/> </lst> <lst name="stats">   <lst name="dr">     <long name="count">100</long>     <null name="mc"/>     <null name="mean"/>     <null name="su"/>     <null name="sum"/>     <null name="unique"/>   </lst>   <lst name="cr">     <str name="ccmax">this is the secondstr9</str>     <str name="ccmin">this is the firststr0</str>     <str name="csmax">this is the second</str>     <str name="csmin">this is the first</str>     <str name="max">str9</str>     <str name="min">str0</str>   </lst>   <lst name="pr">     <long name="count">100</long>     <null name="mc"/>     <null name="mean"/>     <null name="su"/>     <null name="sum"/>     <null name="unique"/>   </lst>   <lst name="nr">     <double name="c">-100.0</double>     <long name="count">100</long>     <null name="s"/>     <null name="sum"/>   </lst>   <lst name="dmr">     <str name="cma">+2MONTHS</str>     <str name="cme">+2YEARS</str>     <date name="dmma">1812-02-29T23:59:59Z</date>     <date name="dmme">1807-12-31T23:59:59Z</date>     <date name="max">1811-12-31T23:59:59Z</date>     <date name="median">1805-12-31T23:59:59Z</date>   </lst>   <lst name="csr">     <str name="cs1">this is the first</str>     <str name="cs2">this is the second</str>     <str name="cs3">this is the third</str>   </lst>   <lst name="cdr">     <date name="cd1">1800-12-31T23:59:59Z</date>     <date name="cd2">1804-06-30T23:59:59Z</date>     <str name="cs1">1800-12-31T23:59:59Z</str>     <str name="cs2">1804-06-30T23:59:59Z</str>   </lst>   <lst name="rr">     <str name="max">str9</str>     <str name="min">str0</str>     <str name="rmax">9rts</str>     <str name="rmin">0rts</str>   </lst>   <lst name="cnr">     <double name="c10">10.0</double>     <double name="c8">8.0</double>   </lst>   <lst name="mr">     <long name="count">100</long>     <null name="mcm"/>     <null name="mean"/>     <null name="median"/>     <null name="su"/>     <null name="sum"/>     <null name="unique"/>   </lst>   <lst name="ar">     <long name="count">100</long>     <null name="mcm"/>     <null name="mean"/>     <null name="median"/>     <null name="su"/>     <null name="sum"/>     <null name="unique"/>   </lst>   <lst name="avr">     <double name="c">100.0</double>     <long name="count">100</long>     <null name="s"/>     <null name="sum"/>   </lst> </lst> </response> 

Stack Trace:
java.lang.AssertionError: Caught exception in getStatResult, xPath = /response/lst[@name='stats']/lst[@name='mr']/double[@name='sum'] 
raw data: <?xml version="1.0" encoding="UTF-8"?>
<response>

<lst name="responseHeader">
  <int name="status">0</int>
  <int name="QTime">22</int>
</lst>
<result name="response" numFound="100" start="0">
</result>
<lst name="stats">
  <lst name="stats_fields"/>
</lst>
<lst name="stats">
  <lst name="dr">
    <long name="count">100</long>
    <null name="mc"/>
    <null name="mean"/>
    <null name="su"/>
    <null name="sum"/>
    <null name="unique"/>
  </lst>
  <lst name="cr">
    <str name="ccmax">this is the secondstr9</str>
    <str name="ccmin">this is the firststr0</str>
    <str name="csmax">this is the second</str>
    <str name="csmin">this is the first</str>
    <str name="max">str9</str>
    <str name="min">str0</str>
  </lst>
  <lst name="pr">
    <long name="count">100</long>
    <null name="mc"/>
    <null name="mean"/>
    <null name="su"/>
    <null name="sum"/>
    <null name="unique"/>
  </lst>
  <lst name="nr">
    <double name="c">-100.0</double>
    <long name="count">100</long>
    <null name="s"/>
    <null name="sum"/>
  </lst>
  <lst name="dmr">
    <str name="cma">+2MONTHS</str>
    <str name="cme">+2YEARS</str>
    <date name="dmma">1812-02-29T23:59:59Z</date>
    <date name="dmme">1807-12-31T23:59:59Z</date>
    <date name="max">1811-12-31T23:59:59Z</date>
    <date name="median">1805-12-31T23:59:59Z</date>
  </lst>
  <lst name="csr">
    <str name="cs1">this is the first</str>
    <str name="cs2">this is the second</str>
    <str name="cs3">this is the third</str>
  </lst>
  <lst name="cdr">
    <date name="cd1">1800-12-31T23:59:59Z</date>
    <date name="cd2">1804-06-30T23:59:59Z</date>
    <str name="cs1">1800-12-31T23:59:59Z</str>
    <str name="cs2">1804-06-30T23:59:59Z</str>
  </lst>
  <lst name="rr">
    <str name="max">str9</str>
    <str name="min">str0</str>
    <str name="rmax">9rts</str>
    <str name="rmin">0rts</str>
  </lst>
  <lst name="cnr">
    <double name="c10">10.0</double>
    <double name="c8">8.0</double>
  </lst>
  <lst name="mr">
    <long name="count">100</long>
    <null name="mcm"/>
    <null name="mean"/>
    <null name="median"/>
    <null name="su"/>
    <null name="sum"/>
    <null name="unique"/>
  </lst>
  <lst name="ar">
    <long name="count">100</long>
    <null name="mcm"/>
    <null name="mean"/>
    <null name="median"/>
    <null name="su"/>
    <null name="sum"/>
    <null name="unique"/>
  </lst>
  <lst name="avr">
    <double name="c">100.0</double>
    <long name="count">100</long>
    <null name="s"/>
    <null name="sum"/>
  </lst>
</lst>
</response>

	at __randomizedtesting.SeedInfo.seed([2F7E4A527AF5F39D:44FF542C4FFBC5F3]:0)
	at org.junit.Assert.fail(Assert.java:93)
	at org.apache.solr.analytics.AbstractAnalyticsStatsTest.getStatResult(AbstractAnalyticsStatsTest.java:113)
	at org.apache.solr.analytics.expression.ExpressionTest.multiplyTest(ExpressionTest.java:92)
	at sun.reflect.NativeMethodAccessorImpl.invoke0(Native Method)
	at sun.reflect.NativeMethodAccessorImpl.invoke(NativeMethodAccessorImpl.java:57)
	at sun.reflect.DelegatingMethodAccessorImpl.invoke(DelegatingMethodAccessorImpl.java:43)
	at java.lang.reflect.Method.invoke(Method.java:606)
	at com.carrotsearch.randomizedtesting.RandomizedRunner.invoke(RandomizedRunner.java:1559)
	at com.carrotsearch.randomizedtesting.RandomizedRunner.access$600(RandomizedRunner.java:79)
	at com.carrotsearch.randomizedtesting.RandomizedRunner$6.evaluate(RandomizedRunner.java:737)
	at com.carrotsearch.randomizedtesting.RandomizedRunner$7.evaluate(RandomizedRunner.java:773)
	at com.carrotsearch.randomizedtesting.RandomizedRunner$8.evaluate(RandomizedRunner.java:787)
	at com.carrotsearch.randomizedtesting.rules.SystemPropertiesRestoreRule$1.evaluate(SystemPropertiesRestoreRule.java:53)
	at org.apache.lucene.util.TestRuleSetupTeardownChained$1.evaluate(TestRuleSetupTeardownChained.java:50)
	at org.apache.lucene.util.TestRuleFieldCacheSanity$1.evaluate(TestRuleFieldCacheSanity.java:51)
	at org.apache.lucene.util.AbstractBeforeAfterRule$1.evaluate(AbstractBeforeAfterRule.java:46)
	at com.carrotsearch.randomizedtesting.rules.SystemPropertiesInvariantRule$1.evaluate(SystemPropertiesInvariantRule.java:55)
	at org.apache.lucene.util.TestRuleThreadAndTestName$1.evaluate(TestRuleThreadAndTestName.java:49)
	at org.apache.lucene.util.TestRuleIgnoreAfterMaxFailures$1.evaluate(TestRuleIgnoreAfterMaxFailures.java:70)
	at org.apache.lucene.util.TestRuleMarkFailure$1.evaluate(TestRuleMarkFailure.java:48)
	at com.carrotsearch.randomizedtesting.rules.StatementAdapter.evaluate(StatementAdapter.java:36)
	at com.carrotsearch.randomizedtesting.ThreadLeakControl$StatementRunner.run(ThreadLeakControl.java:358)
	at com.carrotsearch.randomizedtesting.ThreadLeakControl.forkTimeoutingTask(ThreadLeakControl.java:782)
	at com.carrotsearch.randomizedtesting.ThreadLeakControl$3.evaluate(ThreadLeakControl.java:442)
	at com.carrotsearch.randomizedtesting.RandomizedRunner.runSingleTest(RandomizedRunner.java:746)
	at com.carrotsearch.randomizedtesting.RandomizedRunner$3.evaluate(RandomizedRunner.java:648)
	at com.carrotsearch.randomizedtesting.RandomizedRunner$4.evaluate(RandomizedRunner.java:682)
	at com.carrotsearch.randomizedtesting.RandomizedRunner$5.evaluate(RandomizedRunner.java:693)
	at com.carrotsearch.randomizedtesting.rules.StatementAdapter.evaluate(StatementAdapter.java:36)
	at com.carrotsearch.randomizedtesting.rules.SystemPropertiesRestoreRule$1.evaluate(SystemPropertiesRestoreRule.java:53)
	at org.apache.lucene.util.AbstractBeforeAfterRule$1.evaluate(AbstractBeforeAfterRule.java:46)
	at org.apache.lucene.util.TestRuleStoreClassName$1.evaluate(TestRuleStoreClassName.java:42)
	at com.carrotsearch.randomizedtesting.rules.SystemPropertiesInvariantRule$1.evaluate(SystemPropertiesInvariantRule.java:55)
	at com.carrotsearch.randomizedtesting.rules.NoShadowingOrOverridesOnMethodsRule$1.evaluate(NoShadowingOrOverridesOnMethodsRule.java:39)
	at com.carrotsearch.randomizedtesting.rules.NoShadowingOrOverridesOnMethodsRule$1.evaluate(NoShadowingOrOverridesOnMethodsRule.java:39)
	at com.carrotsearch.randomizedtesting.rules.StatementAdapter.evaluate(StatementAdapter.java:36)
	at org.apache.lucene.util.TestRuleAssertionsRequired$1.evaluate(TestRuleAssertionsRequired.java:43)
	at org.apache.lucene.util.TestRuleMarkFailure$1.evaluate(TestRuleMarkFailure.java:48)
	at org.apache.lucene.util.TestRuleIgnoreAfterMaxFailures$1.evaluate(TestRuleIgnoreAfterMaxFailures.java:70)
	at org.apache.lucene.util.TestRuleIgnoreTestSuites$1.evaluate(TestRuleIgnoreTestSuites.java:55)
	at com.carrotsearch.randomizedtesting.rules.StatementAdapter.evaluate(StatementAdapter.java:36)
	at com.carrotsearch.randomizedtesting.ThreadLeakControl$StatementRunner.run(ThreadLeakControl.java:358)
	at java.lang.Thread.run(Thread.java:724)


REGRESSION:  org.apache.solr.analytics.expression.ExpressionTest.divideTest

Error Message:
Caught exception in getStatResult, xPath = /response/lst[@name='stats']/lst[@name='dr']/double[@name='sum']  raw data: <?xml version="1.0" encoding="UTF-8"?> <response>  <lst name="responseHeader">   <int name="status">0</int>   <int name="QTime">22</int> </lst> <result name="response" numFound="100" start="0"> </result> <lst name="stats">   <lst name="stats_fields"/> </lst> <lst name="stats">   <lst name="dr">     <long name="count">100</long>     <null name="mc"/>     <null name="mean"/>     <null name="su"/>     <null name="sum"/>     <null name="unique"/>   </lst>   <lst name="cr">     <str name="ccmax">this is the secondstr9</str>     <str name="ccmin">this is the firststr0</str>     <str name="csmax">this is the second</str>     <str name="csmin">this is the first</str>     <str name="max">str9</str>     <str name="min">str0</str>   </lst>   <lst name="pr">     <long name="count">100</long>     <null name="mc"/>     <null name="mean"/>     <null name="su"/>     <null name="sum"/>     <null name="unique"/>   </lst>   <lst name="nr">     <double name="c">-100.0</double>     <long name="count">100</long>     <null name="s"/>     <null name="sum"/>   </lst>   <lst name="dmr">     <str name="cma">+2MONTHS</str>     <str name="cme">+2YEARS</str>     <date name="dmma">1812-02-29T23:59:59Z</date>     <date name="dmme">1807-12-31T23:59:59Z</date>     <date name="max">1811-12-31T23:59:59Z</date>     <date name="median">1805-12-31T23:59:59Z</date>   </lst>   <lst name="csr">     <str name="cs1">this is the first</str>     <str name="cs2">this is the second</str>     <str name="cs3">this is the third</str>   </lst>   <lst name="cdr">     <date name="cd1">1800-12-31T23:59:59Z</date>     <date name="cd2">1804-06-30T23:59:59Z</date>     <str name="cs1">1800-12-31T23:59:59Z</str>     <str name="cs2">1804-06-30T23:59:59Z</str>   </lst>   <lst name="rr">     <str name="max">str9</str>     <str name="min">str0</str>     <str name="rmax">9rts</str>     <str name="rmin">0rts</str>   </lst>   <lst name="cnr">     <double name="c10">10.0</double>     <double name="c8">8.0</double>   </lst>   <lst name="mr">     <long name="count">100</long>     <null name="mcm"/>     <null name="mean"/>     <null name="median"/>     <null name="su"/>     <null name="sum"/>     <null name="unique"/>   </lst>   <lst name="ar">     <long name="count">100</long>     <null name="mcm"/>     <null name="mean"/>     <null name="median"/>     <null name="su"/>     <null name="sum"/>     <null name="unique"/>   </lst>   <lst name="avr">     <double name="c">100.0</double>     <long name="count">100</long>     <null name="s"/>     <null name="sum"/>   </lst> </lst> </response> 

Stack Trace:
java.lang.AssertionError: Caught exception in getStatResult, xPath = /response/lst[@name='stats']/lst[@name='dr']/double[@name='sum'] 
raw data: <?xml version="1.0" encoding="UTF-8"?>
<response>

<lst name="responseHeader">
  <int name="status">0</int>
  <int name="QTime">22</int>
</lst>
<result name="response" numFound="100" start="0">
</result>
<lst name="stats">
  <lst name="stats_fields"/>
</lst>
<lst name="stats">
  <lst name="dr">
    <long name="count">100</long>
    <null name="mc"/>
    <null name="mean"/>
    <null name="su"/>
    <null name="sum"/>
    <null name="unique"/>
  </lst>
  <lst name="cr">
    <str name="ccmax">this is the secondstr9</str>
    <str name="ccmin">this is the firststr0</str>
    <str name="csmax">this is the second</str>
    <str name="csmin">this is the first</str>
    <str name="max">str9</str>
    <str name="min">str0</str>
  </lst>
  <lst name="pr">
    <long name="count">100</long>
    <null name="mc"/>
    <null name="mean"/>
    <null name="su"/>
    <null name="sum"/>
    <null name="unique"/>
  </lst>
  <lst name="nr">
    <double name="c">-100.0</double>
    <long name="count">100</long>
    <null name="s"/>
    <null name="sum"/>
  </lst>
  <lst name="dmr">
    <str name="cma">+2MONTHS</str>
    <str name="cme">+2YEARS</str>
    <date name="dmma">1812-02-29T23:59:59Z</date>
    <date name="dmme">1807-12-31T23:59:59Z</date>
    <date name="max">1811-12-31T23:59:59Z</date>
    <date name="median">1805-12-31T23:59:59Z</date>
  </lst>
  <lst name="csr">
    <str name="cs1">this is the first</str>
    <str name="cs2">this is the second</str>
    <str name="cs3">this is the third</str>
  </lst>
  <lst name="cdr">
    <date name="cd1">1800-12-31T23:59:59Z</date>
    <date name="cd2">1804-06-30T23:59:59Z</date>
    <str name="cs1">1800-12-31T23:59:59Z</str>
    <str name="cs2">1804-06-30T23:59:59Z</str>
  </lst>
  <lst name="rr">
    <str name="max">str9</str>
    <str name="min">str0</str>
    <str name="rmax">9rts</str>
    <str name="rmin">0rts</str>
  </lst>
  <lst name="cnr">
    <double name="c10">10.0</double>
    <double name="c8">8.0</double>
  </lst>
  <lst name="mr">
    <long name="count">100</long>
    <null name="mcm"/>
    <null name="mean"/>
    <null name="median"/>
    <null name="su"/>
    <null name="sum"/>
    <null name="unique"/>
  </lst>
  <lst name="ar">
    <long name="count">100</long>
    <null name="mcm"/>
    <null name="mean"/>
    <null name="median"/>
    <null name="su"/>
    <null name="sum"/>
    <null name="unique"/>
  </lst>
  <lst name="avr">
    <double name="c">100.0</double>
    <long name="count">100</long>
    <null name="s"/>
    <null name="sum"/>
  </lst>
</lst>
</response>

	at __randomizedtesting.SeedInfo.seed([2F7E4A527AF5F39D:7773A1A45E37914B]:0)
	at org.junit.Assert.fail(Assert.java:93)
	at org.apache.solr.analytics.AbstractAnalyticsStatsTest.getStatResult(AbstractAnalyticsStatsTest.java:113)
	at org.apache.solr.analytics.expression.ExpressionTest.divideTest(ExpressionTest.java:106)
	at sun.reflect.NativeMethodAccessorImpl.invoke0(Native Method)
	at sun.reflect.NativeMethodAccessorImpl.invoke(NativeMethodAccessorImpl.java:57)
	at sun.reflect.DelegatingMethodAccessorImpl.invoke(DelegatingMethodAccessorImpl.java:43)
	at java.lang.reflect.Method.invoke(Method.java:606)
	at com.carrotsearch.randomizedtesting.RandomizedRunner.invoke(RandomizedRunner.java:1559)
	at com.carrotsearch.randomizedtesting.RandomizedRunner.access$600(RandomizedRunner.java:79)
	at com.carrotsearch.randomizedtesting.RandomizedRunner$6.evaluate(RandomizedRunner.java:737)
	at com.carrotsearch.randomizedtesting.RandomizedRunner$7.evaluate(RandomizedRunner.java:773)
	at com.carrotsearch.randomizedtesting.RandomizedRunner$8.evaluate(RandomizedRunner.java:787)
	at com.carrotsearch.randomizedtesting.rules.SystemPropertiesRestoreRule$1.evaluate(SystemPropertiesRestoreRule.java:53)
	at org.apache.lucene.util.TestRuleSetupTeardownChained$1.evaluate(TestRuleSetupTeardownChained.java:50)
	at org.apache.lucene.util.TestRuleFieldCacheSanity$1.evaluate(TestRuleFieldCacheSanity.java:51)
	at org.apache.lucene.util.AbstractBeforeAfterRule$1.evaluate(AbstractBeforeAfterRule.java:46)
	at com.carrotsearch.randomizedtesting.rules.SystemPropertiesInvariantRule$1.evaluate(SystemPropertiesInvariantRule.java:55)
	at org.apache.lucene.util.TestRuleThreadAndTestName$1.evaluate(TestRuleThreadAndTestName.java:49)
	at org.apache.lucene.util.TestRuleIgnoreAfterMaxFailures$1.evaluate(TestRuleIgnoreAfterMaxFailures.java:70)
	at org.apache.lucene.util.TestRuleMarkFailure$1.evaluate(TestRuleMarkFailure.java:48)
	at com.carrotsearch.randomizedtesting.rules.StatementAdapter.evaluate(StatementAdapter.java:36)
	at com.carrotsearch.randomizedtesting.ThreadLeakControl$StatementRunner.run(ThreadLeakControl.java:358)
	at com.carrotsearch.randomizedtesting.ThreadLeakControl.forkTimeoutingTask(ThreadLeakControl.java:782)
	at com.carrotsearch.randomizedtesting.ThreadLeakControl$3.evaluate(ThreadLeakControl.java:442)
	at com.carrotsearch.randomizedtesting.RandomizedRunner.runSingleTest(RandomizedRunner.java:746)
	at com.carrotsearch.randomizedtesting.RandomizedRunner$3.evaluate(RandomizedRunner.java:648)
	at com.carrotsearch.randomizedtesting.RandomizedRunner$4.evaluate(RandomizedRunner.java:682)
	at com.carrotsearch.randomizedtesting.RandomizedRunner$5.evaluate(RandomizedRunner.java:693)
	at com.carrotsearch.randomizedtesting.rules.StatementAdapter.evaluate(StatementAdapter.java:36)
	at com.carrotsearch.randomizedtesting.rules.SystemPropertiesRestoreRule$1.evaluate(SystemPropertiesRestoreRule.java:53)
	at org.apache.lucene.util.AbstractBeforeAfterRule$1.evaluate(AbstractBeforeAfterRule.java:46)
	at org.apache.lucene.util.TestRuleStoreClassName$1.evaluate(TestRuleStoreClassName.java:42)
	at com.carrotsearch.randomizedtesting.rules.SystemPropertiesInvariantRule$1.evaluate(SystemPropertiesInvariantRule.java:55)
	at com.carrotsearch.randomizedtesting.rules.NoShadowingOrOverridesOnMethodsRule$1.evaluate(NoShadowingOrOverridesOnMethodsRule.java:39)
	at com.carrotsearch.randomizedtesting.rules.NoShadowingOrOverridesOnMethodsRule$1.evaluate(NoShadowingOrOverridesOnMethodsRule.java:39)
	at com.carrotsearch.randomizedtesting.rules.StatementAdapter.evaluate(StatementAdapter.java:36)
	at org.apache.lucene.util.TestRuleAssertionsRequired$1.evaluate(TestRuleAssertionsRequired.java:43)
	at org.apache.lucene.util.TestRuleMarkFailure$1.evaluate(TestRuleMarkFailure.java:48)
	at org.apache.lucene.util.TestRuleIgnoreAfterMaxFailures$1.evaluate(TestRuleIgnoreAfterMaxFailures.java:70)
	at org.apache.lucene.util.TestRuleIgnoreTestSuites$1.evaluate(TestRuleIgnoreTestSuites.java:55)
	at com.carrotsearch.randomizedtesting.rules.StatementAdapter.evaluate(StatementAdapter.java:36)
	at com.carrotsearch.randomizedtesting.ThreadLeakControl$StatementRunner.run(ThreadLeakControl.java:358)
	at java.lang.Thread.run(Thread.java:724)


REGRESSION:  org.apache.solr.analytics.expression.ExpressionTest.powerTest

Error Message:
Caught exception in getStatResult, xPath = /response/lst[@name='stats']/lst[@name='pr']/double[@name='sum']  raw data: <?xml version="1.0" encoding="UTF-8"?> <response>  <lst name="responseHeader">   <int name="status">0</int>   <int name="QTime">22</int> </lst> <result name="response" numFound="100" start="0"> </result> <lst name="stats">   <lst name="stats_fields"/> </lst> <lst name="stats">   <lst name="dr">     <long name="count">100</long>     <null name="mc"/>     <null name="mean"/>     <null name="su"/>     <null name="sum"/>     <null name="unique"/>   </lst>   <lst name="cr">     <str name="ccmax">this is the secondstr9</str>     <str name="ccmin">this is the firststr0</str>     <str name="csmax">this is the second</str>     <str name="csmin">this is the first</str>     <str name="max">str9</str>     <str name="min">str0</str>   </lst>   <lst name="pr">     <long name="count">100</long>     <null name="mc"/>     <null name="mean"/>     <null name="su"/>     <null name="sum"/>     <null name="unique"/>   </lst>   <lst name="nr">     <double name="c">-100.0</double>     <long name="count">100</long>     <null name="s"/>     <null name="sum"/>   </lst>   <lst name="dmr">     <str name="cma">+2MONTHS</str>     <str name="cme">+2YEARS</str>     <date name="dmma">1812-02-29T23:59:59Z</date>     <date name="dmme">1807-12-31T23:59:59Z</date>     <date name="max">1811-12-31T23:59:59Z</date>     <date name="median">1805-12-31T23:59:59Z</date>   </lst>   <lst name="csr">     <str name="cs1">this is the first</str>     <str name="cs2">this is the second</str>     <str name="cs3">this is the third</str>   </lst>   <lst name="cdr">     <date name="cd1">1800-12-31T23:59:59Z</date>     <date name="cd2">1804-06-30T23:59:59Z</date>     <str name="cs1">1800-12-31T23:59:59Z</str>     <str name="cs2">1804-06-30T23:59:59Z</str>   </lst>   <lst name="rr">     <str name="max">str9</str>     <str name="min">str0</str>     <str name="rmax">9rts</str>     <str name="rmin">0rts</str>   </lst>   <lst name="cnr">     <double name="c10">10.0</double>     <double name="c8">8.0</double>   </lst>   <lst name="mr">     <long name="count">100</long>     <null name="mcm"/>     <null name="mean"/>     <null name="median"/>     <null name="su"/>     <null name="sum"/>     <null name="unique"/>   </lst>   <lst name="ar">     <long name="count">100</long>     <null name="mcm"/>     <null name="mean"/>     <null name="median"/>     <null name="su"/>     <null name="sum"/>     <null name="unique"/>   </lst>   <lst name="avr">     <double name="c">100.0</double>     <long name="count">100</long>     <null name="s"/>     <null name="sum"/>   </lst> </lst> </response> 

Stack Trace:
java.lang.AssertionError: Caught exception in getStatResult, xPath = /response/lst[@name='stats']/lst[@name='pr']/double[@name='sum'] 
raw data: <?xml version="1.0" encoding="UTF-8"?>
<response>

<lst name="responseHeader">
  <int name="status">0</int>
  <int name="QTime">22</int>
</lst>
<result name="response" numFound="100" start="0">
</result>
<lst name="stats">
  <lst name="stats_fields"/>
</lst>
<lst name="stats">
  <lst name="dr">
    <long name="count">100</long>
    <null name="mc"/>
    <null name="mean"/>
    <null name="su"/>
    <null name="sum"/>
    <null name="unique"/>
  </lst>
  <lst name="cr">
    <str name="ccmax">this is the secondstr9</str>
    <str name="ccmin">this is the firststr0</str>
    <str name="csmax">this is the second</str>
    <str name="csmin">this is the first</str>
    <str name="max">str9</str>
    <str name="min">str0</str>
  </lst>
  <lst name="pr">
    <long name="count">100</long>
    <null name="mc"/>
    <null name="mean"/>
    <null name="su"/>
    <null name="sum"/>
    <null name="unique"/>
  </lst>
  <lst name="nr">
    <double name="c">-100.0</double>
    <long name="count">100</long>
    <null name="s"/>
    <null name="sum"/>
  </lst>
  <lst name="dmr">
    <str name="cma">+2MONTHS</str>
    <str name="cme">+2YEARS</str>
    <date name="dmma">1812-02-29T23:59:59Z</date>
    <date name="dmme">1807-12-31T23:59:59Z</date>
    <date name="max">1811-12-31T23:59:59Z</date>
    <date name="median">1805-12-31T23:59:59Z</date>
  </lst>
  <lst name="csr">
    <str name="cs1">this is the first</str>
    <str name="cs2">this is the second</str>
    <str name="cs3">this is the third</str>
  </lst>
  <lst name="cdr">
    <date name="cd1">1800-12-31T23:59:59Z</date>
    <date name="cd2">1804-06-30T23:59:59Z</date>
    <str name="cs1">1800-12-31T23:59:59Z</str>
    <str name="cs2">1804-06-30T23:59:59Z</str>
  </lst>
  <lst name="rr">
    <str name="max">str9</str>
    <str name="min">str0</str>
    <str name="rmax">9rts</str>
    <str name="rmin">0rts</str>
  </lst>
  <lst name="cnr">
    <double name="c10">10.0</double>
    <double name="c8">8.0</double>
  </lst>
  <lst name="mr">
    <long name="count">100</long>
    <null name="mcm"/>
    <null name="mean"/>
    <null name="median"/>
    <null name="su"/>
    <null name="sum"/>
    <null name="unique"/>
  </lst>
  <lst name="ar">
    <long name="count">100</long>
    <null name="mcm"/>
    <null name="mean"/>
    <null name="median"/>
    <null name="su"/>
    <null name="sum"/>
    <null name="unique"/>
  </lst>
  <lst name="avr">
    <double name="c">100.0</double>
    <long name="count">100</long>
    <null name="s"/>
    <null name="sum"/>
  </lst>
</lst>
</response>

	at __randomizedtesting.SeedInfo.seed([2F7E4A527AF5F39D:41CCFD5192E2AD4C]:0)
	at org.junit.Assert.fail(Assert.java:93)
	at org.apache.solr.analytics.AbstractAnalyticsStatsTest.getStatResult(AbstractAnalyticsStatsTest.java:113)
	at org.apache.solr.analytics.expression.ExpressionTest.powerTest(ExpressionTest.java:119)
	at sun.reflect.NativeMethodAccessorImpl.invoke0(Native Method)
	at sun.reflect.NativeMethodAccessorImpl.invoke(NativeMethodAccessorImpl.java:57)
	at sun.reflect.DelegatingMethodAccessorImpl.invoke(DelegatingMethodAccessorImpl.java:43)
	at java.lang.reflect.Method.invoke(Method.java:606)
	at com.carrotsearch.randomizedtesting.RandomizedRunner.invoke(RandomizedRunner.java:1559)
	at com.carrotsearch.randomizedtesting.RandomizedRunner.access$600(RandomizedRunner.java:79)
	at com.carrotsearch.randomizedtesting.RandomizedRunner$6.evaluate(RandomizedRunner.java:737)
	at com.carrotsearch.randomizedtesting.RandomizedRunner$7.evaluate(RandomizedRunner.java:773)
	at com.carrotsearch.randomizedtesting.RandomizedRunner$8.evaluate(RandomizedRunner.java:787)
	at com.carrotsearch.randomizedtesting.rules.SystemPropertiesRestoreRule$1.evaluate(SystemPropertiesRestoreRule.java:53)
	at org.apache.lucene.util.TestRuleSetupTeardownChained$1.evaluate(TestRuleSetupTeardownChained.java:50)
	at org.apache.lucene.util.TestRuleFieldCacheSanity$1.evaluate(TestRuleFieldCacheSanity.java:51)
	at org.apache.lucene.util.AbstractBeforeAfterRule$1.evaluate(AbstractBeforeAfterRule.java:46)
	at com.carrotsearch.randomizedtesting.rules.SystemPropertiesInvariantRule$1.evaluate(SystemPropertiesInvariantRule.java:55)
	at org.apache.lucene.util.TestRuleThreadAndTestName$1.evaluate(TestRuleThreadAndTestName.java:49)
	at org.apache.lucene.util.TestRuleIgnoreAfterMaxFailures$1.evaluate(TestRuleIgnoreAfterMaxFailures.java:70)
	at org.apache.lucene.util.TestRuleMarkFailure$1.evaluate(TestRuleMarkFailure.java:48)
	at com.carrotsearch.randomizedtesting.rules.StatementAdapter.evaluate(StatementAdapter.java:36)
	at com.carrotsearch.randomizedtesting.ThreadLeakControl$StatementRunner.run(ThreadLeakControl.java:358)
	at com.carrotsearch.randomizedtesting.ThreadLeakControl.forkTimeoutingTask(ThreadLeakControl.java:782)
	at com.carrotsearch.randomizedtesting.ThreadLeakControl$3.evaluate(ThreadLeakControl.java:442)
	at com.carrotsearch.randomizedtesting.RandomizedRunner.runSingleTest(RandomizedRunner.java:746)
	at com.carrotsearch.randomizedtesting.RandomizedRunner$3.evaluate(RandomizedRunner.java:648)
	at com.carrotsearch.randomizedtesting.RandomizedRunner$4.evaluate(RandomizedRunner.java:682)
	at com.carrotsearch.randomizedtesting.RandomizedRunner$5.evaluate(RandomizedRunner.java:693)
	at com.carrotsearch.randomizedtesting.rules.StatementAdapter.evaluate(StatementAdapter.java:36)
	at com.carrotsearch.randomizedtesting.rules.SystemPropertiesRestoreRule$1.evaluate(SystemPropertiesRestoreRule.java:53)
	at org.apache.lucene.util.AbstractBeforeAfterRule$1.evaluate(AbstractBeforeAfterRule.java:46)
	at org.apache.lucene.util.TestRuleStoreClassName$1.evaluate(TestRuleStoreClassName.java:42)
	at com.carrotsearch.randomizedtesting.rules.SystemPropertiesInvariantRule$1.evaluate(SystemPropertiesInvariantRule.java:55)
	at com.carrotsearch.randomizedtesting.rules.NoShadowingOrOverridesOnMethodsRule$1.evaluate(NoShadowingOrOverridesOnMethodsRule.java:39)
	at com.carrotsearch.randomizedtesting.rules.NoShadowingOrOverridesOnMethodsRule$1.evaluate(NoShadowingOrOverridesOnMethodsRule.java:39)
	at com.carrotsearch.randomizedtesting.rules.StatementAdapter.evaluate(StatementAdapter.java:36)
	at org.apache.lucene.util.TestRuleAssertionsRequired$1.evaluate(TestRuleAssertionsRequired.java:43)
	at org.apache.lucene.util.TestRuleMarkFailure$1.evaluate(TestRuleMarkFailure.java:48)
	at org.apache.lucene.util.TestRuleIgnoreAfterMaxFailures$1.evaluate(TestRuleIgnoreAfterMaxFailures.java:70)
	at org.apache.lucene.util.TestRuleIgnoreTestSuites$1.evaluate(TestRuleIgnoreTestSuites.java:55)
	at com.carrotsearch.randomizedtesting.rules.StatementAdapter.evaluate(StatementAdapter.java:36)
	at com.carrotsearch.randomizedtesting.ThreadLeakControl$StatementRunner.run(ThreadLeakControl.java:358)
	at java.lang.Thread.run(Thread.java:724)


REGRESSION:  org.apache.solr.analytics.expression.ExpressionTest.addTest

Error Message:
Caught exception in getStatResult, xPath = /response/lst[@name='stats']/lst[@name='ar']/double[@name='sum']  raw data: <?xml version="1.0" encoding="UTF-8"?> <response>  <lst name="responseHeader">   <int name="status">0</int>   <int name="QTime">22</int> </lst> <result name="response" numFound="100" start="0"> </result> <lst name="stats">   <lst name="stats_fields"/> </lst> <lst name="stats">   <lst name="dr">     <long name="count">100</long>     <null name="mc"/>     <null name="mean"/>     <null name="su"/>     <null name="sum"/>     <null name="unique"/>   </lst>   <lst name="cr">     <str name="ccmax">this is the secondstr9</str>     <str name="ccmin">this is the firststr0</str>     <str name="csmax">this is the second</str>     <str name="csmin">this is the first</str>     <str name="max">str9</str>     <str name="min">str0</str>   </lst>   <lst name="pr">     <long name="count">100</long>     <null name="mc"/>     <null name="mean"/>     <null name="su"/>     <null name="sum"/>     <null name="unique"/>   </lst>   <lst name="nr">     <double name="c">-100.0</double>     <long name="count">100</long>     <null name="s"/>     <null name="sum"/>   </lst>   <lst name="dmr">     <str name="cma">+2MONTHS</str>     <str name="cme">+2YEARS</str>     <date name="dmma">1812-02-29T23:59:59Z</date>     <date name="dmme">1807-12-31T23:59:59Z</date>     <date name="max">1811-12-31T23:59:59Z</date>     <date name="median">1805-12-31T23:59:59Z</date>   </lst>   <lst name="csr">     <str name="cs1">this is the first</str>     <str name="cs2">this is the second</str>     <str name="cs3">this is the third</str>   </lst>   <lst name="cdr">     <date name="cd1">1800-12-31T23:59:59Z</date>     <date name="cd2">1804-06-30T23:59:59Z</date>     <str name="cs1">1800-12-31T23:59:59Z</str>     <str name="cs2">1804-06-30T23:59:59Z</str>   </lst>   <lst name="rr">     <str name="max">str9</str>     <str name="min">str0</str>     <str name="rmax">9rts</str>     <str name="rmin">0rts</str>   </lst>   <lst name="cnr">     <double name="c10">10.0</double>     <double name="c8">8.0</double>   </lst>   <lst name="mr">     <long name="count">100</long>     <null name="mcm"/>     <null name="mean"/>     <null name="median"/>     <null name="su"/>     <null name="sum"/>     <null name="unique"/>   </lst>   <lst name="ar">     <long name="count">100</long>     <null name="mcm"/>     <null name="mean"/>     <null name="median"/>     <null name="su"/>     <null name="sum"/>     <null name="unique"/>   </lst>   <lst name="avr">     <double name="c">100.0</double>     <long name="count">100</long>     <null name="s"/>     <null name="sum"/>   </lst> </lst> </response> 

Stack Trace:
java.lang.AssertionError: Caught exception in getStatResult, xPath = /response/lst[@name='stats']/lst[@name='ar']/double[@name='sum'] 
raw data: <?xml version="1.0" encoding="UTF-8"?>
<response>

<lst name="responseHeader">
  <int name="status">0</int>
  <int name="QTime">22</int>
</lst>
<result name="response" numFound="100" start="0">
</result>
<lst name="stats">
  <lst name="stats_fields"/>
</lst>
<lst name="stats">
  <lst name="dr">
    <long name="count">100</long>
    <null name="mc"/>
    <null name="mean"/>
    <null name="su"/>
    <null name="sum"/>
    <null name="unique"/>
  </lst>
  <lst name="cr">
    <str name="ccmax">this is the secondstr9</str>
    <str name="ccmin">this is the firststr0</str>
    <str name="csmax">this is the second</str>
    <str name="csmin">this is the first</str>
    <str name="max">str9</str>
    <str name="min">str0</str>
  </lst>
  <lst name="pr">
    <long name="count">100</long>
    <null name="mc"/>
    <null name="mean"/>
    <null name="su"/>
    <null name="sum"/>
    <null name="unique"/>
  </lst>
  <lst name="nr">
    <double name="c">-100.0</double>
    <long name="count">100</long>
    <null name="s"/>
    <null name="sum"/>
  </lst>
  <lst name="dmr">
    <str name="cma">+2MONTHS</str>
    <str name="cme">+2YEARS</str>
    <date name="dmma">1812-02-29T23:59:59Z</date>
    <date name="dmme">1807-12-31T23:59:59Z</date>
    <date name="max">1811-12-31T23:59:59Z</date>
    <date name="median">1805-12-31T23:59:59Z</date>
  </lst>
  <lst name="csr">
    <str name="cs1">this is the first</str>
    <str name="cs2">this is the second</str>
    <str name="cs3">this is the third</str>
  </lst>
  <lst name="cdr">
    <date name="cd1">1800-12-31T23:59:59Z</date>
    <date name="cd2">1804-06-30T23:59:59Z</date>
    <str name="cs1">1800-12-31T23:59:59Z</str>
    <str name="cs2">1804-06-30T23:59:59Z</str>
  </lst>
  <lst name="rr">
    <str name="max">str9</str>
    <str name="min">str0</str>
    <str name="rmax">9rts</str>
    <str name="rmin">0rts</str>
  </lst>
  <lst name="cnr">
    <double name="c10">10.0</double>
    <double name="c8">8.0</double>
  </lst>
  <lst name="mr">
    <long name="count">100</long>
    <null name="mcm"/>
    <null name="mean"/>
    <null name="median"/>
    <null name="su"/>
    <null name="sum"/>
    <null name="unique"/>
  </lst>
  <lst name="ar">
    <long name="count">100</long>
    <null name="mcm"/>
    <null name="mean"/>
    <null name="median"/>
    <null name="su"/>
    <null name="sum"/>
    <null name="unique"/>
  </lst>
  <lst name="avr">
    <double name="c">100.0</double>
    <long name="count">100</long>
    <null name="s"/>
    <null name="sum"/>
  </lst>
</lst>
</response>

	at __randomizedtesting.SeedInfo.seed([2F7E4A527AF5F39D:D952E78C3B3AF4DA]:0)
	at org.junit.Assert.fail(Assert.java:93)
	at org.apache.solr.analytics.AbstractAnalyticsStatsTest.getStatResult(AbstractAnalyticsStatsTest.java:113)
	at org.apache.solr.analytics.expression.ExpressionTest.addTest(ExpressionTest.java:78)
	at sun.reflect.NativeMethodAccessorImpl.invoke0(Native Method)
	at sun.reflect.NativeMethodAccessorImpl.invoke(NativeMethodAccessorImpl.java:57)
	at sun.reflect.DelegatingMethodAccessorImpl.invoke(DelegatingMethodAccessorImpl.java:43)
	at java.lang.reflect.Method.invoke(Method.java:606)
	at com.carrotsearch.randomizedtesting.RandomizedRunner.invoke(RandomizedRunner.java:1559)
	at com.carrotsearch.randomizedtesting.RandomizedRunner.access$600(RandomizedRunner.java:79)
	at com.carrotsearch.randomizedtesting.RandomizedRunner$6.evaluate(RandomizedRunner.java:737)
	at com.carrotsearch.randomizedtesting.RandomizedRunner$7.evaluate(RandomizedRunner.java:773)
	at com.carrotsearch.randomizedtesting.RandomizedRunner$8.evaluate(RandomizedRunner.java:787)
	at com.carrotsearch.randomizedtesting.rules.SystemPropertiesRestoreRule$1.evaluate(SystemPropertiesRestoreRule.java:53)
	at org.apache.lucene.util.TestRuleSetupTeardownChained$1.evaluate(TestRuleSetupTeardownChained.java:50)
	at org.apache.lucene.util.TestRuleFieldCacheSanity$1.evaluate(TestRuleFieldCacheSanity.java:51)
	at org.apache.lucene.util.AbstractBeforeAfterRule$1.evaluate(AbstractBeforeAfterRule.java:46)
	at com.carrotsearch.randomizedtesting.rules.SystemPropertiesInvariantRule$1.evaluate(SystemPropertiesInvariantRule.java:55)
	at org.apache.lucene.util.TestRuleThreadAndTestName$1.evaluate(TestRuleThreadAndTestName.java:49)
	at org.apache.lucene.util.TestRuleIgnoreAfterMaxFailures$1.evaluate(TestRuleIgnoreAfterMaxFailures.java:70)
	at org.apache.lucene.util.TestRuleMarkFailure$1.evaluate(TestRuleMarkFailure.java:48)
	at com.carrotsearch.randomizedtesting.rules.StatementAdapter.evaluate(StatementAdapter.java:36)
	at com.carrotsearch.randomizedtesting.ThreadLeakControl$StatementRunner.run(ThreadLeakControl.java:358)
	at com.carrotsearch.randomizedtesting.ThreadLeakControl.forkTimeoutingTask(ThreadLeakControl.java:782)
	at com.carrotsearch.randomizedtesting.ThreadLeakControl$3.evaluate(ThreadLeakControl.java:442)
	at com.carrotsearch.randomizedtesting.RandomizedRunner.runSingleTest(RandomizedRunner.java:746)
	at com.carrotsearch.randomizedtesting.RandomizedRunner$3.evaluate(RandomizedRunner.java:648)
	at com.carrotsearch.randomizedtesting.RandomizedRunner$4.evaluate(RandomizedRunner.java:682)
	at com.carrotsearch.randomizedtesting.RandomizedRunner$5.evaluate(RandomizedRunner.java:693)
	at com.carrotsearch.randomizedtesting.rules.StatementAdapter.evaluate(StatementAdapter.java:36)
	at com.carrotsearch.randomizedtesting.rules.SystemPropertiesRestoreRule$1.evaluate(SystemPropertiesRestoreRule.java:53)
	at org.apache.lucene.util.AbstractBeforeAfterRule$1.evaluate(AbstractBeforeAfterRule.java:46)
	at org.apache.lucene.util.TestRuleStoreClassName$1.evaluate(TestRuleStoreClassName.java:42)
	at com.carrotsearch.randomizedtesting.rules.SystemPropertiesInvariantRule$1.evaluate(SystemPropertiesInvariantRule.java:55)
	at com.carrotsearch.randomizedtesting.rules.NoShadowingOrOverridesOnMethodsRule$1.evaluate(NoShadowingOrOverridesOnMethodsRule.java:39)
	at com.carrotsearch.randomizedtesting.rules.NoShadowingOrOverridesOnMethodsRule$1.evaluate(NoShadowingOrOverridesOnMethodsRule.java:39)
	at com.carrotsearch.randomizedtesting.rules.StatementAdapter.evaluate(StatementAdapter.java:36)
	at org.apache.lucene.util.TestRuleAssertionsRequired$1.evaluate(TestRuleAssertionsRequired.java:43)
	at org.apache.lucene.util.TestRuleMarkFailure$1.evaluate(TestRuleMarkFailure.java:48)
	at org.apache.lucene.util.TestRuleIgnoreAfterMaxFailures$1.evaluate(TestRuleIgnoreAfterMaxFailures.java:70)
	at org.apache.lucene.util.TestRuleIgnoreTestSuites$1.evaluate(TestRuleIgnoreTestSuites.java:55)
	at com.carrotsearch.randomizedtesting.rules.StatementAdapter.evaluate(StatementAdapter.java:36)
	at com.carrotsearch.randomizedtesting.ThreadLeakControl$StatementRunner.run(ThreadLeakControl.java:358)
	at java.lang.Thread.run(Thread.java:724)




Build Log:
[...truncated 11877 lines...]
   [junit4] Suite: org.apache.solr.analytics.expression.ExpressionTest
   [junit4]   2> 3026103 T7207 oas.SolrTestCaseJ4.initCore ####initCore
   [junit4]   2> Creating dataDir: /usr/home/hudson/hudson-slave/workspace/Lucene-Solr-NightlyTests-trunk/solr/build/solr-core/test/J0/./solrtest-ExpressionTest-1386023237477
   [junit4]   2> 3026104 T7207 oasc.SolrResourceLoader.<init> new SolrResourceLoader for directory: '/usr/home/hudson/hudson-slave/workspace/Lucene-Solr-NightlyTests-trunk/solr/build/solr-core/test-files/solr/collection1/'
   [junit4]   2> 3026105 T7207 oasc.SolrResourceLoader.replaceClassLoader Adding 'file:/usr/home/hudson/hudson-slave/workspace/Lucene-Solr-NightlyTests-trunk/solr/build/solr-core/test-files/solr/collection1/lib/classes/' to classloader
   [junit4]   2> 3026105 T7207 oasc.SolrResourceLoader.replaceClassLoader Adding 'file:/usr/home/hudson/hudson-slave/workspace/Lucene-Solr-NightlyTests-trunk/solr/build/solr-core/test-files/solr/collection1/lib/README' to classloader
   [junit4]   2> 3026189 T7207 oasc.SolrConfig.<init> Using Lucene MatchVersion: LUCENE_50
   [junit4]   2> 3026238 T7207 oasc.SolrConfig.<init> Loaded SolrConfig: solrconfig-basic.xml
   [junit4]   2> 3026239 T7207 oass.IndexSchema.readSchema Reading Solr Schema from schema-analytics.xml
   [junit4]   2> 3026245 T7207 oass.IndexSchema.readSchema [null] Schema name=schema-docValues
   [junit4]   2> 3026286 T7207 oass.IndexSchema.readSchema unique key field: id
   [junit4]   2> 3026287 T7207 oasc.SolrResourceLoader.locateSolrHome JNDI not configured for solr (NoInitialContextEx)
   [junit4]   2> 3026288 T7207 oasc.SolrResourceLoader.locateSolrHome using system property solr.solr.home: /usr/home/hudson/hudson-slave/workspace/Lucene-Solr-NightlyTests-trunk/solr/build/solr-core/test-files/solr
   [junit4]   2> 3026288 T7207 oasc.SolrResourceLoader.<init> new SolrResourceLoader for directory: '/usr/home/hudson/hudson-slave/workspace/Lucene-Solr-NightlyTests-trunk/solr/build/solr-core/test-files/solr/'
   [junit4]   2> 3026300 T7207 oasc.SolrResourceLoader.locateSolrHome JNDI not configured for solr (NoInitialContextEx)
   [junit4]   2> 3026300 T7207 oasc.SolrResourceLoader.locateSolrHome using system property solr.solr.home: /usr/home/hudson/hudson-slave/workspace/Lucene-Solr-NightlyTests-trunk/solr/build/solr-core/test-files/solr
   [junit4]   2> 3026300 T7207 oasc.SolrResourceLoader.<init> new SolrResourceLoader for deduced Solr Home: '/usr/home/hudson/hudson-slave/workspace/Lucene-Solr-NightlyTests-trunk/solr/build/solr-core/test-files/solr/'
   [junit4]   2> 3026357 T7207 oasc.CoreContainer.<init> New CoreContainer 1153686554
   [junit4]   2> 3026358 T7207 oasc.CoreContainer.load Loading cores into CoreContainer [instanceDir=/usr/home/hudson/hudson-slave/workspace/Lucene-Solr-NightlyTests-trunk/solr/build/solr-core/test-files/solr/]
   [junit4]   2> 3026359 T7207 oashc.HttpShardHandlerFactory.getParameter Setting socketTimeout to: 0
   [junit4]   2> 3026359 T7207 oashc.HttpShardHandlerFactory.getParameter Setting urlScheme to: http://
   [junit4]   2> 3026360 T7207 oashc.HttpShardHandlerFactory.getParameter Setting connTimeout to: 0
   [junit4]   2> 3026360 T7207 oashc.HttpShardHandlerFactory.getParameter Setting maxConnectionsPerHost to: 20
   [junit4]   2> 3026360 T7207 oashc.HttpShardHandlerFactory.getParameter Setting corePoolSize to: 0
   [junit4]   2> 3026360 T7207 oashc.HttpShardHandlerFactory.getParameter Setting maximumPoolSize to: 2147483647
   [junit4]   2> 3026361 T7207 oashc.HttpShardHandlerFactory.getParameter Setting maxThreadIdleTime to: 5
   [junit4]   2> 3026361 T7207 oashc.HttpShardHandlerFactory.getParameter Setting sizeOfQueue to: -1
   [junit4]   2> 3026361 T7207 oashc.HttpShardHandlerFactory.getParameter Setting fairnessPolicy to: false
   [junit4]   2> 3026374 T7207 oasl.LogWatcher.createWatcher SLF4J impl is org.slf4j.impl.Log4jLoggerFactory
   [junit4]   2> 3026375 T7207 oasl.LogWatcher.newRegisteredLogWatcher Registering Log Listener [Log4j (org.slf4j.impl.Log4jLoggerFactory)]
   [junit4]   2> 3026375 T7207 oasc.CoreContainer.load Host Name: 
   [junit4]   2> 3026379 T7208 oasc.CoreContainer.create Creating SolrCore 'collection1' using instanceDir: /usr/home/hudson/hudson-slave/workspace/Lucene-Solr-NightlyTests-trunk/solr/build/solr-core/test-files/solr/collection1
   [junit4]   2> 3026380 T7208 oasc.SolrResourceLoader.<init> new SolrResourceLoader for directory: '/usr/home/hudson/hudson-slave/workspace/Lucene-Solr-NightlyTests-trunk/solr/build/solr-core/test-files/solr/collection1/'
   [junit4]   2> 3026380 T7208 oasc.SolrResourceLoader.replaceClassLoader Adding 'file:/usr/home/hudson/hudson-slave/workspace/Lucene-Solr-NightlyTests-trunk/solr/build/solr-core/test-files/solr/collection1/lib/classes/' to classloader
   [junit4]   2> 3026381 T7208 oasc.SolrResourceLoader.replaceClassLoader Adding 'file:/usr/home/hudson/hudson-slave/workspace/Lucene-Solr-NightlyTests-trunk/solr/build/solr-core/test-files/solr/collection1/lib/README' to classloader
   [junit4]   2> 3026420 T7208 oasc.SolrConfig.<init> Using Lucene MatchVersion: LUCENE_50
   [junit4]   2> 3026459 T7208 oasc.SolrConfig.<init> Loaded SolrConfig: solrconfig-basic.xml
   [junit4]   2> 3026460 T7208 oass.IndexSchema.readSchema Reading Solr Schema from schema-analytics.xml
   [junit4]   2> 3026465 T7208 oass.IndexSchema.readSchema [collection1] Schema name=schema-docValues
   [junit4]   2> 3026500 T7208 oass.IndexSchema.readSchema unique key field: id
   [junit4]   2> 3026501 T7208 oasc.SolrCore.initDirectoryFactory org.apache.solr.core.MockDirectoryFactory
   [junit4]   2> 3026502 T7208 oasc.SolrCore.<init> [collection1] Opening new SolrCore at /usr/home/hudson/hudson-slave/workspace/Lucene-Solr-NightlyTests-trunk/solr/build/solr-core/test-files/solr/collection1/, dataDir=/usr/home/hudson/hudson-slave/workspace/Lucene-Solr-NightlyTests-trunk/solr/build/solr-core/test/J0/./solrtest-ExpressionTest-1386023237477/
   [junit4]   2> 3026502 T7208 oasc.SolrCore.<init> JMX monitoring not detected for core: collection1
   [junit4]   2> 3026502 T7208 oasc.CachingDirectoryFactory.get return new directory for /usr/home/hudson/hudson-slave/workspace/Lucene-Solr-NightlyTests-trunk/solr/build/solr-core/test/J0/./solrtest-ExpressionTest-1386023237477
   [junit4]   2> 3026503 T7208 oasc.SolrCore.getNewIndexDir New index directory detected: old=null new=/usr/home/hudson/hudson-slave/workspace/Lucene-Solr-NightlyTests-trunk/solr/build/solr-core/test/J0/./solrtest-ExpressionTest-1386023237477/index/
   [junit4]   2> 3026503 T7208 oasc.SolrCore.initIndex WARN [collection1] Solr index directory '/usr/home/hudson/hudson-slave/workspace/Lucene-Solr-NightlyTests-trunk/solr/build/solr-core/test/J0/./solrtest-ExpressionTest-1386023237477/index' doesn't exist. Creating new index...
   [junit4]   2> 3026503 T7208 oasc.CachingDirectoryFactory.get return new directory for /usr/home/hudson/hudson-slave/workspace/Lucene-Solr-NightlyTests-trunk/solr/build/solr-core/test/J0/./solrtest-ExpressionTest-1386023237477/index
   [junit4]   2> 3026504 T7208 oasu.RandomMergePolicy.<init> RandomMergePolicy wrapping class org.apache.lucene.index.LogDocMergePolicy: [LogDocMergePolicy: minMergeSize=1000, mergeFactor=38, maxMergeSize=9223372036854775807, maxMergeSizeForForcedMerge=9223372036854775807, calibrateSizeByDeletes=true, maxMergeDocs=2147483647, maxCFSSegmentSizeMB=8.796093022207999E12, noCFSRatio=0.3694234982845115]
   [junit4]   2> 3026504 T7208 oasc.SolrDeletionPolicy.onCommit SolrDeletionPolicy.onCommit: commits: num=1
   [junit4]   2> 		commit{dir=MockDirectoryWrapper(org.apache.lucene.store.RAMDirectory@20daa231 lockFactory=org.apache.lucene.store.SingleInstanceLockFactory@2826861f),segFN=segments_1,generation=1}
   [junit4]   2> 3026505 T7208 oasc.SolrDeletionPolicy.updateCommits newest commit generation = 1
   [junit4]   2> 3026505 T7208 oasc.SolrCore.loadUpdateProcessorChains no updateRequestProcessorChain defined as default, creating implicit default
   [junit4]   2> 3026506 T7208 oasc.RequestHandlers.initHandlersFromConfig created standard: solr.StandardRequestHandler
   [junit4]   2> 3026506 T7208 oasc.RequestHandlers.initHandlersFromConfig created /update: solr.UpdateRequestHandler
   [junit4]   2> 3026517 T7208 oashl.XMLLoader.init xsltCacheLifetimeSeconds=60
   [junit4]   2> 3026520 T7208 oasu.CommitTracker.<init> Hard AutoCommit: disabled
   [junit4]   2> 3026520 T7208 oasu.CommitTracker.<init> Soft AutoCommit: disabled
   [junit4]   2> 3026521 T7208 oasu.RandomMergePolicy.<init> RandomMergePolicy wrapping class org.apache.lucene.index.LogByteSizeMergePolicy: [LogByteSizeMergePolicy: minMergeSize=1677721, mergeFactor=43, maxMergeSize=2147483648, maxMergeSizeForForcedMerge=9223372036854775807, calibrateSizeByDeletes=true, maxMergeDocs=2147483647, maxCFSSegmentSizeMB=8.796093022207999E12, noCFSRatio=0.5798810351594432]
   [junit4]   2> 3026521 T7208 oasc.SolrDeletionPolicy.onInit SolrDeletionPolicy.onInit: commits: num=1
   [junit4]   2> 		commit{dir=MockDirectoryWrapper(org.apache.lucene.store.RAMDirectory@20daa231 lockFactory=org.apache.lucene.store.SingleInstanceLockFactory@2826861f),segFN=segments_1,generation=1}
   [junit4]   2> 3026522 T7208 oasc.SolrDeletionPolicy.updateCommits newest commit generation = 1
   [junit4]   2> 3026522 T7208 oass.SolrIndexSearcher.<init> Opening Searcher@29764d7 main
   [junit4]   2> 3026522 T7209 oasc.SolrCore.registerSearcher [collection1] Registered new searcher Searcher@29764d7 main{StandardDirectoryReader(segments_1:1:nrt)}
   [junit4]   2> 3026522 T7208 oasc.CoreContainer.registerCore registering core: collection1
   [junit4]   2> 3026525 T7207 oas.SolrTestCaseJ4.initCore ####initCore end
   [junit4]   2> ASYNC  NEW_CORE C2156 name=collection1 org.apache.solr.core.SolrCore@54d6f720
   [junit4]   2> 3026530 T7207 C2156 oasu.DirectUpdateHandler2.deleteAll [collection1] REMOVING ALL DOCUMENTS FROM INDEX
   [junit4]   2> 3026530 T7207 C2156 oasup.LogUpdateProcessor.finish [collection1] webapp=null path=null params={} {deleteByQuery=*:*} 0 1
   [junit4]   2> 3026537 T7207 C2156 oasup.LogUpdateProcessor.finish [collection1] webapp=null path=null params={} {add=[10000]} 0 2
   [junit4]   2> 3026547 T7207 C2156 oasup.LogUpdateProcessor.finish [collection1] webapp=null path=null params={} {add=[10001]} 0 1
   [junit4]   2> 3026553 T7207 C2156 oasup.LogUpdateProcessor.finish [collection1] webapp=null path=null params={} {add=[10002]} 0 0
   [junit4]   2> 3026560 T7207 C2156 oasup.LogUpdateProcessor.finish [collection1] webapp=null path=null params={} {add=[10003]} 0 0
   [junit4]   2> 3026567 T7207 C2156 oasup.LogUpdateProcessor.finish [collection1] webapp=null path=null params={} {add=[10004]} 0 1
   [junit4]   2> 3026575 T7207 C2156 oasup.LogUpdateProcessor.finish [collection1] webapp=null path=null params={} {add=[10005]} 0 1
   [junit4]   2> 3026582 T7207 C2156 oasup.LogUpdateProcessor.finish [collection1] webapp=null path=null params={} {add=[10006]} 0 1
   [junit4]   2> 3026590 T7207 C2156 oasup.LogUpdateProcessor.finish [collection1] webapp=null path=null params={} {add=[10007]} 0 1
   [junit4]   2> 3026597 T7207 C2156 oasup.LogUpdateProcessor.finish [collection1] webapp=null path=null params={} {add=[10008]} 0 1
   [junit4]   2> 3026603 T7207 C2156 oasup.LogUpdateProcessor.finish [collection1] webapp=null path=null params={} {add=[10009]} 0 0
   [junit4]   2> 3026611 T7207 C2156 oasup.LogUpdateProcessor.finish [collection1] webapp=null path=null params={} {add=[100010]} 0 1
   [junit4]   2> 3026618 T7207 C2156 oasup.LogUpdateProcessor.finish [collection1] webapp=null path=null params={} {add=[100011]} 0 1
   [junit4]   2> 3026625 T7207 C2156 oasup.LogUpdateProcessor.finish [collection1] webapp=null path=null params={} {add=[100012]} 0 1
   [junit4]   2> 3026632 T7207 C2156 oasup.LogUpdateProcessor.finish [collection1] webapp=null path=null params={} {add=[100013]} 0 1
   [junit4]   2> 3026639 T7207 C2156 oasup.LogUpdateProcessor.finish [collection1] webapp=null path=null params={} {add=[100014]} 0 1
   [junit4]   2> ASYNC  NEW_CORE C2157 name=collection1 org.apache.solr.core.SolrCore@54d6f720
   [junit4]   2> 3026655 T7207 C2157 oasup.LogUpdateProcessor.finish [collection1] webapp=null path=null params={} {add=[100015]} 0 1
   [junit4]   2> 3026663 T7207 C2157 oasup.LogUpdateProcessor.finish [collection1] webapp=null path=null params={} {add=[100016]} 0 1
   [junit4]   2> 3026670 T7207 C2157 oasup.LogUpdateProcessor.finish [collection1] webapp=null path=null params={} {add=[100017]} 0 1
   [junit4]   2> 3026677 T7207 C2157 oasup.LogUpdateProcessor.finish [collection1] webapp=null path=null params={} {add=[100018]} 0 1
   [junit4]   2> 3026685 T7207 C2157 oasup.LogUpdateProcessor.finish [collection1] webapp=null path=null params={} {add=[100019]} 0 1
   [junit4]   2> 3026692 T7207 C2157 oasup.LogUpdateProcessor.finish [collection1] webapp=null path=null params={} {add=[100020]} 0 1
   [junit4]   2> 3026699 T7207 C2157 oasup.LogUpdateProcessor.finish [collection1] webapp=null path=null params={} {add=[100021]} 0 1
   [junit4]   2> 3026706 T7207 C2157 oasup.LogUpdateProcessor.finish [collection1] webapp=null path=null params={} {add=[100022]} 0 0
   [junit4]   2> 3026713 T7207 C2157 oasup.LogUpdateProcessor.finish [collection1] webapp=null path=null params={} {add=[100023]} 0 0
   [junit4]   2> 3026721 T7207 C2157 oasup.LogUpdateProcessor.finish [collection1] webapp=null path=null params={} {add=[100024]} 0 1
   [junit4]   2> 3026730 T7207 C2157 oasup.LogUpdateProcessor.finish [collection1] webapp=null path=null params={} {add=[100025]} 0 1
   [junit4]   2> 3026737 T7207 C2157 oasup.LogUpdateProcessor.finish [collection1] webapp=null path=null params={} {add=[100026]} 0 0
   [junit4]   2> 3026744 T7207 C2157 oasup.LogUpdateProcessor.finish [collection1] webapp=null path=null params={} {add=[100027]} 0 0
   [junit4]   2> 3026751 T7207 C2157 oasup.LogUpdateProcessor.finish [collection1] webapp=null path=null params={} {add=[100028]} 0 1
   [junit4]   2> 3026759 T7207 C2157 oasup.LogUpdateProcessor.finish [collection1] webapp=null path=null params={} {add=[100029]} 0 1
   [junit4]   2> 3026766 T7207 C2157 oasup.LogUpdateProcessor.finish [collection1] webapp=null path=null params={} {add=[100030]} 0 1
   [junit4]   2> 3026773 T7207 C2157 oasup.LogUpdateProcessor.finish [collection1] webapp=null path=null params={} {add=[100031]} 0 1
   [junit4]   2> 3026780 T7207 C2157 oasup.LogUpdateProcessor.finish [collection1] webapp=null path=null params={} {add=[100032]} 0 0
   [junit4]   2> 3026788 T7207 C2157 oasup.LogUpdateProcessor.finish [collection1] webapp=null path=null params={} {add=[100033]} 0 1
   [junit4]   2> 3026795 T7207 C2157 oasup.LogUpdateProcessor.finish [collection1] webapp=null path=null params={} {add=[100034]} 0 1
   [junit4]   2> 3026803 T7207 C2157 oasup.LogUpdateProcessor.finish [collection1] webapp=null path=null params={} {add=[100035]} 0 1
   [junit4]   2> 3026810 T7207 C2157 oasup.LogUpdateProcessor.finish [collection1] webapp=null path=null params={} {add=[100036]} 0 1
   [junit4]   2> 3026818 T7207 C2157 oasup.LogUpdateProcessor.finish [collection1] webapp=null path=null params={} {add=[100037]} 0 1
   [junit4]   2> 3026825 T7207 C2157 oasup.LogUpdateProcessor.finish [collection1] webapp=null path=null params={} {add=[100038]} 0 1
   [junit4]   2> 3026831 T7207 C2157 oasup.LogUpdateProcessor.finish [collection1] webapp=null path=null params={} {add=[100039]} 0 0
   [junit4]   2> 3026839 T7207 C2157 oasup.LogUpdateProcessor.finish [collection1] webapp=null path=null params={} {add=[100040]} 0 1
   [junit4]   2> 3026846 T7207 C2157 oasup.LogUpdateProcessor.finish [collection1] webapp=null path=null params={} {add=[100041]} 0 1
   [junit4]   2> 3026853 T7207 C2157 oasup.LogUpdateProcessor.finish [collection1] webapp=null path=null params={} {add=[100042]} 0 1
   [junit4]   2> 3026860 T7207 C2157 oasup.LogUpdateProcessor.finish [collection1] webapp=null path=null params={} {add=[100043]} 0 1
   [junit4]   2> 3026867 T7207 C2157 oasup.LogUpdateProcessor.finish [collection1] webapp=null path=null params={} {add=[100044]} 0 1
   [junit4]   2> 3026875 T7207 C2157 oasup.LogUpdateProcessor.finish [collection1] webapp=null path=null params={} {add=[100045]} 0 1
   [junit4]   2> 3026882 T7207 C2157 oasup.LogUpdateProcessor.finish [collection1] webapp=null path=null params={} {add=[100046]} 0 1
   [junit4]   2> 3026889 T7207 C2157 oasup.LogUpdateProcessor.finish [collection1] webapp=null path=null params={} {add=[100047]} 0 1
   [junit4]   2> 3026896 T7207 C2157 oasup.LogUpdateProcessor.finish [collection1] webapp=null path=null params={} {add=[100048]} 0 1
   [junit4]   2> 3026903 T7207 C2157 oasup.LogUpdateProcessor.finish [collection1] webapp=null path=null params={} {add=[100049]} 0 1
   [junit4]   2> 3026911 T7207 C2157 oasup.LogUpdateProcessor.finish [collection1] webapp=null path=null params={} {add=[100050]} 0 1
   [junit4]   2> 3026919 T7207 C2157 oasup.LogUpdateProcessor.finish [collection1] webapp=null path=null params={} {add=[100051]} 0 0
   [junit4]   2> 3026928 T7207 C2157 oasup.LogUpdateProcessor.finish [collection1] webapp=null path=null params={} {add=[100052]} 0 1
   [junit4]   2> 3026937 T7207 C2157 oasup.LogUpdateProcessor.finish [collection1] webapp=null path=null params={} {add=[100053]} 0 1
   [junit4]   2> 3026945 T7207 C2157 oasup.LogUpdateProcessor.finish [collection1] webapp=null path=null params={} {add=[100054]} 0 0
   [junit4]   2> 3026953 T7207 C2157 oasup.LogUpdateProcessor.finish [collection1] webapp=null path=null params={} {add=[100055]} 0 1
   [junit4]   2> 3026960 T7207 C2157 oasup.LogUpdateProcessor.finish [collection1] webapp=null path=null params={} {add=[100056]} 0 0
   [junit4]   2> 3026968 T7207 C2157 oasup.LogUpdateProcessor.finish [collection1] webapp=null path=null params={} {add=[100057]} 0 1
   [junit4]   2> 3026974 T7207 C2157 oasup.LogUpdateProcessor.finish [collection1] webapp=null path=null params={} {add=[100058]} 0 0
   [junit4]   2> 3026981 T7207 C2157 oasup.LogUpdateProcessor.finish [collection1] webapp=null path=null params={} {add=[100059]} 0 1
   [junit4]   2> 3026988 T7207 C2157 oasup.LogUpdateProcessor.finish [collection1] webapp=null path=null params={} {add=[100060]} 0 1
   [junit4]   2> 3026995 T7207 C2157 oasup.LogUpdateProcessor.finish [collection1] webapp=null path=null params={} {add=[100061]} 0 1
   [junit4]   2> 3027002 T7207 C2157 oasup.LogUpdateProcessor.finish [collection1] webapp=null path=null params={} {add=[100062]} 0 1
   [junit4]   2> 3027008 T7207 C2157 oasup.LogUpdateProcessor.finish [collection1] webapp=null path=null params={} {add=[100063]} 0 1
   [junit4]   2> 3027014 T7207 C2157 oasup.LogUpdateProcessor.finish [collection1] webapp=null path=null params={} {add=[100064]} 0 0
   [junit4]   2> 3027021 T7207 C2157 oasup.LogUpdateProcessor.finish [collection1] webapp=null path=null params={} {add=[100065]} 0 0
   [junit4]   2> 3027028 T7207 C2157 oasup.LogUpdateProcessor.finish [collection1] webapp=null path=null params={} {add=[100066]} 0 1
   [junit4]   2> 3027035 T7207 C2157 oasup.LogUpdateProcessor.finish [collection1] webapp=null path=null params={} {add=[100067]} 0 1
   [junit4]   2> 3027041 T7207 C2157 oasup.LogUpdateProcessor.finish [collection1] webapp=null path=null params={} {add=[100068]} 0 1
   [junit4]   2> 3027047 T7207 C2157 oasup.LogUpdateProcessor.finish [collection1] webapp=null path=null params={} {add=[100069]} 0 0
   [junit4]   2> 3027054 T7207 C2157 oasup.LogUpdateProcessor.finish [collection1] webapp=null path=null params={} {add=[100070]} 0 0
   [junit4]   2> 3027061 T7207 C2157 oasup.LogUpdateProcessor.finish [collection1] webapp=null path=null params={} {add=[100071]} 0 1
   [junit4]   2> 3027067 T7207 C2157 oasup.LogUpdateProcessor.finish [collection1] webapp=null path=null params={} {add=[100072]} 0 1
   [junit4]   2> 3027074 T7207 C2157 oasup.LogUpdateProcessor.finish [collection1] webapp=null path=null params={} {add=[100073]} 0 1
   [junit4]   2> 3027080 T7207 C2157 oasup.LogUpdateProcessor.finish [collection1] webapp=null path=null params={} {add=[100074]} 0 1
   [junit4]   2> ASYNC  NEW_CORE C2158 name=collection1 org.apache.solr.core.SolrCore@54d6f720
   [junit4]   2> 3027094 T7207 C2158 oasup.LogUpdateProcessor.finish [collection1] webapp=null path=null params={} {add=[100075]} 0 0
   [junit4]   2> 3027101 T7207 C2158 oasup.LogUpdateProcessor.finish [collection1] webapp=null path=null params={} {add=[100076]} 0 1
   [junit4]   2> 3027107 T7207 C2158 oasup.LogUpdateProcessor.finish [collection1] webapp=null path=null params={} {add=[100077]} 0 0
   [junit4]   2> 3027114 T7207 C2158 oasup.LogUpdateProcessor.finish [collection1] webapp=null path=null params={} {add=[100078]} 0 1
   [junit4]   2> 3027120 T7207 C2158 oasup.LogUpdateProcessor.finish [collection1] webapp=null path=null params={} {add=[100079]} 0 0
   [junit4]   2> 3027129 T7207 C2158 oasup.LogUpdateProcessor.finish [collection1] webapp=null path=null params={} {add=[100080]} 0 1
   [junit4]   2> 3027137 T7207 C2158 oasup.LogUpdateProcessor.finish [collection1] webapp=null path=null params={} {add=[100081]} 0 1
   [junit4]   2> 3027143 T7207 C2158 oasup.LogUpdateProcessor.finish [collection1] webapp=null path=null params={} {add=[100082]} 0 0
   [junit4]   2> 3027150 T7207 C2158 oasup.LogUpdateProcessor.finish [collection1] webapp=null path=null params={} {add=[100083]} 0 1
   [junit4]   2> 3027156 T7207 C2158 oasup.LogUpdateProcessor.finish [collection1] webapp=null path=null params={} {add=[100084]} 0 0
   [junit4]   2> 3027163 T7207 C2158 oasup.LogUpdateProcessor.finish [collection1] webapp=null path=null params={} {add=[100085]} 0 1
   [junit4]   2> 3027169 T7207 C2158 oasup.LogUpdateProcessor.finish [collection1] webapp=null path=null params={} {add=[100086]} 0 1
   [junit4]   2> 3027175 T7207 C2158 oasup.LogUpdateProcessor.finish [collection1] webapp=null path=null params={} {add=[100087]} 0 1
   [junit4]   2> 3027181 T7207 C2158 oasup.LogUpdateProcessor.finish [collection1] webapp=null path=null params={} {add=[100088]} 0 1
   [junit4]   2> 3027187 T7207 C2158 oasup.LogUpdateProcessor.finish [collection1] webapp=null path=null params={} {add=[100089]} 0 0
   [junit4]   2> 3027193 T7207 C2158 oasup.LogUpdateProcessor.finish [collection1] webapp=null path=null params={} {add=[100090]} 0 0
   [junit4]   2> 3027199 T7207 C2158 oasup.LogUpdateProcessor.finish [collection1] webapp=null path=null params={} {add=[100091]} 0 0
   [junit4]   2> 3027205 T7207 C2158 oasup.LogUpdateProcessor.finish [collection1] webapp=null path=null params={} {add=[100092]} 0 0
   [junit4]   2> 3027212 T7207 C2158 oasup.LogUpdateProcessor.finish [collection1] webapp=null path=null params={} {add=[100093]} 0 0
   [junit4]   2> 3027219 T7207 C2158 oasup.LogUpdateProcessor.finish [collection1] webapp=null path=null params={} {add=[100094]} 0 1
   [junit4]   2> 3027225 T7207 C2158 oasup.LogUpdateProcessor.finish [collection1] webapp=null path=null params={} {add=[100095]} 0 0
   [junit4]   2> 3027232 T7207 C2158 oasup.LogUpdateProcessor.finish [collection1] webapp=null path=null params={} {add=[100096]} 0 1
   [junit4]   2> 3027238 T7207 C2158 oasup.LogUpdateProcessor.finish [collection1] webapp=null path=null params={} {add=[100097]} 0 0
   [junit4]   2> 3027246 T7207 C2158 oasup.LogUpdateProcessor.finish [collection1] webapp=null path=null params={} {add=[100098]} 0 1
   [junit4]   2> 3027253 T7207 C2158 oasup.LogUpdateProcessor.finish [collection1] webapp=null path=null params={} {add=[100099]} 0 1
   [junit4]   2> 3027259 T7207 C2158 oasu.DirectUpdateHandler2.commit start commit{,optimize=false,openSearcher=true,waitSearcher=true,expungeDeletes=false,softCommit=false,prepareCommit=false}
   [junit4]   2> 3027273 T7207 C2158 oasc.SolrDeletionPolicy.onCommit SolrDeletionPolicy.onCommit: commits: num=2
   [junit4]   2> 		commit{dir=MockDirectoryWrapper(org.apache.lucene.store.RAMDirectory@20daa231 lockFactory=org.apache.lucene.store.SingleInstanceLockFactory@2826861f),segFN=segments_1,generation=1}
   [junit4]   2> 		commit{dir=MockDirectoryWrapper(org.apache.lucene.store.RAMDirectory@20daa231 lockFactory=org.apache.lucene.store.SingleInstanceLockFactory@2826861f),segFN=segments_2,generation=2}
   [junit4]   2> 3027274 T7207 C2158 oasc.SolrDeletionPolicy.updateCommits newest commit generation = 2
   [junit4]   2> 3027283 T7207 C2158 oass.SolrIndexSearcher.<init> Opening Searcher@1d92fd7e main
   [junit4]   2> 3027284 T7207 C2158 oasu.DirectUpdateHandler2.commit end_commit_flush
   [junit4]   2> 3027284 T7209 oasc.SolrCore.registerSearcher [collection1] Registered new searcher Searcher@1d92fd7e main{StandardDirectoryReader(segments_2:4:nrt _0(5.0):c100)}
   [junit4]   2> 3027285 T7207 C2158 oasup.LogUpdateProcessor.finish [collection1] webapp=null path=null params={} {commit=} 0 25
   [junit4]   2> 3027312 T7207 C2158 oasc.SolrCore.execute [collection1] webapp=null path=null params={o.rr.s.rmin=rev(min(string_sd))&o.ar.s.sum=sum(int_id)&o.mr.s.unique=unique(long_ld)&o.ar.s.mean=mean(int_id)&o.mr.s.mean=mean(int_id)&rows=0&o.ar.s.count=count(long_ld)&o.cdr.s.cd2=const_date(1804-06-30T23:59:59Z)&o.nr.s.count=count(long_ld)&o.ar.s.median=median(int_id)&o.dmr.s.dmma=date_math(max(date_dtd),const_str(%2B2MONTHS))&o.cr.s.csmin=const_str(this+is+the+first)&o.ar.s.su=add(sum(int_id),unique(long_ld))&o.cr.s.min=min(string_sd)&o.cr.s.max=max(string_sd)&o.mr.s.sum=sum(int_id)&o.rr.s.min=min(string_sd)&o.ar.s.unique=unique(long_ld)&o.mr.s.count=count(long_ld)&q=*:*&o.mr.s.median=median(int_id)&o.avr.s.sum=sum(int_id)&o.dr.s.mc=div(mean(int_id),count(long_ld))&o.avr.s.count=count(long_ld)&o.dr.s.sum=sum(int_id)&o.cr.s.ccmin=concat(const_str(this+is+the+first),min(string_sd))&stats=true&o.nr.s.sum=sum(int_id)&o.mr.s.mcm=mult(mean(int_id),count(long_ld),median(int_id))&o.cnr.s.c8=const_num(8)&o.dr.s.count=count(long_ld)&o.cdr.s.cs2=const_str(1804-06-30T23:59:59Z)&o.dmr.s.dmme=date_math(median(date_dtd),const_str(%2B2YEARS))&o.cr.s.ccmax=concat(const_str(this+is+the+second),max(string_sd))&o.csr.s.cs1=const_str(this+is+the+first)&o.rr.s.rmax=rev(max(string_sd))&o.csr.s.cs3=const_str(this+is+the+third)&o.pr.s.sum=sum(int_id)&o.rr.s.max=max(string_sd)&o.cdr.s.cs1=const_str(1800-12-31T23:59:59Z)&o.pr.s.unique=unique(long_ld)&o.dr.s.su=div(sum(int_id),unique(long_ld))&o.mr.s.su=mult(sum(int_id),unique(long_ld))&o.ar.s.mcm=add(mean(int_id),count(long_ld),median(int_id))&o.dmr.s.cma=const_str(%2B2MONTHS)&o.avr.s.c=abs(neg(count(long_ld)))&o.cr.s.csmax=const_str(this+is+the+second)&o.csr.s.cs2=const_str(this+is+the+second)&o.pr.s.su=pow(sum(int_id),unique(long_ld))&o.pr.s.count=count(long_ld)&o.dr.s.unique=unique(long_ld)&o.dmr.s.cme=const_str(%2B2YEARS)&indent=true&o.nr.s.s=neg(sum(int_id))&o.dmr.s.max=max(date_dtd)&o.nr.s.c=neg(count(long_ld))&o.dmr.s.median=median(date_dtd)&olap=true&o.cdr.s.cd1=const_date(1800-12-31T23:59:59Z)&o.dr.s.mean=mean(int_id)&o.pr.s.mean=mean(int_id)&o.pr.s.mc=pow(mean(int_id),count(long_ld))&o.cnr.s.c10=const_num(10)&o.avr.s.s=abs(neg(sum(int_id)))} hits=100 status=0 QTime=22 
   [junit4]   2> 3027319 T7207 oas.SolrTestCaseJ4.setUp ###Starting constantStringTest
   [junit4]   2> 3027323 T7207 oas.SolrTestCaseJ4.tearDown ###Ending constantStringTest
   [junit4]   2> 3027327 T7207 oas.SolrTestCaseJ4.setUp ###Starting constantNumberTest
   [junit4]   2> 3027330 T7207 oas.SolrTestCaseJ4.tearDown ###Ending constantNumberTest
   [junit4]   2> 3027334 T7207 oas.SolrTestCaseJ4.setUp ###Starting negateTest
   [junit4]   2> 3027336 T7207 oas.SolrTestCaseJ4.tearDown ###Ending negateTest
   [junit4]   2> NOTE: download the large Jenkins line-docs file by running 'ant get-jenkins-line-docs' in the lucene directory.
   [junit4]   2> NOTE: reproduce with: ant test  -Dtestcase=ExpressionTest -Dtests.method=negateTest -Dtests.seed=2F7E4A527AF5F39D -Dtests.multiplier=2 -Dtests.nightly=true -Dtests.slow=true -Dtests.linedocsfile=/home/hudson/lucene-data/enwiki.random.lines.txt -Dtests.locale=uk -Dtests.timezone=America/Kentucky/Monticello -Dtests.file.encoding=ISO-8859-1
   [junit4] FAILURE 0.02s J0 | ExpressionTest.negateTest <<<
   [junit4]    > Throwable #1: java.lang.AssertionError: Caught exception in getStatResult, xPath = /response/lst[@name='stats']/lst[@name='nr']/double[@name='sum'] 
   [junit4]    > raw data: <?xml version="1.0" encoding="UTF-8"?>
   [junit4]    > <response>
   [junit4]    > <lst name="responseHeader">
   [junit4]    >   <int name="status">0</int>
   [junit4]    >   <int name="QTime">22</int>
   [junit4]    > </lst>
   [junit4]    > <result name="response" numFound="100" start="0">
   [junit4]    > </result>
   [junit4]    > <lst name="stats">
   [junit4]    >   <lst name="stats_fields"/>
   [junit4]    > </lst>
   [junit4]    > <lst name="stats">
   [junit4]    >   <lst name="dr">
   [junit4]    >     <long name="count">100</long>
   [junit4]    >     <null name="mc"/>
   [junit4]    >     <null name="mean"/>
   [junit4]    >     <null name="su"/>
   [junit4]    >     <null name="sum"/>
   [junit4]    >     <null name="unique"/>
   [junit4]    >   </lst>
   [junit4]    >   <lst name="cr">
   [junit4]    >     <str name="ccmax">this is the secondstr9</str>
   [junit4]    >     <str name="ccmin">this is the firststr0</str>
   [junit4]    >     <str name="csmax">this is the second</str>
   [junit4]    >     <str name="csmin">this is the first</str>
   [junit4]    >     <str name="max">str9</str>
   [junit4]    >     <str name="min">str0</str>
   [junit4]    >   </lst>
   [junit4]    >   <lst name="pr">
   [junit4]    >     <long name="count">100</long>
   [junit4]    >     <null name="mc"/>
   [junit4]    >     <null name="mean"/>
   [junit4]    >     <null name="su"/>
   [junit4]    >     <null name="sum"/>
   [junit4]    >     <null name="unique"/>
   [junit4]    >   </lst>
   [junit4]    >   <lst name="nr">
   [junit4]    >     <double name="c">-100.0</double>
   [junit4]    >     <long name="count">100</long>
   [junit4]    >     <null name="s"/>
   [junit4]    >     <null name="sum"/>
   [junit4]    >   </lst>
   [junit4]    >   <lst name="dmr">
   [junit4]    >     <str name="cma">+2MONTHS</str>
   [junit4]    >     <str name="cme">+2YEARS</str>
   [junit4]    >     <date name="dmma">1812-02-29T23:59:59Z</date>
   [junit4]    >     <date name="dmme">1807-12-31T23:59:59Z</date>
   [junit4]    >     <date name="max">1811-12-31T23:59:59Z</date>
   [junit4]    >     <date name="median">1805-12-31T23:59:59Z</date>
   [junit4]    >   </lst>
   [junit4]    >   <lst name="csr">
   [junit4]    >     <str name="cs1">this is the first</str>
   [junit4]    >     <str name="cs2">this is the second</str>
   [junit4]    >     <str name="cs3">this is the third</str>
   [junit4]    >   </lst>
   [junit4]    >   <lst name="cdr">
   [junit4]    >     <date name="cd1">1800-12-31T23:59:59Z</date>
   [junit4]    >     <date name="cd2">1804-06-30T23:59:59Z</date>
   [junit4]    >     <str name="cs1">1800-12-31T23:59:59Z</str>
   [junit4]    >     <str name="cs2">1804-06-30T23:59:59Z</str>
   [junit4]    >   </lst>
   [junit4]    >   <lst name="rr">
   [junit4]    >     <str name="max">str9</str>
   [junit4]    >     <str name="min">str0</str>
   [junit4]    >     <str name="rmax">9rts</str>
   [junit4]    >     <str name="

[...truncated too long message...]

u"/>
   [junit4]    >     <null name="sum"/>
   [junit4]    >     <null name="unique"/>
   [junit4]    >   </lst>
   [junit4]    >   <lst name="avr">
   [junit4]    >     <double name="c">100.0</double>
   [junit4]    >     <long name="count">100</long>
   [junit4]    >     <null name="s"/>
   [junit4]    >     <null name="sum"/>
   [junit4]    >   </lst>
   [junit4]    > </lst>
   [junit4]    > </response>
   [junit4]    > 	at __randomizedtesting.SeedInfo.seed([2F7E4A527AF5F39D:D952E78C3B3AF4DA]:0)
   [junit4]    > 	at org.apache.solr.analytics.AbstractAnalyticsStatsTest.getStatResult(AbstractAnalyticsStatsTest.java:113)
   [junit4]    > 	at org.apache.solr.analytics.expression.ExpressionTest.addTest(ExpressionTest.java:78)
   [junit4]    > 	at java.lang.Thread.run(Thread.java:724)
   [junit4]   2> 3027440 T7207 oas.SolrTestCaseJ4.deleteCore ###deleteCore
   [junit4]   2> 3027440 T7207 oasc.CoreContainer.shutdown Shutting down CoreContainer instance=1153686554
   [junit4]   2> 3027440 T7207 oasc.SolrCore.close [collection1]  CLOSING SolrCore org.apache.solr.core.SolrCore@54d6f720
   [junit4]   2> 3027440 T7207 oasu.DirectUpdateHandler2.close closing DirectUpdateHandler2{commits=1,autocommits=0,soft autocommits=0,optimizes=0,rollbacks=0,expungeDeletes=0,docsPending=0,adds=0,deletesById=0,deletesByQuery=0,errors=0,cumulative_adds=100,cumulative_deletesById=0,cumulative_deletesByQuery=1,cumulative_errors=0}
   [junit4]   2> 3027441 T7207 oasu.SolrCoreState.decrefSolrCoreState Closing SolrCoreState
   [junit4]   2> 3027441 T7207 oasu.DefaultSolrCoreState.closeIndexWriter SolrCoreState ref count has reached 0 - closing IndexWriter
   [junit4]   2> 3027441 T7207 oasu.DefaultSolrCoreState.closeIndexWriter closing IndexWriter with IndexWriterCloser
   [junit4]   2> 3027442 T7207 oasc.SolrCore.closeSearcher [collection1] Closing main searcher on request.
   [junit4]   2> 3027442 T7207 oasc.CachingDirectoryFactory.close Closing MockDirectoryFactory - 2 directories currently being tracked
   [junit4]   2> 3027442 T7207 oasc.CachingDirectoryFactory.closeCacheValue looking to close /usr/home/hudson/hudson-slave/workspace/Lucene-Solr-NightlyTests-trunk/solr/build/solr-core/test/J0/./solrtest-ExpressionTest-1386023237477/index [CachedDir<<refCount=0;path=/usr/home/hudson/hudson-slave/workspace/Lucene-Solr-NightlyTests-trunk/solr/build/solr-core/test/J0/./solrtest-ExpressionTest-1386023237477/index;done=false>>]
   [junit4]   2> 3027443 T7207 oasc.CachingDirectoryFactory.close Closing directory: /usr/home/hudson/hudson-slave/workspace/Lucene-Solr-NightlyTests-trunk/solr/build/solr-core/test/J0/./solrtest-ExpressionTest-1386023237477/index
   [junit4]   2> 3027443 T7207 oasc.CachingDirectoryFactory.closeCacheValue looking to close /usr/home/hudson/hudson-slave/workspace/Lucene-Solr-NightlyTests-trunk/solr/build/solr-core/test/J0/./solrtest-ExpressionTest-1386023237477 [CachedDir<<refCount=0;path=/usr/home/hudson/hudson-slave/workspace/Lucene-Solr-NightlyTests-trunk/solr/build/solr-core/test/J0/./solrtest-ExpressionTest-1386023237477;done=false>>]
   [junit4]   2> 3027443 T7207 oasc.CachingDirectoryFactory.close Closing directory: /usr/home/hudson/hudson-slave/workspace/Lucene-Solr-NightlyTests-trunk/solr/build/solr-core/test/J0/./solrtest-ExpressionTest-1386023237477
   [junit4]   2> NOTE: test params are: codec=Lucene46: {float_fd=Pulsing41(freqCutoff=10 minBlockSize=66 maxBlockSize=198), date_dtd=Pulsing41(freqCutoff=10 minBlockSize=66 maxBlockSize=198), double_dd=Pulsing41(freqCutoff=13 minBlockSize=66 maxBlockSize=198), string_sd=Pulsing41(freqCutoff=10 minBlockSize=66 maxBlockSize=198), long_ld=PostingsFormat(name=SimpleText), int_id=Pulsing41(freqCutoff=10 minBlockSize=66 maxBlockSize=198), id=PostingsFormat(name=SimpleText)}, docValues:{floatdv=DocValuesFormat(name=Memory), float_fd=DocValuesFormat(name=Disk), datedv=DocValuesFormat(name=Lucene45), intdv=DocValuesFormat(name=Disk), date_dtd=DocValuesFormat(name=Disk), double_dd=DocValuesFormat(name=Memory), string_sd=DocValuesFormat(name=Disk), int_id=DocValuesFormat(name=Disk), long_ld=DocValuesFormat(name=SimpleText), stringdv=DocValuesFormat(name=Disk), longdv=DocValuesFormat(name=Memory), stringdvm=DocValuesFormat(name=Memory), doubledv=DocValuesFormat(name=SimpleText)}, sim=RandomSimilarityProvider(queryNorm=true,coord=no): {}, locale=uk, timezone=America/Kentucky/Monticello
   [junit4]   2> NOTE: FreeBSD 9.1-RELEASE-p3 amd64/Oracle Corporation 1.7.0_25 (64-bit)/cpus=16,threads=1,free=103476368,total=348520448
   [junit4]   2> NOTE: All tests run in this JVM: [TriLevelCompositeIdRoutingTest, TestCloudManagedSchemaAddField, TestUniqueKeyFieldResource, ClusterStateUpdateTest, InfoHandlerTest, TestSchemaSimilarityResource, TestCollationFieldDocValues, HdfsLockFactoryTest, TestDocBasedVersionConstraints, CoreMergeIndexesAdminHandlerTest, TestNonNRTOpen, RecoveryZkTest, EnumFieldTest, BadComponentTest, TestHighFrequencyDictionaryFactory, DirectUpdateHandlerOptimizeTest, TestValueSourceCache, TestCharFilters, QueryParsingTest, LoggingHandlerTest, TestReversedWildcardFilterFactory, UpdateRequestProcessorFactoryTest, AddSchemaFieldsUpdateProcessorFactoryTest, DateMathParserTest, UUIDFieldTest, SoftAutoCommitTest, SolrInfoMBeanTest, OverseerCollectionProcessorTest, SuggesterTest, TestMaxScoreQueryParser, TestNRTOpen, SOLR749Test, SystemInfoHandlerTest, TestSuggestSpellingConverter, ZkCLITest, TestGroupingSearch, ResourceLoaderTest, SampleTest, TestLuceneMatchVersion, TestRemoteStreaming, BasicFunctionalityTest, TestSurroundQueryParser, TestReplicationHandler, TestPHPSerializedResponseWriter, ZkControllerTest, BJQParserTest, SyncSliceTest, DistributedTermsComponentTest, DistributedSuggesterComponentTest, ReturnFieldsTest, ShardRoutingTest, TestDynamicFieldCollectionResource, TestSolrDeletionPolicy1, SpellPossibilityIteratorTest, TestBadConfig, UpdateParamsTest, CircularListTest, TestSolrIndexConfig, StatelessScriptUpdateProcessorFactoryTest, TestClassNameShortening, TestCoreContainer, TestPseudoReturnFields, SynonymTokenizerTest, QueryResultKeyTest, TestSolrQueryParser, PrimitiveFieldTypeTest, TestRealTimeGet, TestElisionMultitermQuery, TestWriterPerf, TestBM25SimilarityFactory, LukeRequestHandlerTest, TestSolrXmlPersistence, ClusterStateTest, LeaderElectionTest, CacheHeaderTest, TestManagedSchema, SolrCoreTest, SuggestComponentTest, QueryElevationComponentTest, HdfsSyncSliceTest, SuggesterFSTTest, CoreAdminHandlerTest, SolrXmlInZkTest, CustomCollectionTest, TestQueryUtils, RegexBoostProcessorTest, TestSearchPerf, UnloadDistributedZkTest, CollectionsAPIDistributedZkTest, ZkSolrClientTest, TestZkChroot, TestRandomDVFaceting, ShardRoutingCustomTest, SliceStateUpdateTest, AutoCommitTest, TestDistributedGrouping, TestFaceting, TestRecovery, DistributedSpellCheckComponentTest, TestMultiCoreConfBootstrap, TestStressVersions, HardAutoCommitTest, SimpleFacetsTest, StatsComponentTest, SolrCmdDistributorTest, PeerSyncTest, TestSort, DirectUpdateHandlerTest, HighlighterTest, DistributedQueryElevationComponentTest, CurrencyFieldXmlFileTest, SignatureUpdateProcessorFactoryTest, SpellCheckCollatorTest, TestFoldingMultitermQuery, TestStressLucene, TestTrie, SuggesterWFSTTest, WordBreakSolrSpellCheckerTest, TestUpdate, TestAtomicUpdateErrorCases, DefaultValueUpdateProcessorTest, DistanceFunctionTest, IndexBasedSpellCheckerTest, StandardRequestHandlerTest, TestQueryTypes, FileBasedSpellCheckerTest, TermsComponentTest, TermVectorComponentTest, MoreLikeThisHandlerTest, TestArbitraryIndexDir, IndexSchemaTest, TestCollationField, JsonLoaderTest, TestPartialUpdateDeduplication, CSVRequestHandlerTest, SearchHandlerTest, TestBinaryResponseWriter, AlternateDirectoryTest, CopyFieldTest, SolrIndexConfigTest, TestMergePolicyConfig, MultiTermTest, TestDocSet, TestBinaryField, TestConfig, TestFuzzyAnalyzedSuggestions, ExternalFileFieldSortTest, TestPostingsSolrHighlighter, DirectSolrConnectionTest, TestCodecSupport, EchoParamsTest, TestDFRSimilarityFactory, TestPerFieldSimilarity, TestLMDirichletSimilarityFactory, TestLMJelinekMercerSimilarityFactory, TestFastWriter, LegacyHTMLStripCharFilterTest, TestJmxMonitoredMap, TestFastOutputStream, ScriptEngineTest, OpenExchangeRatesOrgProviderTest, URLClassifyProcessorTest, TestFastLRUCache, TestSolrXMLSerializer, TestSystemIdResolver, DOMUtilTest, TestSolrJ, TestLRUCache, TestDocumentBuilder, SliceStateTest, SolrTestCaseJ4Test, NoFacetTest, ExpressionTest]
   [junit4] Completed on J0 in 1.37s, 12 tests, 6 failures <<< FAILURES!

[...truncated 155 lines...]
BUILD FAILED
/usr/home/hudson/hudson-slave/workspace/Lucene-Solr-NightlyTests-trunk/build.xml:427: The following error occurred while executing this line:
/usr/home/hudson/hudson-slave/workspace/Lucene-Solr-NightlyTests-trunk/build.xml:400: The following error occurred while executing this line:
/usr/home/hudson/hudson-slave/workspace/Lucene-Solr-NightlyTests-trunk/build.xml:39: The following error occurred while executing this line:
/usr/home/hudson/hudson-slave/workspace/Lucene-Solr-NightlyTests-trunk/extra-targets.xml:37: The following error occurred while executing this line:
/usr/home/hudson/hudson-slave/workspace/Lucene-Solr-NightlyTests-trunk/solr/build.xml:189: The following error occurred while executing this line:
/usr/home/hudson/hudson-slave/workspace/Lucene-Solr-NightlyTests-trunk/solr/common-build.xml:491: The following error occurred while executing this line:
/usr/home/hudson/hudson-slave/workspace/Lucene-Solr-NightlyTests-trunk/lucene/common-build.xml:1276: The following error occurred while executing this line:
/usr/home/hudson/hudson-slave/workspace/Lucene-Solr-NightlyTests-trunk/lucene/common-build.xml:909: There were test failures: 357 suites, 1570 tests, 6 failures, 32 ignored (4 assumptions)

Total time: 120 minutes 31 seconds
Build step 'Invoke Ant' marked build as failure
Archiving artifacts
Recording test results
Email was triggered for: Failure
Sending email for trigger: Failure



Mime
View raw message