lucene-dev mailing list archives

Site index · List index
Message view « Date » · « Thread »
Top « Date » · « Thread »
From Policeman Jenkins Server <jenk...@thetaphi.de>
Subject [JENKINS] Lucene-Solr-trunk-Linux (64bit/jdk1.7.0_60-ea-b01) - Build # 8755 - Still Failing!
Date Fri, 20 Dec 2013 04:52:25 GMT
Build: http://jenkins.thetaphi.de/job/Lucene-Solr-trunk-Linux/8755/
Java: 64bit/jdk1.7.0_60-ea-b01 -XX:+UseCompressedOops -XX:+UseSerialGC

6 tests failed.
REGRESSION:  org.apache.solr.analytics.expression.ExpressionTest.divideTest

Error Message:
Caught exception in getStatResult, xPath = /response/lst[@name='stats']/lst[@name='dr']/double[@name='sum']  raw data: <?xml version="1.0" encoding="UTF-8"?> <response>  <lst name="responseHeader">   <int name="status">0</int>   <int name="QTime">24</int> </lst> <result name="response" numFound="100" start="0"> </result> <lst name="stats">   <lst name="stats_fields"/> </lst> <lst name="stats">   <lst name="pr">     <long name="count">100</long>     <null name="mc"/>     <null name="mean"/>     <null name="su"/>     <null name="sum"/>     <null name="unique"/>   </lst>   <lst name="cnr">     <double name="c10">10.0</double>     <double name="c8">8.0</double>   </lst>   <lst name="csr">     <str name="cs1">this is the first</str>     <str name="cs2">this is the second</str>     <str name="cs3">this is the third</str>   </lst>   <lst name="dmr">     <str name="cma">+2MONTHS</str>     <str name="cme">+2YEARS</str>     <date name="dmma">1812-02-29T23:59:59Z</date>     <date name="dmme">1807-12-31T23:59:59Z</date>     <date name="max">1811-12-31T23:59:59Z</date>     <date name="median">1805-12-31T23:59:59Z</date>   </lst>   <lst name="ar">     <long name="count">100</long>     <null name="mcm"/>     <null name="mean"/>     <null name="median"/>     <null name="su"/>     <null name="sum"/>     <null name="unique"/>   </lst>   <lst name="cdr">     <date name="cd1">1800-12-31T23:59:59Z</date>     <date name="cd2">1804-06-30T23:59:59Z</date>     <str name="cs1">1800-12-31T23:59:59Z</str>     <str name="cs2">1804-06-30T23:59:59Z</str>   </lst>   <lst name="dr">     <long name="count">100</long>     <null name="mc"/>     <null name="mean"/>     <null name="su"/>     <null name="sum"/>     <null name="unique"/>   </lst>   <lst name="rr">     <str name="max">str9</str>     <str name="min">str0</str>     <str name="rmax">9rts</str>     <str name="rmin">0rts</str>   </lst>   <lst name="mr">     <long name="count">100</long>     <null name="mcm"/>     <null name="mean"/>     <null name="median"/>     <null name="su"/>     <null name="sum"/>     <null name="unique"/>   </lst>   <lst name="nr">     <double name="c">-100.0</double>     <long name="count">100</long>     <null name="s"/>     <null name="sum"/>   </lst>   <lst name="avr">     <double name="c">100.0</double>     <long name="count">100</long>     <null name="s"/>     <null name="sum"/>   </lst>   <lst name="cr">     <str name="ccmax">this is the secondstr9</str>     <str name="ccmin">this is the firststr0</str>     <str name="csmax">this is the second</str>     <str name="csmin">this is the first</str>     <str name="max">str9</str>     <str name="min">str0</str>   </lst> </lst> </response> 

Stack Trace:
java.lang.AssertionError: Caught exception in getStatResult, xPath = /response/lst[@name='stats']/lst[@name='dr']/double[@name='sum'] 
raw data: <?xml version="1.0" encoding="UTF-8"?>
<response>

<lst name="responseHeader">
  <int name="status">0</int>
  <int name="QTime">24</int>
</lst>
<result name="response" numFound="100" start="0">
</result>
<lst name="stats">
  <lst name="stats_fields"/>
</lst>
<lst name="stats">
  <lst name="pr">
    <long name="count">100</long>
    <null name="mc"/>
    <null name="mean"/>
    <null name="su"/>
    <null name="sum"/>
    <null name="unique"/>
  </lst>
  <lst name="cnr">
    <double name="c10">10.0</double>
    <double name="c8">8.0</double>
  </lst>
  <lst name="csr">
    <str name="cs1">this is the first</str>
    <str name="cs2">this is the second</str>
    <str name="cs3">this is the third</str>
  </lst>
  <lst name="dmr">
    <str name="cma">+2MONTHS</str>
    <str name="cme">+2YEARS</str>
    <date name="dmma">1812-02-29T23:59:59Z</date>
    <date name="dmme">1807-12-31T23:59:59Z</date>
    <date name="max">1811-12-31T23:59:59Z</date>
    <date name="median">1805-12-31T23:59:59Z</date>
  </lst>
  <lst name="ar">
    <long name="count">100</long>
    <null name="mcm"/>
    <null name="mean"/>
    <null name="median"/>
    <null name="su"/>
    <null name="sum"/>
    <null name="unique"/>
  </lst>
  <lst name="cdr">
    <date name="cd1">1800-12-31T23:59:59Z</date>
    <date name="cd2">1804-06-30T23:59:59Z</date>
    <str name="cs1">1800-12-31T23:59:59Z</str>
    <str name="cs2">1804-06-30T23:59:59Z</str>
  </lst>
  <lst name="dr">
    <long name="count">100</long>
    <null name="mc"/>
    <null name="mean"/>
    <null name="su"/>
    <null name="sum"/>
    <null name="unique"/>
  </lst>
  <lst name="rr">
    <str name="max">str9</str>
    <str name="min">str0</str>
    <str name="rmax">9rts</str>
    <str name="rmin">0rts</str>
  </lst>
  <lst name="mr">
    <long name="count">100</long>
    <null name="mcm"/>
    <null name="mean"/>
    <null name="median"/>
    <null name="su"/>
    <null name="sum"/>
    <null name="unique"/>
  </lst>
  <lst name="nr">
    <double name="c">-100.0</double>
    <long name="count">100</long>
    <null name="s"/>
    <null name="sum"/>
  </lst>
  <lst name="avr">
    <double name="c">100.0</double>
    <long name="count">100</long>
    <null name="s"/>
    <null name="sum"/>
  </lst>
  <lst name="cr">
    <str name="ccmax">this is the secondstr9</str>
    <str name="ccmin">this is the firststr0</str>
    <str name="csmax">this is the second</str>
    <str name="csmin">this is the first</str>
    <str name="max">str9</str>
    <str name="min">str0</str>
  </lst>
</lst>
</response>

	at __randomizedtesting.SeedInfo.seed([6C4A2E9E0C6867D7:3447C56828AA0501]:0)
	at org.junit.Assert.fail(Assert.java:93)
	at org.apache.solr.analytics.AbstractAnalyticsStatsTest.getStatResult(AbstractAnalyticsStatsTest.java:113)
	at org.apache.solr.analytics.expression.ExpressionTest.divideTest(ExpressionTest.java:106)
	at sun.reflect.NativeMethodAccessorImpl.invoke0(Native Method)
	at sun.reflect.NativeMethodAccessorImpl.invoke(NativeMethodAccessorImpl.java:57)
	at sun.reflect.DelegatingMethodAccessorImpl.invoke(DelegatingMethodAccessorImpl.java:43)
	at java.lang.reflect.Method.invoke(Method.java:606)
	at com.carrotsearch.randomizedtesting.RandomizedRunner.invoke(RandomizedRunner.java:1559)
	at com.carrotsearch.randomizedtesting.RandomizedRunner.access$600(RandomizedRunner.java:79)
	at com.carrotsearch.randomizedtesting.RandomizedRunner$6.evaluate(RandomizedRunner.java:737)
	at com.carrotsearch.randomizedtesting.RandomizedRunner$7.evaluate(RandomizedRunner.java:773)
	at com.carrotsearch.randomizedtesting.RandomizedRunner$8.evaluate(RandomizedRunner.java:787)
	at com.carrotsearch.randomizedtesting.rules.SystemPropertiesRestoreRule$1.evaluate(SystemPropertiesRestoreRule.java:53)
	at org.apache.lucene.util.TestRuleSetupTeardownChained$1.evaluate(TestRuleSetupTeardownChained.java:50)
	at org.apache.lucene.util.TestRuleFieldCacheSanity$1.evaluate(TestRuleFieldCacheSanity.java:51)
	at org.apache.lucene.util.AbstractBeforeAfterRule$1.evaluate(AbstractBeforeAfterRule.java:46)
	at com.carrotsearch.randomizedtesting.rules.SystemPropertiesInvariantRule$1.evaluate(SystemPropertiesInvariantRule.java:55)
	at org.apache.lucene.util.TestRuleThreadAndTestName$1.evaluate(TestRuleThreadAndTestName.java:49)
	at org.apache.lucene.util.TestRuleIgnoreAfterMaxFailures$1.evaluate(TestRuleIgnoreAfterMaxFailures.java:70)
	at org.apache.lucene.util.TestRuleMarkFailure$1.evaluate(TestRuleMarkFailure.java:48)
	at com.carrotsearch.randomizedtesting.rules.StatementAdapter.evaluate(StatementAdapter.java:36)
	at com.carrotsearch.randomizedtesting.ThreadLeakControl$StatementRunner.run(ThreadLeakControl.java:358)
	at com.carrotsearch.randomizedtesting.ThreadLeakControl.forkTimeoutingTask(ThreadLeakControl.java:782)
	at com.carrotsearch.randomizedtesting.ThreadLeakControl$3.evaluate(ThreadLeakControl.java:442)
	at com.carrotsearch.randomizedtesting.RandomizedRunner.runSingleTest(RandomizedRunner.java:746)
	at com.carrotsearch.randomizedtesting.RandomizedRunner$3.evaluate(RandomizedRunner.java:648)
	at com.carrotsearch.randomizedtesting.RandomizedRunner$4.evaluate(RandomizedRunner.java:682)
	at com.carrotsearch.randomizedtesting.RandomizedRunner$5.evaluate(RandomizedRunner.java:693)
	at com.carrotsearch.randomizedtesting.rules.StatementAdapter.evaluate(StatementAdapter.java:36)
	at com.carrotsearch.randomizedtesting.rules.SystemPropertiesRestoreRule$1.evaluate(SystemPropertiesRestoreRule.java:53)
	at org.apache.lucene.util.AbstractBeforeAfterRule$1.evaluate(AbstractBeforeAfterRule.java:46)
	at org.apache.lucene.util.TestRuleStoreClassName$1.evaluate(TestRuleStoreClassName.java:42)
	at com.carrotsearch.randomizedtesting.rules.SystemPropertiesInvariantRule$1.evaluate(SystemPropertiesInvariantRule.java:55)
	at com.carrotsearch.randomizedtesting.rules.NoShadowingOrOverridesOnMethodsRule$1.evaluate(NoShadowingOrOverridesOnMethodsRule.java:39)
	at com.carrotsearch.randomizedtesting.rules.NoShadowingOrOverridesOnMethodsRule$1.evaluate(NoShadowingOrOverridesOnMethodsRule.java:39)
	at com.carrotsearch.randomizedtesting.rules.StatementAdapter.evaluate(StatementAdapter.java:36)
	at org.apache.lucene.util.TestRuleAssertionsRequired$1.evaluate(TestRuleAssertionsRequired.java:43)
	at org.apache.lucene.util.TestRuleMarkFailure$1.evaluate(TestRuleMarkFailure.java:48)
	at org.apache.lucene.util.TestRuleIgnoreAfterMaxFailures$1.evaluate(TestRuleIgnoreAfterMaxFailures.java:70)
	at org.apache.lucene.util.TestRuleIgnoreTestSuites$1.evaluate(TestRuleIgnoreTestSuites.java:55)
	at com.carrotsearch.randomizedtesting.rules.StatementAdapter.evaluate(StatementAdapter.java:36)
	at com.carrotsearch.randomizedtesting.ThreadLeakControl$StatementRunner.run(ThreadLeakControl.java:358)
	at java.lang.Thread.run(Thread.java:744)


FAILED:  org.apache.solr.analytics.expression.ExpressionTest.negateTest

Error Message:
Caught exception in getStatResult, xPath = /response/lst[@name='stats']/lst[@name='nr']/double[@name='sum']  raw data: <?xml version="1.0" encoding="UTF-8"?> <response>  <lst name="responseHeader">   <int name="status">0</int>   <int name="QTime">24</int> </lst> <result name="response" numFound="100" start="0"> </result> <lst name="stats">   <lst name="stats_fields"/> </lst> <lst name="stats">   <lst name="pr">     <long name="count">100</long>     <null name="mc"/>     <null name="mean"/>     <null name="su"/>     <null name="sum"/>     <null name="unique"/>   </lst>   <lst name="cnr">     <double name="c10">10.0</double>     <double name="c8">8.0</double>   </lst>   <lst name="csr">     <str name="cs1">this is the first</str>     <str name="cs2">this is the second</str>     <str name="cs3">this is the third</str>   </lst>   <lst name="dmr">     <str name="cma">+2MONTHS</str>     <str name="cme">+2YEARS</str>     <date name="dmma">1812-02-29T23:59:59Z</date>     <date name="dmme">1807-12-31T23:59:59Z</date>     <date name="max">1811-12-31T23:59:59Z</date>     <date name="median">1805-12-31T23:59:59Z</date>   </lst>   <lst name="ar">     <long name="count">100</long>     <null name="mcm"/>     <null name="mean"/>     <null name="median"/>     <null name="su"/>     <null name="sum"/>     <null name="unique"/>   </lst>   <lst name="cdr">     <date name="cd1">1800-12-31T23:59:59Z</date>     <date name="cd2">1804-06-30T23:59:59Z</date>     <str name="cs1">1800-12-31T23:59:59Z</str>     <str name="cs2">1804-06-30T23:59:59Z</str>   </lst>   <lst name="dr">     <long name="count">100</long>     <null name="mc"/>     <null name="mean"/>     <null name="su"/>     <null name="sum"/>     <null name="unique"/>   </lst>   <lst name="rr">     <str name="max">str9</str>     <str name="min">str0</str>     <str name="rmax">9rts</str>     <str name="rmin">0rts</str>   </lst>   <lst name="mr">     <long name="count">100</long>     <null name="mcm"/>     <null name="mean"/>     <null name="median"/>     <null name="su"/>     <null name="sum"/>     <null name="unique"/>   </lst>   <lst name="nr">     <double name="c">-100.0</double>     <long name="count">100</long>     <null name="s"/>     <null name="sum"/>   </lst>   <lst name="avr">     <double name="c">100.0</double>     <long name="count">100</long>     <null name="s"/>     <null name="sum"/>   </lst>   <lst name="cr">     <str name="ccmax">this is the secondstr9</str>     <str name="ccmin">this is the firststr0</str>     <str name="csmax">this is the second</str>     <str name="csmin">this is the first</str>     <str name="max">str9</str>     <str name="min">str0</str>   </lst> </lst> </response> 

Stack Trace:
java.lang.AssertionError: Caught exception in getStatResult, xPath = /response/lst[@name='stats']/lst[@name='nr']/double[@name='sum'] 
raw data: <?xml version="1.0" encoding="UTF-8"?>
<response>

<lst name="responseHeader">
  <int name="status">0</int>
  <int name="QTime">24</int>
</lst>
<result name="response" numFound="100" start="0">
</result>
<lst name="stats">
  <lst name="stats_fields"/>
</lst>
<lst name="stats">
  <lst name="pr">
    <long name="count">100</long>
    <null name="mc"/>
    <null name="mean"/>
    <null name="su"/>
    <null name="sum"/>
    <null name="unique"/>
  </lst>
  <lst name="cnr">
    <double name="c10">10.0</double>
    <double name="c8">8.0</double>
  </lst>
  <lst name="csr">
    <str name="cs1">this is the first</str>
    <str name="cs2">this is the second</str>
    <str name="cs3">this is the third</str>
  </lst>
  <lst name="dmr">
    <str name="cma">+2MONTHS</str>
    <str name="cme">+2YEARS</str>
    <date name="dmma">1812-02-29T23:59:59Z</date>
    <date name="dmme">1807-12-31T23:59:59Z</date>
    <date name="max">1811-12-31T23:59:59Z</date>
    <date name="median">1805-12-31T23:59:59Z</date>
  </lst>
  <lst name="ar">
    <long name="count">100</long>
    <null name="mcm"/>
    <null name="mean"/>
    <null name="median"/>
    <null name="su"/>
    <null name="sum"/>
    <null name="unique"/>
  </lst>
  <lst name="cdr">
    <date name="cd1">1800-12-31T23:59:59Z</date>
    <date name="cd2">1804-06-30T23:59:59Z</date>
    <str name="cs1">1800-12-31T23:59:59Z</str>
    <str name="cs2">1804-06-30T23:59:59Z</str>
  </lst>
  <lst name="dr">
    <long name="count">100</long>
    <null name="mc"/>
    <null name="mean"/>
    <null name="su"/>
    <null name="sum"/>
    <null name="unique"/>
  </lst>
  <lst name="rr">
    <str name="max">str9</str>
    <str name="min">str0</str>
    <str name="rmax">9rts</str>
    <str name="rmin">0rts</str>
  </lst>
  <lst name="mr">
    <long name="count">100</long>
    <null name="mcm"/>
    <null name="mean"/>
    <null name="median"/>
    <null name="su"/>
    <null name="sum"/>
    <null name="unique"/>
  </lst>
  <lst name="nr">
    <double name="c">-100.0</double>
    <long name="count">100</long>
    <null name="s"/>
    <null name="sum"/>
  </lst>
  <lst name="avr">
    <double name="c">100.0</double>
    <long name="count">100</long>
    <null name="s"/>
    <null name="sum"/>
  </lst>
  <lst name="cr">
    <str name="ccmax">this is the secondstr9</str>
    <str name="ccmin">this is the firststr0</str>
    <str name="csmax">this is the second</str>
    <str name="csmin">this is the first</str>
    <str name="max">str9</str>
    <str name="min">str0</str>
  </lst>
</lst>
</response>

	at __randomizedtesting.SeedInfo.seed([6C4A2E9E0C6867D7:6442463BA8453767]:0)
	at org.junit.Assert.fail(Assert.java:93)
	at org.apache.solr.analytics.AbstractAnalyticsStatsTest.getStatResult(AbstractAnalyticsStatsTest.java:113)
	at org.apache.solr.analytics.expression.ExpressionTest.negateTest(ExpressionTest.java:132)
	at sun.reflect.NativeMethodAccessorImpl.invoke0(Native Method)
	at sun.reflect.NativeMethodAccessorImpl.invoke(NativeMethodAccessorImpl.java:57)
	at sun.reflect.DelegatingMethodAccessorImpl.invoke(DelegatingMethodAccessorImpl.java:43)
	at java.lang.reflect.Method.invoke(Method.java:606)
	at com.carrotsearch.randomizedtesting.RandomizedRunner.invoke(RandomizedRunner.java:1559)
	at com.carrotsearch.randomizedtesting.RandomizedRunner.access$600(RandomizedRunner.java:79)
	at com.carrotsearch.randomizedtesting.RandomizedRunner$6.evaluate(RandomizedRunner.java:737)
	at com.carrotsearch.randomizedtesting.RandomizedRunner$7.evaluate(RandomizedRunner.java:773)
	at com.carrotsearch.randomizedtesting.RandomizedRunner$8.evaluate(RandomizedRunner.java:787)
	at com.carrotsearch.randomizedtesting.rules.SystemPropertiesRestoreRule$1.evaluate(SystemPropertiesRestoreRule.java:53)
	at org.apache.lucene.util.TestRuleSetupTeardownChained$1.evaluate(TestRuleSetupTeardownChained.java:50)
	at org.apache.lucene.util.TestRuleFieldCacheSanity$1.evaluate(TestRuleFieldCacheSanity.java:51)
	at org.apache.lucene.util.AbstractBeforeAfterRule$1.evaluate(AbstractBeforeAfterRule.java:46)
	at com.carrotsearch.randomizedtesting.rules.SystemPropertiesInvariantRule$1.evaluate(SystemPropertiesInvariantRule.java:55)
	at org.apache.lucene.util.TestRuleThreadAndTestName$1.evaluate(TestRuleThreadAndTestName.java:49)
	at org.apache.lucene.util.TestRuleIgnoreAfterMaxFailures$1.evaluate(TestRuleIgnoreAfterMaxFailures.java:70)
	at org.apache.lucene.util.TestRuleMarkFailure$1.evaluate(TestRuleMarkFailure.java:48)
	at com.carrotsearch.randomizedtesting.rules.StatementAdapter.evaluate(StatementAdapter.java:36)
	at com.carrotsearch.randomizedtesting.ThreadLeakControl$StatementRunner.run(ThreadLeakControl.java:358)
	at com.carrotsearch.randomizedtesting.ThreadLeakControl.forkTimeoutingTask(ThreadLeakControl.java:782)
	at com.carrotsearch.randomizedtesting.ThreadLeakControl$3.evaluate(ThreadLeakControl.java:442)
	at com.carrotsearch.randomizedtesting.RandomizedRunner.runSingleTest(RandomizedRunner.java:746)
	at com.carrotsearch.randomizedtesting.RandomizedRunner$3.evaluate(RandomizedRunner.java:648)
	at com.carrotsearch.randomizedtesting.RandomizedRunner$4.evaluate(RandomizedRunner.java:682)
	at com.carrotsearch.randomizedtesting.RandomizedRunner$5.evaluate(RandomizedRunner.java:693)
	at com.carrotsearch.randomizedtesting.rules.StatementAdapter.evaluate(StatementAdapter.java:36)
	at com.carrotsearch.randomizedtesting.rules.SystemPropertiesRestoreRule$1.evaluate(SystemPropertiesRestoreRule.java:53)
	at org.apache.lucene.util.AbstractBeforeAfterRule$1.evaluate(AbstractBeforeAfterRule.java:46)
	at org.apache.lucene.util.TestRuleStoreClassName$1.evaluate(TestRuleStoreClassName.java:42)
	at com.carrotsearch.randomizedtesting.rules.SystemPropertiesInvariantRule$1.evaluate(SystemPropertiesInvariantRule.java:55)
	at com.carrotsearch.randomizedtesting.rules.NoShadowingOrOverridesOnMethodsRule$1.evaluate(NoShadowingOrOverridesOnMethodsRule.java:39)
	at com.carrotsearch.randomizedtesting.rules.NoShadowingOrOverridesOnMethodsRule$1.evaluate(NoShadowingOrOverridesOnMethodsRule.java:39)
	at com.carrotsearch.randomizedtesting.rules.StatementAdapter.evaluate(StatementAdapter.java:36)
	at org.apache.lucene.util.TestRuleAssertionsRequired$1.evaluate(TestRuleAssertionsRequired.java:43)
	at org.apache.lucene.util.TestRuleMarkFailure$1.evaluate(TestRuleMarkFailure.java:48)
	at org.apache.lucene.util.TestRuleIgnoreAfterMaxFailures$1.evaluate(TestRuleIgnoreAfterMaxFailures.java:70)
	at org.apache.lucene.util.TestRuleIgnoreTestSuites$1.evaluate(TestRuleIgnoreTestSuites.java:55)
	at com.carrotsearch.randomizedtesting.rules.StatementAdapter.evaluate(StatementAdapter.java:36)
	at com.carrotsearch.randomizedtesting.ThreadLeakControl$StatementRunner.run(ThreadLeakControl.java:358)
	at java.lang.Thread.run(Thread.java:744)


FAILED:  org.apache.solr.analytics.expression.ExpressionTest.absoluteValueTest

Error Message:
Caught exception in getStatResult, xPath = /response/lst[@name='stats']/lst[@name='avr']/double[@name='sum']  raw data: <?xml version="1.0" encoding="UTF-8"?> <response>  <lst name="responseHeader">   <int name="status">0</int>   <int name="QTime">24</int> </lst> <result name="response" numFound="100" start="0"> </result> <lst name="stats">   <lst name="stats_fields"/> </lst> <lst name="stats">   <lst name="pr">     <long name="count">100</long>     <null name="mc"/>     <null name="mean"/>     <null name="su"/>     <null name="sum"/>     <null name="unique"/>   </lst>   <lst name="cnr">     <double name="c10">10.0</double>     <double name="c8">8.0</double>   </lst>   <lst name="csr">     <str name="cs1">this is the first</str>     <str name="cs2">this is the second</str>     <str name="cs3">this is the third</str>   </lst>   <lst name="dmr">     <str name="cma">+2MONTHS</str>     <str name="cme">+2YEARS</str>     <date name="dmma">1812-02-29T23:59:59Z</date>     <date name="dmme">1807-12-31T23:59:59Z</date>     <date name="max">1811-12-31T23:59:59Z</date>     <date name="median">1805-12-31T23:59:59Z</date>   </lst>   <lst name="ar">     <long name="count">100</long>     <null name="mcm"/>     <null name="mean"/>     <null name="median"/>     <null name="su"/>     <null name="sum"/>     <null name="unique"/>   </lst>   <lst name="cdr">     <date name="cd1">1800-12-31T23:59:59Z</date>     <date name="cd2">1804-06-30T23:59:59Z</date>     <str name="cs1">1800-12-31T23:59:59Z</str>     <str name="cs2">1804-06-30T23:59:59Z</str>   </lst>   <lst name="dr">     <long name="count">100</long>     <null name="mc"/>     <null name="mean"/>     <null name="su"/>     <null name="sum"/>     <null name="unique"/>   </lst>   <lst name="rr">     <str name="max">str9</str>     <str name="min">str0</str>     <str name="rmax">9rts</str>     <str name="rmin">0rts</str>   </lst>   <lst name="mr">     <long name="count">100</long>     <null name="mcm"/>     <null name="mean"/>     <null name="median"/>     <null name="su"/>     <null name="sum"/>     <null name="unique"/>   </lst>   <lst name="nr">     <double name="c">-100.0</double>     <long name="count">100</long>     <null name="s"/>     <null name="sum"/>   </lst>   <lst name="avr">     <double name="c">100.0</double>     <long name="count">100</long>     <null name="s"/>     <null name="sum"/>   </lst>   <lst name="cr">     <str name="ccmax">this is the secondstr9</str>     <str name="ccmin">this is the firststr0</str>     <str name="csmax">this is the second</str>     <str name="csmin">this is the first</str>     <str name="max">str9</str>     <str name="min">str0</str>   </lst> </lst> </response> 

Stack Trace:
java.lang.AssertionError: Caught exception in getStatResult, xPath = /response/lst[@name='stats']/lst[@name='avr']/double[@name='sum'] 
raw data: <?xml version="1.0" encoding="UTF-8"?>
<response>

<lst name="responseHeader">
  <int name="status">0</int>
  <int name="QTime">24</int>
</lst>
<result name="response" numFound="100" start="0">
</result>
<lst name="stats">
  <lst name="stats_fields"/>
</lst>
<lst name="stats">
  <lst name="pr">
    <long name="count">100</long>
    <null name="mc"/>
    <null name="mean"/>
    <null name="su"/>
    <null name="sum"/>
    <null name="unique"/>
  </lst>
  <lst name="cnr">
    <double name="c10">10.0</double>
    <double name="c8">8.0</double>
  </lst>
  <lst name="csr">
    <str name="cs1">this is the first</str>
    <str name="cs2">this is the second</str>
    <str name="cs3">this is the third</str>
  </lst>
  <lst name="dmr">
    <str name="cma">+2MONTHS</str>
    <str name="cme">+2YEARS</str>
    <date name="dmma">1812-02-29T23:59:59Z</date>
    <date name="dmme">1807-12-31T23:59:59Z</date>
    <date name="max">1811-12-31T23:59:59Z</date>
    <date name="median">1805-12-31T23:59:59Z</date>
  </lst>
  <lst name="ar">
    <long name="count">100</long>
    <null name="mcm"/>
    <null name="mean"/>
    <null name="median"/>
    <null name="su"/>
    <null name="sum"/>
    <null name="unique"/>
  </lst>
  <lst name="cdr">
    <date name="cd1">1800-12-31T23:59:59Z</date>
    <date name="cd2">1804-06-30T23:59:59Z</date>
    <str name="cs1">1800-12-31T23:59:59Z</str>
    <str name="cs2">1804-06-30T23:59:59Z</str>
  </lst>
  <lst name="dr">
    <long name="count">100</long>
    <null name="mc"/>
    <null name="mean"/>
    <null name="su"/>
    <null name="sum"/>
    <null name="unique"/>
  </lst>
  <lst name="rr">
    <str name="max">str9</str>
    <str name="min">str0</str>
    <str name="rmax">9rts</str>
    <str name="rmin">0rts</str>
  </lst>
  <lst name="mr">
    <long name="count">100</long>
    <null name="mcm"/>
    <null name="mean"/>
    <null name="median"/>
    <null name="su"/>
    <null name="sum"/>
    <null name="unique"/>
  </lst>
  <lst name="nr">
    <double name="c">-100.0</double>
    <long name="count">100</long>
    <null name="s"/>
    <null name="sum"/>
  </lst>
  <lst name="avr">
    <double name="c">100.0</double>
    <long name="count">100</long>
    <null name="s"/>
    <null name="sum"/>
  </lst>
  <lst name="cr">
    <str name="ccmax">this is the secondstr9</str>
    <str name="ccmin">this is the firststr0</str>
    <str name="csmax">this is the second</str>
    <str name="csmin">this is the first</str>
    <str name="max">str9</str>
    <str name="min">str0</str>
  </lst>
</lst>
</response>

	at __randomizedtesting.SeedInfo.seed([6C4A2E9E0C6867D7:4DE60E8BC1F53FB1]:0)
	at org.junit.Assert.fail(Assert.java:93)
	at org.apache.solr.analytics.AbstractAnalyticsStatsTest.getStatResult(AbstractAnalyticsStatsTest.java:113)
	at org.apache.solr.analytics.expression.ExpressionTest.absoluteValueTest(ExpressionTest.java:143)
	at sun.reflect.NativeMethodAccessorImpl.invoke0(Native Method)
	at sun.reflect.NativeMethodAccessorImpl.invoke(NativeMethodAccessorImpl.java:57)
	at sun.reflect.DelegatingMethodAccessorImpl.invoke(DelegatingMethodAccessorImpl.java:43)
	at java.lang.reflect.Method.invoke(Method.java:606)
	at com.carrotsearch.randomizedtesting.RandomizedRunner.invoke(RandomizedRunner.java:1559)
	at com.carrotsearch.randomizedtesting.RandomizedRunner.access$600(RandomizedRunner.java:79)
	at com.carrotsearch.randomizedtesting.RandomizedRunner$6.evaluate(RandomizedRunner.java:737)
	at com.carrotsearch.randomizedtesting.RandomizedRunner$7.evaluate(RandomizedRunner.java:773)
	at com.carrotsearch.randomizedtesting.RandomizedRunner$8.evaluate(RandomizedRunner.java:787)
	at com.carrotsearch.randomizedtesting.rules.SystemPropertiesRestoreRule$1.evaluate(SystemPropertiesRestoreRule.java:53)
	at org.apache.lucene.util.TestRuleSetupTeardownChained$1.evaluate(TestRuleSetupTeardownChained.java:50)
	at org.apache.lucene.util.TestRuleFieldCacheSanity$1.evaluate(TestRuleFieldCacheSanity.java:51)
	at org.apache.lucene.util.AbstractBeforeAfterRule$1.evaluate(AbstractBeforeAfterRule.java:46)
	at com.carrotsearch.randomizedtesting.rules.SystemPropertiesInvariantRule$1.evaluate(SystemPropertiesInvariantRule.java:55)
	at org.apache.lucene.util.TestRuleThreadAndTestName$1.evaluate(TestRuleThreadAndTestName.java:49)
	at org.apache.lucene.util.TestRuleIgnoreAfterMaxFailures$1.evaluate(TestRuleIgnoreAfterMaxFailures.java:70)
	at org.apache.lucene.util.TestRuleMarkFailure$1.evaluate(TestRuleMarkFailure.java:48)
	at com.carrotsearch.randomizedtesting.rules.StatementAdapter.evaluate(StatementAdapter.java:36)
	at com.carrotsearch.randomizedtesting.ThreadLeakControl$StatementRunner.run(ThreadLeakControl.java:358)
	at com.carrotsearch.randomizedtesting.ThreadLeakControl.forkTimeoutingTask(ThreadLeakControl.java:782)
	at com.carrotsearch.randomizedtesting.ThreadLeakControl$3.evaluate(ThreadLeakControl.java:442)
	at com.carrotsearch.randomizedtesting.RandomizedRunner.runSingleTest(RandomizedRunner.java:746)
	at com.carrotsearch.randomizedtesting.RandomizedRunner$3.evaluate(RandomizedRunner.java:648)
	at com.carrotsearch.randomizedtesting.RandomizedRunner$4.evaluate(RandomizedRunner.java:682)
	at com.carrotsearch.randomizedtesting.RandomizedRunner$5.evaluate(RandomizedRunner.java:693)
	at com.carrotsearch.randomizedtesting.rules.StatementAdapter.evaluate(StatementAdapter.java:36)
	at com.carrotsearch.randomizedtesting.rules.SystemPropertiesRestoreRule$1.evaluate(SystemPropertiesRestoreRule.java:53)
	at org.apache.lucene.util.AbstractBeforeAfterRule$1.evaluate(AbstractBeforeAfterRule.java:46)
	at org.apache.lucene.util.TestRuleStoreClassName$1.evaluate(TestRuleStoreClassName.java:42)
	at com.carrotsearch.randomizedtesting.rules.SystemPropertiesInvariantRule$1.evaluate(SystemPropertiesInvariantRule.java:55)
	at com.carrotsearch.randomizedtesting.rules.NoShadowingOrOverridesOnMethodsRule$1.evaluate(NoShadowingOrOverridesOnMethodsRule.java:39)
	at com.carrotsearch.randomizedtesting.rules.NoShadowingOrOverridesOnMethodsRule$1.evaluate(NoShadowingOrOverridesOnMethodsRule.java:39)
	at com.carrotsearch.randomizedtesting.rules.StatementAdapter.evaluate(StatementAdapter.java:36)
	at org.apache.lucene.util.TestRuleAssertionsRequired$1.evaluate(TestRuleAssertionsRequired.java:43)
	at org.apache.lucene.util.TestRuleMarkFailure$1.evaluate(TestRuleMarkFailure.java:48)
	at org.apache.lucene.util.TestRuleIgnoreAfterMaxFailures$1.evaluate(TestRuleIgnoreAfterMaxFailures.java:70)
	at org.apache.lucene.util.TestRuleIgnoreTestSuites$1.evaluate(TestRuleIgnoreTestSuites.java:55)
	at com.carrotsearch.randomizedtesting.rules.StatementAdapter.evaluate(StatementAdapter.java:36)
	at com.carrotsearch.randomizedtesting.ThreadLeakControl$StatementRunner.run(ThreadLeakControl.java:358)
	at java.lang.Thread.run(Thread.java:744)


FAILED:  org.apache.solr.analytics.expression.ExpressionTest.powerTest

Error Message:
Caught exception in getStatResult, xPath = /response/lst[@name='stats']/lst[@name='pr']/double[@name='sum']  raw data: <?xml version="1.0" encoding="UTF-8"?> <response>  <lst name="responseHeader">   <int name="status">0</int>   <int name="QTime">24</int> </lst> <result name="response" numFound="100" start="0"> </result> <lst name="stats">   <lst name="stats_fields"/> </lst> <lst name="stats">   <lst name="pr">     <long name="count">100</long>     <null name="mc"/>     <null name="mean"/>     <null name="su"/>     <null name="sum"/>     <null name="unique"/>   </lst>   <lst name="cnr">     <double name="c10">10.0</double>     <double name="c8">8.0</double>   </lst>   <lst name="csr">     <str name="cs1">this is the first</str>     <str name="cs2">this is the second</str>     <str name="cs3">this is the third</str>   </lst>   <lst name="dmr">     <str name="cma">+2MONTHS</str>     <str name="cme">+2YEARS</str>     <date name="dmma">1812-02-29T23:59:59Z</date>     <date name="dmme">1807-12-31T23:59:59Z</date>     <date name="max">1811-12-31T23:59:59Z</date>     <date name="median">1805-12-31T23:59:59Z</date>   </lst>   <lst name="ar">     <long name="count">100</long>     <null name="mcm"/>     <null name="mean"/>     <null name="median"/>     <null name="su"/>     <null name="sum"/>     <null name="unique"/>   </lst>   <lst name="cdr">     <date name="cd1">1800-12-31T23:59:59Z</date>     <date name="cd2">1804-06-30T23:59:59Z</date>     <str name="cs1">1800-12-31T23:59:59Z</str>     <str name="cs2">1804-06-30T23:59:59Z</str>   </lst>   <lst name="dr">     <long name="count">100</long>     <null name="mc"/>     <null name="mean"/>     <null name="su"/>     <null name="sum"/>     <null name="unique"/>   </lst>   <lst name="rr">     <str name="max">str9</str>     <str name="min">str0</str>     <str name="rmax">9rts</str>     <str name="rmin">0rts</str>   </lst>   <lst name="mr">     <long name="count">100</long>     <null name="mcm"/>     <null name="mean"/>     <null name="median"/>     <null name="su"/>     <null name="sum"/>     <null name="unique"/>   </lst>   <lst name="nr">     <double name="c">-100.0</double>     <long name="count">100</long>     <null name="s"/>     <null name="sum"/>   </lst>   <lst name="avr">     <double name="c">100.0</double>     <long name="count">100</long>     <null name="s"/>     <null name="sum"/>   </lst>   <lst name="cr">     <str name="ccmax">this is the secondstr9</str>     <str name="ccmin">this is the firststr0</str>     <str name="csmax">this is the second</str>     <str name="csmin">this is the first</str>     <str name="max">str9</str>     <str name="min">str0</str>   </lst> </lst> </response> 

Stack Trace:
java.lang.AssertionError: Caught exception in getStatResult, xPath = /response/lst[@name='stats']/lst[@name='pr']/double[@name='sum'] 
raw data: <?xml version="1.0" encoding="UTF-8"?>
<response>

<lst name="responseHeader">
  <int name="status">0</int>
  <int name="QTime">24</int>
</lst>
<result name="response" numFound="100" start="0">
</result>
<lst name="stats">
  <lst name="stats_fields"/>
</lst>
<lst name="stats">
  <lst name="pr">
    <long name="count">100</long>
    <null name="mc"/>
    <null name="mean"/>
    <null name="su"/>
    <null name="sum"/>
    <null name="unique"/>
  </lst>
  <lst name="cnr">
    <double name="c10">10.0</double>
    <double name="c8">8.0</double>
  </lst>
  <lst name="csr">
    <str name="cs1">this is the first</str>
    <str name="cs2">this is the second</str>
    <str name="cs3">this is the third</str>
  </lst>
  <lst name="dmr">
    <str name="cma">+2MONTHS</str>
    <str name="cme">+2YEARS</str>
    <date name="dmma">1812-02-29T23:59:59Z</date>
    <date name="dmme">1807-12-31T23:59:59Z</date>
    <date name="max">1811-12-31T23:59:59Z</date>
    <date name="median">1805-12-31T23:59:59Z</date>
  </lst>
  <lst name="ar">
    <long name="count">100</long>
    <null name="mcm"/>
    <null name="mean"/>
    <null name="median"/>
    <null name="su"/>
    <null name="sum"/>
    <null name="unique"/>
  </lst>
  <lst name="cdr">
    <date name="cd1">1800-12-31T23:59:59Z</date>
    <date name="cd2">1804-06-30T23:59:59Z</date>
    <str name="cs1">1800-12-31T23:59:59Z</str>
    <str name="cs2">1804-06-30T23:59:59Z</str>
  </lst>
  <lst name="dr">
    <long name="count">100</long>
    <null name="mc"/>
    <null name="mean"/>
    <null name="su"/>
    <null name="sum"/>
    <null name="unique"/>
  </lst>
  <lst name="rr">
    <str name="max">str9</str>
    <str name="min">str0</str>
    <str name="rmax">9rts</str>
    <str name="rmin">0rts</str>
  </lst>
  <lst name="mr">
    <long name="count">100</long>
    <null name="mcm"/>
    <null name="mean"/>
    <null name="median"/>
    <null name="su"/>
    <null name="sum"/>
    <null name="unique"/>
  </lst>
  <lst name="nr">
    <double name="c">-100.0</double>
    <long name="count">100</long>
    <null name="s"/>
    <null name="sum"/>
  </lst>
  <lst name="avr">
    <double name="c">100.0</double>
    <long name="count">100</long>
    <null name="s"/>
    <null name="sum"/>
  </lst>
  <lst name="cr">
    <str name="ccmax">this is the secondstr9</str>
    <str name="ccmin">this is the firststr0</str>
    <str name="csmax">this is the second</str>
    <str name="csmin">this is the first</str>
    <str name="max">str9</str>
    <str name="min">str0</str>
  </lst>
</lst>
</response>

	at __randomizedtesting.SeedInfo.seed([6C4A2E9E0C6867D7:2F8999DE47F3906]:0)
	at org.junit.Assert.fail(Assert.java:93)
	at org.apache.solr.analytics.AbstractAnalyticsStatsTest.getStatResult(AbstractAnalyticsStatsTest.java:113)
	at org.apache.solr.analytics.expression.ExpressionTest.powerTest(ExpressionTest.java:119)
	at sun.reflect.NativeMethodAccessorImpl.invoke0(Native Method)
	at sun.reflect.NativeMethodAccessorImpl.invoke(NativeMethodAccessorImpl.java:57)
	at sun.reflect.DelegatingMethodAccessorImpl.invoke(DelegatingMethodAccessorImpl.java:43)
	at java.lang.reflect.Method.invoke(Method.java:606)
	at com.carrotsearch.randomizedtesting.RandomizedRunner.invoke(RandomizedRunner.java:1559)
	at com.carrotsearch.randomizedtesting.RandomizedRunner.access$600(RandomizedRunner.java:79)
	at com.carrotsearch.randomizedtesting.RandomizedRunner$6.evaluate(RandomizedRunner.java:737)
	at com.carrotsearch.randomizedtesting.RandomizedRunner$7.evaluate(RandomizedRunner.java:773)
	at com.carrotsearch.randomizedtesting.RandomizedRunner$8.evaluate(RandomizedRunner.java:787)
	at com.carrotsearch.randomizedtesting.rules.SystemPropertiesRestoreRule$1.evaluate(SystemPropertiesRestoreRule.java:53)
	at org.apache.lucene.util.TestRuleSetupTeardownChained$1.evaluate(TestRuleSetupTeardownChained.java:50)
	at org.apache.lucene.util.TestRuleFieldCacheSanity$1.evaluate(TestRuleFieldCacheSanity.java:51)
	at org.apache.lucene.util.AbstractBeforeAfterRule$1.evaluate(AbstractBeforeAfterRule.java:46)
	at com.carrotsearch.randomizedtesting.rules.SystemPropertiesInvariantRule$1.evaluate(SystemPropertiesInvariantRule.java:55)
	at org.apache.lucene.util.TestRuleThreadAndTestName$1.evaluate(TestRuleThreadAndTestName.java:49)
	at org.apache.lucene.util.TestRuleIgnoreAfterMaxFailures$1.evaluate(TestRuleIgnoreAfterMaxFailures.java:70)
	at org.apache.lucene.util.TestRuleMarkFailure$1.evaluate(TestRuleMarkFailure.java:48)
	at com.carrotsearch.randomizedtesting.rules.StatementAdapter.evaluate(StatementAdapter.java:36)
	at com.carrotsearch.randomizedtesting.ThreadLeakControl$StatementRunner.run(ThreadLeakControl.java:358)
	at com.carrotsearch.randomizedtesting.ThreadLeakControl.forkTimeoutingTask(ThreadLeakControl.java:782)
	at com.carrotsearch.randomizedtesting.ThreadLeakControl$3.evaluate(ThreadLeakControl.java:442)
	at com.carrotsearch.randomizedtesting.RandomizedRunner.runSingleTest(RandomizedRunner.java:746)
	at com.carrotsearch.randomizedtesting.RandomizedRunner$3.evaluate(RandomizedRunner.java:648)
	at com.carrotsearch.randomizedtesting.RandomizedRunner$4.evaluate(RandomizedRunner.java:682)
	at com.carrotsearch.randomizedtesting.RandomizedRunner$5.evaluate(RandomizedRunner.java:693)
	at com.carrotsearch.randomizedtesting.rules.StatementAdapter.evaluate(StatementAdapter.java:36)
	at com.carrotsearch.randomizedtesting.rules.SystemPropertiesRestoreRule$1.evaluate(SystemPropertiesRestoreRule.java:53)
	at org.apache.lucene.util.AbstractBeforeAfterRule$1.evaluate(AbstractBeforeAfterRule.java:46)
	at org.apache.lucene.util.TestRuleStoreClassName$1.evaluate(TestRuleStoreClassName.java:42)
	at com.carrotsearch.randomizedtesting.rules.SystemPropertiesInvariantRule$1.evaluate(SystemPropertiesInvariantRule.java:55)
	at com.carrotsearch.randomizedtesting.rules.NoShadowingOrOverridesOnMethodsRule$1.evaluate(NoShadowingOrOverridesOnMethodsRule.java:39)
	at com.carrotsearch.randomizedtesting.rules.NoShadowingOrOverridesOnMethodsRule$1.evaluate(NoShadowingOrOverridesOnMethodsRule.java:39)
	at com.carrotsearch.randomizedtesting.rules.StatementAdapter.evaluate(StatementAdapter.java:36)
	at org.apache.lucene.util.TestRuleAssertionsRequired$1.evaluate(TestRuleAssertionsRequired.java:43)
	at org.apache.lucene.util.TestRuleMarkFailure$1.evaluate(TestRuleMarkFailure.java:48)
	at org.apache.lucene.util.TestRuleIgnoreAfterMaxFailures$1.evaluate(TestRuleIgnoreAfterMaxFailures.java:70)
	at org.apache.lucene.util.TestRuleIgnoreTestSuites$1.evaluate(TestRuleIgnoreTestSuites.java:55)
	at com.carrotsearch.randomizedtesting.rules.StatementAdapter.evaluate(StatementAdapter.java:36)
	at com.carrotsearch.randomizedtesting.ThreadLeakControl$StatementRunner.run(ThreadLeakControl.java:358)
	at java.lang.Thread.run(Thread.java:744)


FAILED:  org.apache.solr.analytics.expression.ExpressionTest.addTest

Error Message:
Caught exception in getStatResult, xPath = /response/lst[@name='stats']/lst[@name='ar']/double[@name='sum']  raw data: <?xml version="1.0" encoding="UTF-8"?> <response>  <lst name="responseHeader">   <int name="status">0</int>   <int name="QTime">24</int> </lst> <result name="response" numFound="100" start="0"> </result> <lst name="stats">   <lst name="stats_fields"/> </lst> <lst name="stats">   <lst name="pr">     <long name="count">100</long>     <null name="mc"/>     <null name="mean"/>     <null name="su"/>     <null name="sum"/>     <null name="unique"/>   </lst>   <lst name="cnr">     <double name="c10">10.0</double>     <double name="c8">8.0</double>   </lst>   <lst name="csr">     <str name="cs1">this is the first</str>     <str name="cs2">this is the second</str>     <str name="cs3">this is the third</str>   </lst>   <lst name="dmr">     <str name="cma">+2MONTHS</str>     <str name="cme">+2YEARS</str>     <date name="dmma">1812-02-29T23:59:59Z</date>     <date name="dmme">1807-12-31T23:59:59Z</date>     <date name="max">1811-12-31T23:59:59Z</date>     <date name="median">1805-12-31T23:59:59Z</date>   </lst>   <lst name="ar">     <long name="count">100</long>     <null name="mcm"/>     <null name="mean"/>     <null name="median"/>     <null name="su"/>     <null name="sum"/>     <null name="unique"/>   </lst>   <lst name="cdr">     <date name="cd1">1800-12-31T23:59:59Z</date>     <date name="cd2">1804-06-30T23:59:59Z</date>     <str name="cs1">1800-12-31T23:59:59Z</str>     <str name="cs2">1804-06-30T23:59:59Z</str>   </lst>   <lst name="dr">     <long name="count">100</long>     <null name="mc"/>     <null name="mean"/>     <null name="su"/>     <null name="sum"/>     <null name="unique"/>   </lst>   <lst name="rr">     <str name="max">str9</str>     <str name="min">str0</str>     <str name="rmax">9rts</str>     <str name="rmin">0rts</str>   </lst>   <lst name="mr">     <long name="count">100</long>     <null name="mcm"/>     <null name="mean"/>     <null name="median"/>     <null name="su"/>     <null name="sum"/>     <null name="unique"/>   </lst>   <lst name="nr">     <double name="c">-100.0</double>     <long name="count">100</long>     <null name="s"/>     <null name="sum"/>   </lst>   <lst name="avr">     <double name="c">100.0</double>     <long name="count">100</long>     <null name="s"/>     <null name="sum"/>   </lst>   <lst name="cr">     <str name="ccmax">this is the secondstr9</str>     <str name="ccmin">this is the firststr0</str>     <str name="csmax">this is the second</str>     <str name="csmin">this is the first</str>     <str name="max">str9</str>     <str name="min">str0</str>   </lst> </lst> </response> 

Stack Trace:
java.lang.AssertionError: Caught exception in getStatResult, xPath = /response/lst[@name='stats']/lst[@name='ar']/double[@name='sum'] 
raw data: <?xml version="1.0" encoding="UTF-8"?>
<response>

<lst name="responseHeader">
  <int name="status">0</int>
  <int name="QTime">24</int>
</lst>
<result name="response" numFound="100" start="0">
</result>
<lst name="stats">
  <lst name="stats_fields"/>
</lst>
<lst name="stats">
  <lst name="pr">
    <long name="count">100</long>
    <null name="mc"/>
    <null name="mean"/>
    <null name="su"/>
    <null name="sum"/>
    <null name="unique"/>
  </lst>
  <lst name="cnr">
    <double name="c10">10.0</double>
    <double name="c8">8.0</double>
  </lst>
  <lst name="csr">
    <str name="cs1">this is the first</str>
    <str name="cs2">this is the second</str>
    <str name="cs3">this is the third</str>
  </lst>
  <lst name="dmr">
    <str name="cma">+2MONTHS</str>
    <str name="cme">+2YEARS</str>
    <date name="dmma">1812-02-29T23:59:59Z</date>
    <date name="dmme">1807-12-31T23:59:59Z</date>
    <date name="max">1811-12-31T23:59:59Z</date>
    <date name="median">1805-12-31T23:59:59Z</date>
  </lst>
  <lst name="ar">
    <long name="count">100</long>
    <null name="mcm"/>
    <null name="mean"/>
    <null name="median"/>
    <null name="su"/>
    <null name="sum"/>
    <null name="unique"/>
  </lst>
  <lst name="cdr">
    <date name="cd1">1800-12-31T23:59:59Z</date>
    <date name="cd2">1804-06-30T23:59:59Z</date>
    <str name="cs1">1800-12-31T23:59:59Z</str>
    <str name="cs2">1804-06-30T23:59:59Z</str>
  </lst>
  <lst name="dr">
    <long name="count">100</long>
    <null name="mc"/>
    <null name="mean"/>
    <null name="su"/>
    <null name="sum"/>
    <null name="unique"/>
  </lst>
  <lst name="rr">
    <str name="max">str9</str>
    <str name="min">str0</str>
    <str name="rmax">9rts</str>
    <str name="rmin">0rts</str>
  </lst>
  <lst name="mr">
    <long name="count">100</long>
    <null name="mcm"/>
    <null name="mean"/>
    <null name="median"/>
    <null name="su"/>
    <null name="sum"/>
    <null name="unique"/>
  </lst>
  <lst name="nr">
    <double name="c">-100.0</double>
    <long name="count">100</long>
    <null name="s"/>
    <null name="sum"/>
  </lst>
  <lst name="avr">
    <double name="c">100.0</double>
    <long name="count">100</long>
    <null name="s"/>
    <null name="sum"/>
  </lst>
  <lst name="cr">
    <str name="ccmax">this is the secondstr9</str>
    <str name="ccmin">this is the firststr0</str>
    <str name="csmax">this is the second</str>
    <str name="csmin">this is the first</str>
    <str name="max">str9</str>
    <str name="min">str0</str>
  </lst>
</lst>
</response>

	at __randomizedtesting.SeedInfo.seed([6C4A2E9E0C6867D7:9A6683404DA76090]:0)
	at org.junit.Assert.fail(Assert.java:93)
	at org.apache.solr.analytics.AbstractAnalyticsStatsTest.getStatResult(AbstractAnalyticsStatsTest.java:113)
	at org.apache.solr.analytics.expression.ExpressionTest.addTest(ExpressionTest.java:78)
	at sun.reflect.NativeMethodAccessorImpl.invoke0(Native Method)
	at sun.reflect.NativeMethodAccessorImpl.invoke(NativeMethodAccessorImpl.java:57)
	at sun.reflect.DelegatingMethodAccessorImpl.invoke(DelegatingMethodAccessorImpl.java:43)
	at java.lang.reflect.Method.invoke(Method.java:606)
	at com.carrotsearch.randomizedtesting.RandomizedRunner.invoke(RandomizedRunner.java:1559)
	at com.carrotsearch.randomizedtesting.RandomizedRunner.access$600(RandomizedRunner.java:79)
	at com.carrotsearch.randomizedtesting.RandomizedRunner$6.evaluate(RandomizedRunner.java:737)
	at com.carrotsearch.randomizedtesting.RandomizedRunner$7.evaluate(RandomizedRunner.java:773)
	at com.carrotsearch.randomizedtesting.RandomizedRunner$8.evaluate(RandomizedRunner.java:787)
	at com.carrotsearch.randomizedtesting.rules.SystemPropertiesRestoreRule$1.evaluate(SystemPropertiesRestoreRule.java:53)
	at org.apache.lucene.util.TestRuleSetupTeardownChained$1.evaluate(TestRuleSetupTeardownChained.java:50)
	at org.apache.lucene.util.TestRuleFieldCacheSanity$1.evaluate(TestRuleFieldCacheSanity.java:51)
	at org.apache.lucene.util.AbstractBeforeAfterRule$1.evaluate(AbstractBeforeAfterRule.java:46)
	at com.carrotsearch.randomizedtesting.rules.SystemPropertiesInvariantRule$1.evaluate(SystemPropertiesInvariantRule.java:55)
	at org.apache.lucene.util.TestRuleThreadAndTestName$1.evaluate(TestRuleThreadAndTestName.java:49)
	at org.apache.lucene.util.TestRuleIgnoreAfterMaxFailures$1.evaluate(TestRuleIgnoreAfterMaxFailures.java:70)
	at org.apache.lucene.util.TestRuleMarkFailure$1.evaluate(TestRuleMarkFailure.java:48)
	at com.carrotsearch.randomizedtesting.rules.StatementAdapter.evaluate(StatementAdapter.java:36)
	at com.carrotsearch.randomizedtesting.ThreadLeakControl$StatementRunner.run(ThreadLeakControl.java:358)
	at com.carrotsearch.randomizedtesting.ThreadLeakControl.forkTimeoutingTask(ThreadLeakControl.java:782)
	at com.carrotsearch.randomizedtesting.ThreadLeakControl$3.evaluate(ThreadLeakControl.java:442)
	at com.carrotsearch.randomizedtesting.RandomizedRunner.runSingleTest(RandomizedRunner.java:746)
	at com.carrotsearch.randomizedtesting.RandomizedRunner$3.evaluate(RandomizedRunner.java:648)
	at com.carrotsearch.randomizedtesting.RandomizedRunner$4.evaluate(RandomizedRunner.java:682)
	at com.carrotsearch.randomizedtesting.RandomizedRunner$5.evaluate(RandomizedRunner.java:693)
	at com.carrotsearch.randomizedtesting.rules.StatementAdapter.evaluate(StatementAdapter.java:36)
	at com.carrotsearch.randomizedtesting.rules.SystemPropertiesRestoreRule$1.evaluate(SystemPropertiesRestoreRule.java:53)
	at org.apache.lucene.util.AbstractBeforeAfterRule$1.evaluate(AbstractBeforeAfterRule.java:46)
	at org.apache.lucene.util.TestRuleStoreClassName$1.evaluate(TestRuleStoreClassName.java:42)
	at com.carrotsearch.randomizedtesting.rules.SystemPropertiesInvariantRule$1.evaluate(SystemPropertiesInvariantRule.java:55)
	at com.carrotsearch.randomizedtesting.rules.NoShadowingOrOverridesOnMethodsRule$1.evaluate(NoShadowingOrOverridesOnMethodsRule.java:39)
	at com.carrotsearch.randomizedtesting.rules.NoShadowingOrOverridesOnMethodsRule$1.evaluate(NoShadowingOrOverridesOnMethodsRule.java:39)
	at com.carrotsearch.randomizedtesting.rules.StatementAdapter.evaluate(StatementAdapter.java:36)
	at org.apache.lucene.util.TestRuleAssertionsRequired$1.evaluate(TestRuleAssertionsRequired.java:43)
	at org.apache.lucene.util.TestRuleMarkFailure$1.evaluate(TestRuleMarkFailure.java:48)
	at org.apache.lucene.util.TestRuleIgnoreAfterMaxFailures$1.evaluate(TestRuleIgnoreAfterMaxFailures.java:70)
	at org.apache.lucene.util.TestRuleIgnoreTestSuites$1.evaluate(TestRuleIgnoreTestSuites.java:55)
	at com.carrotsearch.randomizedtesting.rules.StatementAdapter.evaluate(StatementAdapter.java:36)
	at com.carrotsearch.randomizedtesting.ThreadLeakControl$StatementRunner.run(ThreadLeakControl.java:358)
	at java.lang.Thread.run(Thread.java:744)


FAILED:  org.apache.solr.analytics.expression.ExpressionTest.multiplyTest

Error Message:
Caught exception in getStatResult, xPath = /response/lst[@name='stats']/lst[@name='mr']/double[@name='sum']  raw data: <?xml version="1.0" encoding="UTF-8"?> <response>  <lst name="responseHeader">   <int name="status">0</int>   <int name="QTime">24</int> </lst> <result name="response" numFound="100" start="0"> </result> <lst name="stats">   <lst name="stats_fields"/> </lst> <lst name="stats">   <lst name="pr">     <long name="count">100</long>     <null name="mc"/>     <null name="mean"/>     <null name="su"/>     <null name="sum"/>     <null name="unique"/>   </lst>   <lst name="cnr">     <double name="c10">10.0</double>     <double name="c8">8.0</double>   </lst>   <lst name="csr">     <str name="cs1">this is the first</str>     <str name="cs2">this is the second</str>     <str name="cs3">this is the third</str>   </lst>   <lst name="dmr">     <str name="cma">+2MONTHS</str>     <str name="cme">+2YEARS</str>     <date name="dmma">1812-02-29T23:59:59Z</date>     <date name="dmme">1807-12-31T23:59:59Z</date>     <date name="max">1811-12-31T23:59:59Z</date>     <date name="median">1805-12-31T23:59:59Z</date>   </lst>   <lst name="ar">     <long name="count">100</long>     <null name="mcm"/>     <null name="mean"/>     <null name="median"/>     <null name="su"/>     <null name="sum"/>     <null name="unique"/>   </lst>   <lst name="cdr">     <date name="cd1">1800-12-31T23:59:59Z</date>     <date name="cd2">1804-06-30T23:59:59Z</date>     <str name="cs1">1800-12-31T23:59:59Z</str>     <str name="cs2">1804-06-30T23:59:59Z</str>   </lst>   <lst name="dr">     <long name="count">100</long>     <null name="mc"/>     <null name="mean"/>     <null name="su"/>     <null name="sum"/>     <null name="unique"/>   </lst>   <lst name="rr">     <str name="max">str9</str>     <str name="min">str0</str>     <str name="rmax">9rts</str>     <str name="rmin">0rts</str>   </lst>   <lst name="mr">     <long name="count">100</long>     <null name="mcm"/>     <null name="mean"/>     <null name="median"/>     <null name="su"/>     <null name="sum"/>     <null name="unique"/>   </lst>   <lst name="nr">     <double name="c">-100.0</double>     <long name="count">100</long>     <null name="s"/>     <null name="sum"/>   </lst>   <lst name="avr">     <double name="c">100.0</double>     <long name="count">100</long>     <null name="s"/>     <null name="sum"/>   </lst>   <lst name="cr">     <str name="ccmax">this is the secondstr9</str>     <str name="ccmin">this is the firststr0</str>     <str name="csmax">this is the second</str>     <str name="csmin">this is the first</str>     <str name="max">str9</str>     <str name="min">str0</str>   </lst> </lst> </response> 

Stack Trace:
java.lang.AssertionError: Caught exception in getStatResult, xPath = /response/lst[@name='stats']/lst[@name='mr']/double[@name='sum'] 
raw data: <?xml version="1.0" encoding="UTF-8"?>
<response>

<lst name="responseHeader">
  <int name="status">0</int>
  <int name="QTime">24</int>
</lst>
<result name="response" numFound="100" start="0">
</result>
<lst name="stats">
  <lst name="stats_fields"/>
</lst>
<lst name="stats">
  <lst name="pr">
    <long name="count">100</long>
    <null name="mc"/>
    <null name="mean"/>
    <null name="su"/>
    <null name="sum"/>
    <null name="unique"/>
  </lst>
  <lst name="cnr">
    <double name="c10">10.0</double>
    <double name="c8">8.0</double>
  </lst>
  <lst name="csr">
    <str name="cs1">this is the first</str>
    <str name="cs2">this is the second</str>
    <str name="cs3">this is the third</str>
  </lst>
  <lst name="dmr">
    <str name="cma">+2MONTHS</str>
    <str name="cme">+2YEARS</str>
    <date name="dmma">1812-02-29T23:59:59Z</date>
    <date name="dmme">1807-12-31T23:59:59Z</date>
    <date name="max">1811-12-31T23:59:59Z</date>
    <date name="median">1805-12-31T23:59:59Z</date>
  </lst>
  <lst name="ar">
    <long name="count">100</long>
    <null name="mcm"/>
    <null name="mean"/>
    <null name="median"/>
    <null name="su"/>
    <null name="sum"/>
    <null name="unique"/>
  </lst>
  <lst name="cdr">
    <date name="cd1">1800-12-31T23:59:59Z</date>
    <date name="cd2">1804-06-30T23:59:59Z</date>
    <str name="cs1">1800-12-31T23:59:59Z</str>
    <str name="cs2">1804-06-30T23:59:59Z</str>
  </lst>
  <lst name="dr">
    <long name="count">100</long>
    <null name="mc"/>
    <null name="mean"/>
    <null name="su"/>
    <null name="sum"/>
    <null name="unique"/>
  </lst>
  <lst name="rr">
    <str name="max">str9</str>
    <str name="min">str0</str>
    <str name="rmax">9rts</str>
    <str name="rmin">0rts</str>
  </lst>
  <lst name="mr">
    <long name="count">100</long>
    <null name="mcm"/>
    <null name="mean"/>
    <null name="median"/>
    <null name="su"/>
    <null name="sum"/>
    <null name="unique"/>
  </lst>
  <lst name="nr">
    <double name="c">-100.0</double>
    <long name="count">100</long>
    <null name="s"/>
    <null name="sum"/>
  </lst>
  <lst name="avr">
    <double name="c">100.0</double>
    <long name="count">100</long>
    <null name="s"/>
    <null name="sum"/>
  </lst>
  <lst name="cr">
    <str name="ccmax">this is the secondstr9</str>
    <str name="ccmin">this is the firststr0</str>
    <str name="csmax">this is the second</str>
    <str name="csmin">this is the first</str>
    <str name="max">str9</str>
    <str name="min">str0</str>
  </lst>
</lst>
</response>

	at __randomizedtesting.SeedInfo.seed([6C4A2E9E0C6867D7:7CB30E0396651B9]:0)
	at org.junit.Assert.fail(Assert.java:93)
	at org.apache.solr.analytics.AbstractAnalyticsStatsTest.getStatResult(AbstractAnalyticsStatsTest.java:113)
	at org.apache.solr.analytics.expression.ExpressionTest.multiplyTest(ExpressionTest.java:92)
	at sun.reflect.NativeMethodAccessorImpl.invoke0(Native Method)
	at sun.reflect.NativeMethodAccessorImpl.invoke(NativeMethodAccessorImpl.java:57)
	at sun.reflect.DelegatingMethodAccessorImpl.invoke(DelegatingMethodAccessorImpl.java:43)
	at java.lang.reflect.Method.invoke(Method.java:606)
	at com.carrotsearch.randomizedtesting.RandomizedRunner.invoke(RandomizedRunner.java:1559)
	at com.carrotsearch.randomizedtesting.RandomizedRunner.access$600(RandomizedRunner.java:79)
	at com.carrotsearch.randomizedtesting.RandomizedRunner$6.evaluate(RandomizedRunner.java:737)
	at com.carrotsearch.randomizedtesting.RandomizedRunner$7.evaluate(RandomizedRunner.java:773)
	at com.carrotsearch.randomizedtesting.RandomizedRunner$8.evaluate(RandomizedRunner.java:787)
	at com.carrotsearch.randomizedtesting.rules.SystemPropertiesRestoreRule$1.evaluate(SystemPropertiesRestoreRule.java:53)
	at org.apache.lucene.util.TestRuleSetupTeardownChained$1.evaluate(TestRuleSetupTeardownChained.java:50)
	at org.apache.lucene.util.TestRuleFieldCacheSanity$1.evaluate(TestRuleFieldCacheSanity.java:51)
	at org.apache.lucene.util.AbstractBeforeAfterRule$1.evaluate(AbstractBeforeAfterRule.java:46)
	at com.carrotsearch.randomizedtesting.rules.SystemPropertiesInvariantRule$1.evaluate(SystemPropertiesInvariantRule.java:55)
	at org.apache.lucene.util.TestRuleThreadAndTestName$1.evaluate(TestRuleThreadAndTestName.java:49)
	at org.apache.lucene.util.TestRuleIgnoreAfterMaxFailures$1.evaluate(TestRuleIgnoreAfterMaxFailures.java:70)
	at org.apache.lucene.util.TestRuleMarkFailure$1.evaluate(TestRuleMarkFailure.java:48)
	at com.carrotsearch.randomizedtesting.rules.StatementAdapter.evaluate(StatementAdapter.java:36)
	at com.carrotsearch.randomizedtesting.ThreadLeakControl$StatementRunner.run(ThreadLeakControl.java:358)
	at com.carrotsearch.randomizedtesting.ThreadLeakControl.forkTimeoutingTask(ThreadLeakControl.java:782)
	at com.carrotsearch.randomizedtesting.ThreadLeakControl$3.evaluate(ThreadLeakControl.java:442)
	at com.carrotsearch.randomizedtesting.RandomizedRunner.runSingleTest(RandomizedRunner.java:746)
	at com.carrotsearch.randomizedtesting.RandomizedRunner$3.evaluate(RandomizedRunner.java:648)
	at com.carrotsearch.randomizedtesting.RandomizedRunner$4.evaluate(RandomizedRunner.java:682)
	at com.carrotsearch.randomizedtesting.RandomizedRunner$5.evaluate(RandomizedRunner.java:693)
	at com.carrotsearch.randomizedtesting.rules.StatementAdapter.evaluate(StatementAdapter.java:36)
	at com.carrotsearch.randomizedtesting.rules.SystemPropertiesRestoreRule$1.evaluate(SystemPropertiesRestoreRule.java:53)
	at org.apache.lucene.util.AbstractBeforeAfterRule$1.evaluate(AbstractBeforeAfterRule.java:46)
	at org.apache.lucene.util.TestRuleStoreClassName$1.evaluate(TestRuleStoreClassName.java:42)
	at com.carrotsearch.randomizedtesting.rules.SystemPropertiesInvariantRule$1.evaluate(SystemPropertiesInvariantRule.java:55)
	at com.carrotsearch.randomizedtesting.rules.NoShadowingOrOverridesOnMethodsRule$1.evaluate(NoShadowingOrOverridesOnMethodsRule.java:39)
	at com.carrotsearch.randomizedtesting.rules.NoShadowingOrOverridesOnMethodsRule$1.evaluate(NoShadowingOrOverridesOnMethodsRule.java:39)
	at com.carrotsearch.randomizedtesting.rules.StatementAdapter.evaluate(StatementAdapter.java:36)
	at org.apache.lucene.util.TestRuleAssertionsRequired$1.evaluate(TestRuleAssertionsRequired.java:43)
	at org.apache.lucene.util.TestRuleMarkFailure$1.evaluate(TestRuleMarkFailure.java:48)
	at org.apache.lucene.util.TestRuleIgnoreAfterMaxFailures$1.evaluate(TestRuleIgnoreAfterMaxFailures.java:70)
	at org.apache.lucene.util.TestRuleIgnoreTestSuites$1.evaluate(TestRuleIgnoreTestSuites.java:55)
	at com.carrotsearch.randomizedtesting.rules.StatementAdapter.evaluate(StatementAdapter.java:36)
	at com.carrotsearch.randomizedtesting.ThreadLeakControl$StatementRunner.run(ThreadLeakControl.java:358)
	at java.lang.Thread.run(Thread.java:744)




Build Log:
[...truncated 10840 lines...]
   [junit4] Suite: org.apache.solr.analytics.expression.ExpressionTest
   [junit4]   2> 1201913 T4364 oas.SolrTestCaseJ4.initCore ####initCore
   [junit4]   2> Creating dataDir: /mnt/ssd/jenkins/workspace/Lucene-Solr-trunk-Linux/solr/build/solr-core/test/J0/./solrtest-ExpressionTest-1387514876439
   [junit4]   2> 1201914 T4364 oasc.SolrResourceLoader.<init> new SolrResourceLoader for directory: '/mnt/ssd/jenkins/workspace/Lucene-Solr-trunk-Linux/solr/build/solr-core/test-files/solr/collection1/'
   [junit4]   2> 1201915 T4364 oasc.SolrResourceLoader.replaceClassLoader Adding 'file:/mnt/ssd/jenkins/workspace/Lucene-Solr-trunk-Linux/solr/build/solr-core/test-files/solr/collection1/lib/classes/' to classloader
   [junit4]   2> 1201915 T4364 oasc.SolrResourceLoader.replaceClassLoader Adding 'file:/mnt/ssd/jenkins/workspace/Lucene-Solr-trunk-Linux/solr/build/solr-core/test-files/solr/collection1/lib/README' to classloader
   [junit4]   2> 1201941 T4364 oasc.SolrConfig.<init> Using Lucene MatchVersion: LUCENE_50
   [junit4]   2> 1201956 T4364 oasc.SolrConfig.<init> Loaded SolrConfig: solrconfig-basic.xml
   [junit4]   2> 1201956 T4364 oass.IndexSchema.readSchema Reading Solr Schema from schema-analytics.xml
   [junit4]   2> 1201962 T4364 oass.IndexSchema.readSchema [null] Schema name=schema-docValues
   [junit4]   2> 1201984 T4364 oass.IndexSchema.readSchema unique key field: id
   [junit4]   2> 1201984 T4364 oasc.SolrResourceLoader.locateSolrHome JNDI not configured for solr (NoInitialContextEx)
   [junit4]   2> 1201985 T4364 oasc.SolrResourceLoader.locateSolrHome using system property solr.solr.home: /mnt/ssd/jenkins/workspace/Lucene-Solr-trunk-Linux/solr/build/solr-core/test-files/solr
   [junit4]   2> 1201985 T4364 oasc.SolrResourceLoader.<init> new SolrResourceLoader for directory: '/mnt/ssd/jenkins/workspace/Lucene-Solr-trunk-Linux/solr/build/solr-core/test-files/solr/'
   [junit4]   2> 1201993 T4364 oasc.SolrResourceLoader.locateSolrHome JNDI not configured for solr (NoInitialContextEx)
   [junit4]   2> 1201994 T4364 oasc.SolrResourceLoader.locateSolrHome using system property solr.solr.home: /mnt/ssd/jenkins/workspace/Lucene-Solr-trunk-Linux/solr/build/solr-core/test-files/solr
   [junit4]   2> 1201994 T4364 oasc.SolrResourceLoader.<init> new SolrResourceLoader for deduced Solr Home: '/mnt/ssd/jenkins/workspace/Lucene-Solr-trunk-Linux/solr/build/solr-core/test-files/solr/'
   [junit4]   2> 1202021 T4364 oasc.CoreContainer.<init> New CoreContainer 1543785628
   [junit4]   2> 1202022 T4364 oasc.CoreContainer.load Loading cores into CoreContainer [instanceDir=/mnt/ssd/jenkins/workspace/Lucene-Solr-trunk-Linux/solr/build/solr-core/test-files/solr/]
   [junit4]   2> 1202022 T4364 oashc.HttpShardHandlerFactory.getParameter Setting socketTimeout to: 0
   [junit4]   2> 1202022 T4364 oashc.HttpShardHandlerFactory.getParameter Setting urlScheme to: http://
   [junit4]   2> 1202023 T4364 oashc.HttpShardHandlerFactory.getParameter Setting connTimeout to: 0
   [junit4]   2> 1202023 T4364 oashc.HttpShardHandlerFactory.getParameter Setting maxConnectionsPerHost to: 20
   [junit4]   2> 1202023 T4364 oashc.HttpShardHandlerFactory.getParameter Setting corePoolSize to: 0
   [junit4]   2> 1202023 T4364 oashc.HttpShardHandlerFactory.getParameter Setting maximumPoolSize to: 2147483647
   [junit4]   2> 1202023 T4364 oashc.HttpShardHandlerFactory.getParameter Setting maxThreadIdleTime to: 5
   [junit4]   2> 1202024 T4364 oashc.HttpShardHandlerFactory.getParameter Setting sizeOfQueue to: -1
   [junit4]   2> 1202024 T4364 oashc.HttpShardHandlerFactory.getParameter Setting fairnessPolicy to: false
   [junit4]   2> 1202027 T4364 oasl.LogWatcher.createWatcher SLF4J impl is org.slf4j.impl.Log4jLoggerFactory
   [junit4]   2> 1202027 T4364 oasl.LogWatcher.newRegisteredLogWatcher Registering Log Listener [Log4j (org.slf4j.impl.Log4jLoggerFactory)]
   [junit4]   2> 1202027 T4364 oasc.CoreContainer.load Host Name: 
   [junit4]   2> 1202030 T4365 oasc.CoreContainer.create Creating SolrCore 'collection1' using instanceDir: /mnt/ssd/jenkins/workspace/Lucene-Solr-trunk-Linux/solr/build/solr-core/test-files/solr/collection1
   [junit4]   2> 1202030 T4365 oasc.SolrResourceLoader.<init> new SolrResourceLoader for directory: '/mnt/ssd/jenkins/workspace/Lucene-Solr-trunk-Linux/solr/build/solr-core/test-files/solr/collection1/'
   [junit4]   2> 1202030 T4365 oasc.SolrResourceLoader.replaceClassLoader Adding 'file:/mnt/ssd/jenkins/workspace/Lucene-Solr-trunk-Linux/solr/build/solr-core/test-files/solr/collection1/lib/classes/' to classloader
   [junit4]   2> 1202031 T4365 oasc.SolrResourceLoader.replaceClassLoader Adding 'file:/mnt/ssd/jenkins/workspace/Lucene-Solr-trunk-Linux/solr/build/solr-core/test-files/solr/collection1/lib/README' to classloader
   [junit4]   2> 1202059 T4365 oasc.SolrConfig.<init> Using Lucene MatchVersion: LUCENE_50
   [junit4]   2> 1202075 T4365 oasc.SolrConfig.<init> Loaded SolrConfig: solrconfig-basic.xml
   [junit4]   2> 1202076 T4365 oass.IndexSchema.readSchema Reading Solr Schema from schema-analytics.xml
   [junit4]   2> 1202082 T4365 oass.IndexSchema.readSchema [collection1] Schema name=schema-docValues
   [junit4]   2> 1202102 T4365 oass.IndexSchema.readSchema unique key field: id
   [junit4]   2> 1202103 T4365 oasc.SolrCore.initDirectoryFactory org.apache.solr.core.MockDirectoryFactory
   [junit4]   2> 1202103 T4365 oasc.SolrCore.<init> [collection1] Opening new SolrCore at /mnt/ssd/jenkins/workspace/Lucene-Solr-trunk-Linux/solr/build/solr-core/test-files/solr/collection1/, dataDir=/mnt/ssd/jenkins/workspace/Lucene-Solr-trunk-Linux/solr/build/solr-core/test/J0/./solrtest-ExpressionTest-1387514876439/
   [junit4]   2> 1202103 T4365 oasc.SolrCore.<init> JMX monitoring not detected for core: collection1
   [junit4]   2> 1202104 T4365 oasc.CachingDirectoryFactory.get return new directory for /mnt/ssd/jenkins/workspace/Lucene-Solr-trunk-Linux/solr/build/solr-core/test/J0/./solrtest-ExpressionTest-1387514876439
   [junit4]   2> 1202104 T4365 oasc.SolrCore.getNewIndexDir New index directory detected: old=null new=/mnt/ssd/jenkins/workspace/Lucene-Solr-trunk-Linux/solr/build/solr-core/test/J0/./solrtest-ExpressionTest-1387514876439/index/
   [junit4]   2> 1202104 T4365 oasc.SolrCore.initIndex WARN [collection1] Solr index directory '/mnt/ssd/jenkins/workspace/Lucene-Solr-trunk-Linux/solr/build/solr-core/test/J0/./solrtest-ExpressionTest-1387514876439/index' doesn't exist. Creating new index...
   [junit4]   2> 1202105 T4365 oasc.CachingDirectoryFactory.get return new directory for /mnt/ssd/jenkins/workspace/Lucene-Solr-trunk-Linux/solr/build/solr-core/test/J0/./solrtest-ExpressionTest-1387514876439/index
   [junit4]   2> 1202105 T4365 oasu.RandomMergePolicy.<init> RandomMergePolicy wrapping class org.apache.lucene.index.TieredMergePolicy: [TieredMergePolicy: maxMergeAtOnce=18, maxMergeAtOnceExplicit=48, maxMergedSegmentMB=59.7939453125, floorSegmentMB=0.91796875, forceMergeDeletesPctAllowed=16.89614939787699, segmentsPerTier=25.0, maxCFSSegmentSizeMB=8.796093022207999E12, noCFSRatio=1.0
   [junit4]   2> 1202106 T4365 oasc.SolrDeletionPolicy.onCommit SolrDeletionPolicy.onCommit: commits: num=1
   [junit4]   2> 		commit{dir=MockDirectoryWrapper(org.apache.lucene.store.RAMDirectory@75699f6c lockFactory=org.apache.lucene.store.SingleInstanceLockFactory@4c9065ac),segFN=segments_1,generation=1}
   [junit4]   2> 1202106 T4365 oasc.SolrDeletionPolicy.updateCommits newest commit generation = 1
   [junit4]   2> 1202107 T4365 oasc.SolrCore.loadUpdateProcessorChains no updateRequestProcessorChain defined as default, creating implicit default
   [junit4]   2> 1202107 T4365 oasc.RequestHandlers.initHandlersFromConfig created standard: solr.StandardRequestHandler
   [junit4]   2> 1202107 T4365 oasc.RequestHandlers.initHandlersFromConfig created /update: solr.UpdateRequestHandler
   [junit4]   2> 1202110 T4365 oashl.XMLLoader.init xsltCacheLifetimeSeconds=60
   [junit4]   2> 1202111 T4365 oasu.CommitTracker.<init> Hard AutoCommit: disabled
   [junit4]   2> 1202111 T4365 oasu.CommitTracker.<init> Soft AutoCommit: disabled
   [junit4]   2> 1202112 T4365 oasu.RandomMergePolicy.<init> RandomMergePolicy wrapping class org.apache.lucene.index.LogByteSizeMergePolicy: [LogByteSizeMergePolicy: minMergeSize=1677721, mergeFactor=24, maxMergeSize=2147483648, maxMergeSizeForForcedMerge=9223372036854775807, calibrateSizeByDeletes=true, maxMergeDocs=2147483647, maxCFSSegmentSizeMB=8.796093022207999E12, noCFSRatio=0.6842459634944541]
   [junit4]   2> 1202112 T4365 oasc.SolrDeletionPolicy.onInit SolrDeletionPolicy.onInit: commits: num=1
   [junit4]   2> 		commit{dir=MockDirectoryWrapper(org.apache.lucene.store.RAMDirectory@75699f6c lockFactory=org.apache.lucene.store.SingleInstanceLockFactory@4c9065ac),segFN=segments_1,generation=1}
   [junit4]   2> 1202112 T4365 oasc.SolrDeletionPolicy.updateCommits newest commit generation = 1
   [junit4]   2> 1202112 T4365 oass.SolrIndexSearcher.<init> Opening Searcher@cb565cd main
   [junit4]   2> 1202113 T4366 oasc.SolrCore.registerSearcher [collection1] Registered new searcher Searcher@cb565cd main{StandardDirectoryReader(segments_1:1:nrt)}
   [junit4]   2> 1202113 T4365 oasc.CoreContainer.registerCore registering core: collection1
   [junit4]   2> 1202114 T4364 oas.SolrTestCaseJ4.initCore ####initCore end
   [junit4]   2> ASYNC  NEW_CORE C5611 name=collection1 org.apache.solr.core.SolrCore@7390d451
   [junit4]   2> 1202117 T4364 C5611 oasu.DirectUpdateHandler2.deleteAll [collection1] REMOVING ALL DOCUMENTS FROM INDEX
   [junit4]   2> 1202118 T4364 C5611 oasup.LogUpdateProcessor.finish [collection1] webapp=null path=null params={} {deleteByQuery=*:*} 0 1
   [junit4]   2> 1202121 T4364 C5611 oasup.LogUpdateProcessor.finish [collection1] webapp=null path=null params={} {add=[10000]} 0 1
   [junit4]   2> 1202127 T4364 C5611 oasup.LogUpdateProcessor.finish [collection1] webapp=null path=null params={} {add=[10001]} 0 1
   [junit4]   2> 1202130 T4364 C5611 oasup.LogUpdateProcessor.finish [collection1] webapp=null path=null params={} {add=[10002]} 0 1
   [junit4]   2> ASYNC  NEW_CORE C5612 name=collection1 org.apache.solr.core.SolrCore@7390d451
   [junit4]   2> 1202141 T4364 C5612 oasup.LogUpdateProcessor.finish [collection1] webapp=null path=null params={} {add=[10003]} 0 1
   [junit4]   2> 1202144 T4364 C5612 oasup.LogUpdateProcessor.finish [collection1] webapp=null path=null params={} {add=[10004]} 0 0
   [junit4]   2> 1202148 T4364 C5612 oasup.LogUpdateProcessor.finish [collection1] webapp=null path=null params={} {add=[10005]} 0 1
   [junit4]   2> 1202152 T4364 C5612 oasup.LogUpdateProcessor.finish [collection1] webapp=null path=null params={} {add=[10006]} 0 1
   [junit4]   2> 1202156 T4364 C5612 oasup.LogUpdateProcessor.finish [collection1] webapp=null path=null params={} {add=[10007]} 0 1
   [junit4]   2> 1202160 T4364 C5612 oasup.LogUpdateProcessor.finish [collection1] webapp=null path=null params={} {add=[10008]} 0 1
   [junit4]   2> 1202164 T4364 C5612 oasup.LogUpdateProcessor.finish [collection1] webapp=null path=null params={} {add=[10009]} 0 1
   [junit4]   2> 1202168 T4364 C5612 oasup.LogUpdateProcessor.finish [collection1] webapp=null path=null params={} {add=[100010]} 0 1
   [junit4]   2> 1202171 T4364 C5612 oasup.LogUpdateProcessor.finish [collection1] webapp=null path=null params={} {add=[100011]} 0 0
   [junit4]   2> 1202175 T4364 C5612 oasup.LogUpdateProcessor.finish [collection1] webapp=null path=null params={} {add=[100012]} 0 0
   [junit4]   2> 1202180 T4364 C5612 oasup.LogUpdateProcessor.finish [collection1] webapp=null path=null params={} {add=[100013]} 0 1
   [junit4]   2> 1202185 T4364 C5612 oasup.LogUpdateProcessor.finish [collection1] webapp=null path=null params={} {add=[100014]} 0 1
   [junit4]   2> 1202189 T4364 C5612 oasup.LogUpdateProcessor.finish [collection1] webapp=null path=null params={} {add=[100015]} 0 1
   [junit4]   2> 1202194 T4364 C5612 oasup.LogUpdateProcessor.finish [collection1] webapp=null path=null params={} {add=[100016]} 0 1
   [junit4]   2> 1202198 T4364 C5612 oasup.LogUpdateProcessor.finish [collection1] webapp=null path=null params={} {add=[100017]} 0 1
   [junit4]   2> 1202202 T4364 C5612 oasup.LogUpdateProcessor.finish [collection1] webapp=null path=null params={} {add=[100018]} 0 1
   [junit4]   2> 1202206 T4364 C5612 oasup.LogUpdateProcessor.finish [collection1] webapp=null path=null params={} {add=[100019]} 0 0
   [junit4]   2> 1202211 T4364 C5612 oasup.LogUpdateProcessor.finish [collection1] webapp=null path=null params={} {add=[100020]} 0 1
   [junit4]   2> 1202214 T4364 C5612 oasup.LogUpdateProcessor.finish [collection1] webapp=null path=null params={} {add=[100021]} 0 0
   [junit4]   2> 1202219 T4364 C5612 oasup.LogUpdateProcessor.finish [collection1] webapp=null path=null params={} {add=[100022]} 0 1
   [junit4]   2> ASYNC  NEW_CORE C5613 name=collection1 org.apache.solr.core.SolrCore@7390d451
   [junit4]   2> 1202232 T4364 C5613 oasup.LogUpdateProcessor.finish [collection1] webapp=null path=null params={} {add=[100023]} 0 2
   [junit4]   2> 1202236 T4364 C5613 oasup.LogUpdateProcessor.finish [collection1] webapp=null path=null params={} {add=[100024]} 0 1
   [junit4]   2> 1202240 T4364 C5613 oasup.LogUpdateProcessor.finish [collection1] webapp=null path=null params={} {add=[100025]} 0 0
   [junit4]   2> 1202244 T4364 C5613 oasup.LogUpdateProcessor.finish [collection1] webapp=null path=null params={} {add=[100026]} 0 1
   [junit4]   2> 1202247 T4364 C5613 oasup.LogUpdateProcessor.finish [collection1] webapp=null path=null params={} {add=[100027]} 0 1
   [junit4]   2> 1202250 T4364 C5613 oasup.LogUpdateProcessor.finish [collection1] webapp=null path=null params={} {add=[100028]} 0 0
   [junit4]   2> 1202254 T4364 C5613 oasup.LogUpdateProcessor.finish [collection1] webapp=null path=null params={} {add=[100029]} 0 1
   [junit4]   2> 1202258 T4364 C5613 oasup.LogUpdateProcessor.finish [collection1] webapp=null path=null params={} {add=[100030]} 0 1
   [junit4]   2> 1202261 T4364 C5613 oasup.LogUpdateProcessor.finish [collection1] webapp=null path=null params={} {add=[100031]} 0 0
   [junit4]   2> 1202265 T4364 C5613 oasup.LogUpdateProcessor.finish [collection1] webapp=null path=null params={} {add=[100032]} 0 1
   [junit4]   2> 1202268 T4364 C5613 oasup.LogUpdateProcessor.finish [collection1] webapp=null path=null params={} {add=[100033]} 0 1
   [junit4]   2> 1202271 T4364 C5613 oasup.LogUpdateProcessor.finish [collection1] webapp=null path=null params={} {add=[100034]} 0 0
   [junit4]   2> 1202275 T4364 C5613 oasup.LogUpdateProcessor.finish [collection1] webapp=null path=null params={} {add=[100035]} 0 1
   [junit4]   2> 1202278 T4364 C5613 oasup.LogUpdateProcessor.finish [collection1] webapp=null path=null params={} {add=[100036]} 0 1
   [junit4]   2> 1202281 T4364 C5613 oasup.LogUpdateProcessor.finish [collection1] webapp=null path=null params={} {add=[100037]} 0 0
   [junit4]   2> 1202285 T4364 C5613 oasup.LogUpdateProcessor.finish [collection1] webapp=null path=null params={} {add=[100038]} 0 1
   [junit4]   2> 1202288 T4364 C5613 oasup.LogUpdateProcessor.finish [collection1] webapp=null path=null params={} {add=[100039]} 0 1
   [junit4]   2> 1202293 T4364 C5613 oasup.LogUpdateProcessor.finish [collection1] webapp=null path=null params={} {add=[100040]} 0 1
   [junit4]   2> 1202296 T4364 C5613 oasup.LogUpdateProcessor.finish [collection1] webapp=null path=null params={} {add=[100041]} 0 0
   [junit4]   2> ASYNC  NEW_CORE C5614 name=collection1 org.apache.solr.core.SolrCore@7390d451
   [junit4]   2> 1202308 T4364 C5614 oasup.LogUpdateProcessor.finish [collection1] webapp=null path=null params={} {add=[100042]} 0 0
   [junit4]   2> 1202312 T4364 C5614 oasup.LogUpdateProcessor.finish [collection1] webapp=null path=null params={} {add=[100043]} 0 1
   [junit4]   2> 1202315 T4364 C5614 oasup.LogUpdateProcessor.finish [collection1] webapp=null path=null params={} {add=[100044]} 0 1
   [junit4]   2> 1202318 T4364 C5614 oasup.LogUpdateProcessor.finish [collection1] webapp=null path=null params={} {add=[100045]} 0 1
   [junit4]   2> 1202321 T4364 C5614 oasup.LogUpdateProcessor.finish [collection1] webapp=null path=null params={} {add=[100046]} 0 0
   [junit4]   2> 1202324 T4364 C5614 oasup.LogUpdateProcessor.finish [collection1] webapp=null path=null params={} {add=[100047]} 0 0
   [junit4]   2> 1202328 T4364 C5614 oasup.LogUpdateProcessor.finish [collection1] webapp=null path=null params={} {add=[100048]} 0 1
   [junit4]   2> 1202331 T4364 C5614 oasup.LogUpdateProcessor.finish [collection1] webapp=null path=null params={} {add=[100049]} 0 1
   [junit4]   2> 1202334 T4364 C5614 oasup.LogUpdateProcessor.finish [collection1] webapp=null path=null params={} {add=[100050]} 0 0
   [junit4]   2> 1202337 T4364 C5614 oasup.LogUpdateProcessor.finish [collection1] webapp=null path=null params={} {add=[100051]} 0 0
   [junit4]   2> 1202340 T4364 C5614 oasup.LogUpdateProcessor.finish [collection1] webapp=null path=null params={} {add=[100052]} 0 0
   [junit4]   2> 1202343 T4364 C5614 oasup.LogUpdateProcessor.finish [collection1] webapp=null path=null params={} {add=[100053]} 0 0
   [junit4]   2> 1202346 T4364 C5614 oasup.LogUpdateProcessor.finish [collection1] webapp=null path=null params={} {add=[100054]} 0 0
   [junit4]   2> 1202349 T4364 C5614 oasup.LogUpdateProcessor.finish [collection1] webapp=null path=null params={} {add=[100055]} 0 1
   [junit4]   2> 1202352 T4364 C5614 oasup.LogUpdateProcessor.finish [collection1] webapp=null path=null params={} {add=[100056]} 0 1
   [junit4]   2> 1202355 T4364 C5614 oasup.LogUpdateProcessor.finish [collection1] webapp=null path=null params={} {add=[100057]} 0 1
   [junit4]   2> 1202358 T4364 C5614 oasup.LogUpdateProcessor.finish [collection1] webapp=null path=null params={} {add=[100058]} 0 1
   [junit4]   2> 1202361 T4364 C5614 oasup.LogUpdateProcessor.finish [collection1] webapp=null path=null params={} {add=[100059]} 0 1
   [junit4]   2> 1202364 T4364 C5614 oasup.LogUpdateProcessor.finish [collection1] webapp=null path=null params={} {add=[100060]} 0 1
   [junit4]   2> 1202368 T4364 C5614 oasup.LogUpdateProcessor.finish [collection1] webapp=null path=null params={} {add=[100061]} 0 1
   [junit4]   2> ASYNC  NEW_CORE C5615 name=collection1 org.apache.solr.core.SolrCore@7390d451
   [junit4]   2> 1202380 T4364 C5615 oasup.LogUpdateProcessor.finish [collection1] webapp=null path=null params={} {add=[100062]} 0 0
   [junit4]   2> 1202384 T4364 C5615 oasup.LogUpdateProcessor.finish [collection1] webapp=null path=null params={} {add=[100063]} 0 0
   [junit4]   2> 1202388 T4364 C5615 oasup.LogUpdateProcessor.finish [collection1] webapp=null path=null params={} {add=[100064]} 0 1
   [junit4]   2> 1202392 T4364 C5615 oasup.LogUpdateProcessor.finish [collection1] webapp=null path=null params={} {add=[100065]} 0 1
   [junit4]   2> 1202395 T4364 C5615 oasup.LogUpdateProcessor.finish [collection1] webapp=null path=null params={} {add=[100066]} 0 0
   [junit4]   2> 1202399 T4364 C5615 oasup.LogUpdateProcessor.finish [collection1] webapp=null path=null params={} {add=[100067]} 0 1
   [junit4]   2> 1202403 T4364 C5615 oasup.LogUpdateProcessor.finish [collection1] webapp=null path=null params={} {add=[100068]} 0 1
   [junit4]   2> 1202407 T4364 C5615 oasup.LogUpdateProcessor.finish [collection1] webapp=null path=null params={} {add=[100069]} 0 1
   [junit4]   2> 1202411 T4364 C5615 oasup.LogUpdateProcessor.finish [collection1] webapp=null path=null params={} {add=[100070]} 0 1
   [junit4]   2> 1202414 T4364 C5615 oasup.LogUpdateProcessor.finish [collection1] webapp=null path=null params={} {add=[100071]} 0 0
   [junit4]   2> 1202418 T4364 C5615 oasup.LogUpdateProcessor.finish [collection1] webapp=null path=null params={} {add=[100072]} 0 1
   [junit4]   2> 1202422 T4364 C5615 oasup.LogUpdateProcessor.finish [collection1] webapp=null path=null params={} {add=[100073]} 0 0
   [junit4]   2> 1202426 T4364 C5615 oasup.LogUpdateProcessor.finish [collection1] webapp=null path=null params={} {add=[100074]} 0 1
   [junit4]   2> 1202430 T4364 C5615 oasup.LogUpdateProcessor.finish [collection1] webapp=null path=null params={} {add=[100075]} 0 1
   [junit4]   2> 1202433 T4364 C5615 oasup.LogUpdateProcessor.finish [collection1] webapp=null path=null params={} {add=[100076]} 0 1
   [junit4]   2> 1202436 T4364 C5615 oasup.LogUpdateProcessor.finish [collection1] webapp=null path=null params={} {add=[100077]} 0 0
   [junit4]   2> 1202440 T4364 C5615 oasup.LogUpdateProcessor.finish [collection1] webapp=null path=null params={} {add=[100078]} 0 0
   [junit4]   2> 1202444 T4364 C5615 oasup.LogUpdateProcessor.finish [collection1] webapp=null path=null params={} {add=[100079]} 0 1
   [junit4]   2> 1202447 T4364 C5615 oasup.LogUpdateProcessor.finish [collection1] webapp=null path=null params={} {add=[100080]} 0 1
   [junit4]   2> 1202451 T4364 C5615 oasup.LogUpdateProcessor.finish [collection1] webapp=null path=null params={} {add=[100081]} 0 1
   [junit4]   2> ASYNC  NEW_CORE C5616 name=collection1 org.apache.solr.core.SolrCore@7390d451
   [junit4]   2> 1202463 T4364 C5616 oasup.LogUpdateProcessor.finish [collection1] webapp=null path=null params={} {add=[100082]} 0 1
   [junit4]   2> 1202467 T4364 C5616 oasup.LogUpdateProcessor.finish [collection1] webapp=null path=null params={} {add=[100083]} 0 1
   [junit4]   2> 1202470 T4364 C5616 oasup.LogUpdateProcessor.finish [collection1] webapp=null path=null params={} {add=[100084]} 0 0
   [junit4]   2> 1202474 T4364 C5616 oasup.LogUpdateProcessor.finish [collection1] webapp=null path=null params={} {add=[100085]} 0 1
   [junit4]   2> 1202477 T4364 C5616 oasup.LogUpdateProcessor.finish [collection1] webapp=null path=null params={} {add=[100086]} 0 1
   [junit4]   2> 1202482 T4364 C5616 oasup.LogUpdateProcessor.finish [collection1] webapp=null path=null params={} {add=[100087]} 0 0
   [junit4]   2> 1202485 T4364 C5616 oasup.LogUpdateProcessor.finish [collection1] webapp=null path=null params={} {add=[100088]} 0 0
   [junit4]   2> 1202489 T4364 C5616 oasup.LogUpdateProcessor.finish [collection1] webapp=null path=null params={} {add=[100089]} 0 1
   [junit4]   2> 1202492 T4364 C5616 oasup.LogUpdateProcessor.finish [collection1] webapp=null path=null params={} {add=[100090]} 0 0
   [junit4]   2> 1202496 T4364 C5616 oasup.LogUpdateProcessor.finish [collection1] webapp=null path=null params={} {add=[100091]} 0 1
   [junit4]   2> 1202499 T4364 C5616 oasup.LogUpdateProcessor.finish [collection1] webapp=null path=null params={} {add=[100092]} 0 1
   [junit4]   2> 1202502 T4364 C5616 oasup.LogUpdateProcessor.finish [collection1] webapp=null path=null params={} {add=[100093]} 0 0
   [junit4]   2> 1202506 T4364 C5616 oasup.LogUpdateProcessor.finish [collection1] webapp=null path=null params={} {add=[100094]} 0 1
   [junit4]   2> 1202509 T4364 C5616 oasup.LogUpdateProcessor.finish [collection1] webapp=null path=null params={} {add=[100095]} 0 1
   [junit4]   2> 1202512 T4364 C5616 oasup.LogUpdateProcessor.finish [collection1] webapp=null path=null params={} {add=[100096]} 0 0
   [junit4]   2> 1202515 T4364 C5616 oasup.LogUpdateProcessor.finish [collection1] webapp=null path=null params={} {add=[100097]} 0 0
   [junit4]   2> 1202519 T4364 C5616 oasup.LogUpdateProcessor.finish [collection1] webapp=null path=null params={} {add=[100098]} 0 1
   [junit4]   2> 1202522 T4364 C5616 oasup.LogUpdateProcessor.finish [collection1] webapp=null path=null params={} {add=[100099]} 0 0
   [junit4]   2> 1202525 T4364 C5616 oasu.DirectUpdateHandler2.commit start commit{,optimize=false,openSearcher=true,waitSearcher=true,expungeDeletes=false,softCommit=false,prepareCommit=false}
   [junit4]   2> 1202534 T4364 C5616 oasc.SolrDeletionPolicy.onCommit SolrDeletionPolicy.onCommit: commits: num=2
   [junit4]   2> 		commit{dir=MockDirectoryWrapper(org.apache.lucene.store.RAMDirectory@75699f6c lockFactory=org.apache.lucene.store.SingleInstanceLockFactory@4c9065ac),segFN=segments_1,generation=1}
   [junit4]   2> 		commit{dir=MockDirectoryWrapper(org.apache.lucene.store.RAMDirectory@75699f6c lockFactory=org.apache.lucene.store.SingleInstanceLockFactory@4c9065ac),segFN=segments_2,generation=2}
   [junit4]   2> 1202535 T4364 C5616 oasc.SolrDeletionPolicy.updateCommits newest commit generation = 2
   [junit4]   2> 1202536 T4364 C5616 oass.SolrIndexSearcher.<init> Opening Searcher@1067d7ef main
   [junit4]   2> 1202537 T4364 C5616 oasu.DirectUpdateHandler2.commit end_commit_flush
   [junit4]   2> 1202537 T4366 oasc.SolrCore.registerSearcher [collection1] Registered new searcher Searcher@1067d7ef main{StandardDirectoryReader(segments_2:4:nrt _0(5.0):c100)}
   [junit4]   2> 1202537 T4364 C5616 oasup.LogUpdateProcessor.finish [collection1] webapp=null path=null params={} {commit=} 0 12
   [junit4]   2> ASYNC  NEW_CORE C5617 name=collection1 org.apache.solr.core.SolrCore@7390d451
   [junit4]   2> 1202572 T4364 C5617 oasc.SolrCore.execute [collection1] webapp=null path=null params={o.nr.s.s=neg(sum(int_id))&o.cnr.s.c10=const_num(10)&o.csr.s.cs3=const_str(this+is+the+third)&o.cdr.s.cs2=const_str(1804-06-30T23:59:59Z)&o.ar.s.median=median(int_id)&o.cr.s.min=min(string_sd)&o.dmr.s.dmme=date_math(median(date_dtd),const_str(%2B2YEARS))&o.avr.s.c=abs(neg(count(long_ld)))&o.cdr.s.cs1=const_str(1800-12-31T23:59:59Z)&o.mr.s.su=mult(sum(int_id),unique(long_ld))&o.avr.s.sum=sum(int_id)&o.dr.s.sum=sum(int_id)&o.mr.s.mcm=mult(mean(int_id),count(long_ld),median(int_id))&o.ar.s.count=count(long_ld)&o.cr.s.max=max(string_sd)&o.nr.s.c=neg(count(long_ld))&o.rr.s.rmin=rev(min(string_sd))&o.dmr.s.cma=const_str(%2B2MONTHS)&o.mr.s.unique=unique(long_ld)&o.mr.s.mean=mean(int_id)&o.cnr.s.c8=const_num(8)&o.ar.s.mcm=add(mean(int_id),count(long_ld),median(int_id))&o.ar.s.su=add(sum(int_id),unique(long_ld))&o.pr.s.su=pow(sum(int_id),unique(long_ld))&o.dmr.s.max=max(date_dtd)&o.csr.s.cs1=const_str(this+is+the+first)&rows=0&o.dr.s.su=div(sum(int_id),unique(long_ld))&o.dr.s.mean=mean(int_id)&o.mr.s.sum=sum(int_id)&o.pr.s.unique=unique(long_ld)&o.cr.s.csmin=const_str(this+is+the+first)&o.mr.s.median=median(int_id)&o.cr.s.ccmax=concat(const_str(this+is+the+second),max(string_sd))&o.dr.s.unique=unique(long_ld)&indent=true&o.rr.s.max=max(string_sd)&o.ar.s.mean=mean(int_id)&o.pr.s.mc=pow(mean(int_id),count(long_ld))&o.dmr.s.cme=const_str(%2B2YEARS)&o.dr.s.mc=div(mean(int_id),count(long_ld))&o.dmr.s.dmma=date_math(max(date_dtd),const_str(%2B2MONTHS))&olap=true&o.pr.s.mean=mean(int_id)&o.avr.s.s=abs(neg(sum(int_id)))&o.nr.s.sum=sum(int_id)&o.cr.s.csmax=const_str(this+is+the+second)&o.mr.s.count=count(long_ld)&o.cr.s.ccmin=concat(const_str(this+is+the+first),min(string_sd))&o.dr.s.count=count(long_ld)&o.pr.s.sum=sum(int_id)&o.rr.s.min=min(string_sd)&o.nr.s.count=count(long_ld)&o.ar.s.sum=sum(int_id)&o.rr.s.rmax=rev(max(string_sd))&q=*:*&stats=true&o.cdr.s.cd1=const_date(1800-12-31T23:59:59Z)&o.csr.s.cs2=const_str(this+is+the+second)&o.cdr.s.cd2=const_date(1804-06-30T23:59:59Z)&o.pr.s.count=count(long_ld)&o.dmr.s.median=median(date_dtd)&o.ar.s.unique=unique(long_ld)&o.avr.s.count=count(long_ld)} hits=100 status=0 QTime=24 
   [junit4]   2> 1202578 T4364 oas.SolrTestCaseJ4.setUp ###Starting negateTest
   [junit4]   2> 1202580 T4364 oas.SolrTestCaseJ4.tearDown ###Ending negateTest
   [junit4]   2> NOTE: reproduce with: ant test  -Dtestcase=ExpressionTest -Dtests.method=negateTest -Dtests.seed=6C4A2E9E0C6867D7 -Dtests.multiplier=3 -Dtests.slow=true -Dtests.locale=es -Dtests.timezone=America/Argentina/Tucuman -Dtests.file.encoding=ISO-8859-1
   [junit4] FAILURE 0.01s J0 | ExpressionTest.negateTest <<<
   [junit4]    > Throwable #1: java.lang.AssertionError: Caught exception in getStatResult, xPath = /response/lst[@name='stats']/lst[@name='nr']/double[@name='sum'] 
   [junit4]    > raw data: <?xml version="1.0" encoding="UTF-8"?>
   [junit4]    > <response>
   [junit4]    > <lst name="responseHeader">
   [junit4]    >   <int name="status">0</int>
   [junit4]    >   <int name="QTime">24</int>
   [junit4]    > </lst>
   [junit4]    > <result name="response" numFound="100" start="0">
   [junit4]    > </result>
   [junit4]    > <lst name="stats">
   [junit4]    >   <lst name="stats_fields"/>
   [junit4]    > </lst>
   [junit4]    > <lst name="stats">
   [junit4]    >   <lst name="pr">
   [junit4]    >     <long name="count">100</long>
   [junit4]    >     <null name="mc"/>
   [junit4]    >     <null name="mean"/>
   [junit4]    >     <null name="su"/>
   [junit4]    >     <null name="sum"/>
   [junit4]    >     <null name="unique"/>
   [junit4]    >   </lst>
   [junit4]    >   <lst name="cnr">
   [junit4]    >     <double name="c10">10.0</double>
   [junit4]    >     <double name="c8">8.0</double>
   [junit4]    >   </lst>
   [junit4]    >   <lst name="csr">
   [junit4]    >     <str name="cs1">this is the first</str>
   [junit4]    >     <str name="cs2">this is the second</str>
   [junit4]    >     <str name="cs3">this is the third</str>
   [junit4]    >   </lst>
   [junit4]    >   <lst name="dmr">
   [junit4]    >     <str name="cma">+2MONTHS</str>
   [junit4]    >     <str name="cme">+2YEARS</str>
   [junit4]    >     <date name="dmma">1812-02-29T23:59:59Z</date>
   [junit4]    >     <date name="dmme">1807-12-31T23:59:59Z</date>
   [junit4]    >     <date name="max">1811-12-31T23:59:59Z</date>
   [junit4]    >     <date name="median">1805-12-31T23:59:59Z</date>
   [junit4]    >   </lst>
   [junit4]    >   <lst name="ar">
   [junit4]    >     <long name="count">100</long>
   [junit4]    >     <null name="mcm"/>
   [junit4]    >     <null name="mean"/>
   [junit4]    >     <null name="median"/>
   [junit4]    >     <null name="su"/>
   [junit4]    >     <null name="sum"/>
   [junit4]    >     <null name="unique"/>
   [junit4]    >   </lst>
   [junit4]    >   <lst name="cdr">
   [junit4]    >     <date name="cd1">1800-12-31T23:59:59Z</date>
   [junit4]    >     <date name="cd2">1804-06-30T23:59:59Z</date>
   [junit4]    >     <str name="cs1">1800-12-31T23:59:59Z</str>
   [junit4]    >     <str name="cs2">1804-06-30T23:59:59Z</str>
   [junit4]    >   </lst>
   [junit4]    >   <lst name="dr">
   [junit4]    >     <long name="count">100</long>
   [junit4]    >     <null name="mc"/>
   [junit4]    >     <null name="mean"/>
   [junit4]    >     <null name="su"/>
   [junit4]    >     <null name="sum"/>
   [junit4]    >     <null name="unique"/>
   [junit4]    >   </lst>
   [junit4]    >   <lst name="rr">
   [junit4]    >     <str name="max">str9</str>
   [junit4]    >     <str name="min">str0</str>
   [junit4]    >     <str name="rmax">9rts</str>
   [junit4]    >     <str name="rmin">0rts</str>
   [junit4]    >   </lst>
   [junit4]    >   <lst name="mr">
   [junit4]    >     <long name="count">100</long>
   [junit4]    >     <null name="mcm"/>
   [junit4]    >     <null name="mean"/>
   [junit4]    >     <null name="median"/>
   [junit4]    >     <null name="su"/>
   [junit4]    >     <null name="sum"/>
   [junit4]    >     <null name="unique"/>
   [junit4]    >   </lst>
   [junit4]    >   <lst name="nr">
   [junit4]    >     <double name="c">-100.0</double>
   [junit4]    >     <long name="count">100</long>
   [junit4]    >     <null name="s"/>
   [junit4]    >     <null name="sum"/>
   [junit4]    >   </lst>
   [junit4]    >   <lst 

[...truncated too long message...]

unique"/>
   [junit4]    >   </lst>
   [junit4]    >   <lst name="nr">
   [junit4]    >     <double name="c">-100.0</double>
   [junit4]    >     <long name="count">100</long>
   [junit4]    >     <null name="s"/>
   [junit4]    >     <null name="sum"/>
   [junit4]    >   </lst>
   [junit4]    >   <lst name="avr">
   [junit4]    >     <double name="c">100.0</double>
   [junit4]    >     <long name="count">100</long>
   [junit4]    >     <null name="s"/>
   [junit4]    >     <null name="sum"/>
   [junit4]    >   </lst>
   [junit4]    >   <lst name="cr">
   [junit4]    >     <str name="ccmax">this is the secondstr9</str>
   [junit4]    >     <str name="ccmin">this is the firststr0</str>
   [junit4]    >     <str name="csmax">this is the second</str>
   [junit4]    >     <str name="csmin">this is the first</str>
   [junit4]    >     <str name="max">str9</str>
   [junit4]    >     <str name="min">str0</str>
   [junit4]    >   </lst>
   [junit4]    > </lst>
   [junit4]    > </response>
   [junit4]    > 	at __randomizedtesting.SeedInfo.seed([6C4A2E9E0C6867D7:7CB30E0396651B9]:0)
   [junit4]    > 	at org.apache.solr.analytics.AbstractAnalyticsStatsTest.getStatResult(AbstractAnalyticsStatsTest.java:113)
   [junit4]    > 	at org.apache.solr.analytics.expression.ExpressionTest.multiplyTest(ExpressionTest.java:92)
   [junit4]    > 	at java.lang.Thread.run(Thread.java:744)
   [junit4]   2> 1202684 T4364 oas.SolrTestCaseJ4.deleteCore ###deleteCore
   [junit4]   2> 1202684 T4364 oasc.CoreContainer.shutdown Shutting down CoreContainer instance=1543785628
   [junit4]   2> 1202684 T4364 oasc.SolrCore.close [collection1]  CLOSING SolrCore org.apache.solr.core.SolrCore@7390d451
   [junit4]   2> 1202685 T4364 oasu.DirectUpdateHandler2.close closing DirectUpdateHandler2{commits=1,autocommits=0,soft autocommits=0,optimizes=0,rollbacks=0,expungeDeletes=0,docsPending=0,adds=0,deletesById=0,deletesByQuery=0,errors=0,cumulative_adds=100,cumulative_deletesById=0,cumulative_deletesByQuery=1,cumulative_errors=0}
   [junit4]   2> 1202685 T4364 oasu.SolrCoreState.decrefSolrCoreState Closing SolrCoreState
   [junit4]   2> 1202685 T4364 oasu.DefaultSolrCoreState.closeIndexWriter SolrCoreState ref count has reached 0 - closing IndexWriter
   [junit4]   2> 1202685 T4364 oasu.DefaultSolrCoreState.closeIndexWriter closing IndexWriter with IndexWriterCloser
   [junit4]   2> 1202686 T4364 oasc.SolrCore.closeSearcher [collection1] Closing main searcher on request.
   [junit4]   2> 1202686 T4364 oasc.CachingDirectoryFactory.close Closing MockDirectoryFactory - 2 directories currently being tracked
   [junit4]   2> 1202686 T4364 oasc.CachingDirectoryFactory.closeCacheValue looking to close /mnt/ssd/jenkins/workspace/Lucene-Solr-trunk-Linux/solr/build/solr-core/test/J0/./solrtest-ExpressionTest-1387514876439 [CachedDir<<refCount=0;path=/mnt/ssd/jenkins/workspace/Lucene-Solr-trunk-Linux/solr/build/solr-core/test/J0/./solrtest-ExpressionTest-1387514876439;done=false>>]
   [junit4]   2> 1202686 T4364 oasc.CachingDirectoryFactory.close Closing directory: /mnt/ssd/jenkins/workspace/Lucene-Solr-trunk-Linux/solr/build/solr-core/test/J0/./solrtest-ExpressionTest-1387514876439
   [junit4]   2> 1202687 T4364 oasc.CachingDirectoryFactory.closeCacheValue looking to close /mnt/ssd/jenkins/workspace/Lucene-Solr-trunk-Linux/solr/build/solr-core/test/J0/./solrtest-ExpressionTest-1387514876439/index [CachedDir<<refCount=0;path=/mnt/ssd/jenkins/workspace/Lucene-Solr-trunk-Linux/solr/build/solr-core/test/J0/./solrtest-ExpressionTest-1387514876439/index;done=false>>]
   [junit4]   2> 1202687 T4364 oasc.CachingDirectoryFactory.close Closing directory: /mnt/ssd/jenkins/workspace/Lucene-Solr-trunk-Linux/solr/build/solr-core/test/J0/./solrtest-ExpressionTest-1387514876439/index
   [junit4]   2> NOTE: test params are: codec=Lucene46: {id=PostingsFormat(name=NestedPulsing), string_sd=PostingsFormat(name=NestedPulsing), double_dd=PostingsFormat(name=Lucene41WithOrds), date_dtd=PostingsFormat(name=NestedPulsing), long_ld=PostingsFormat(name=NestedPulsing), int_id=PostingsFormat(name=NestedPulsing), float_fd=FSTOrd41}, docValues:{string_sd=DocValuesFormat(name=SimpleText), double_dd=DocValuesFormat(name=Lucene45), date_dtd=DocValuesFormat(name=SimpleText), int_id=DocValuesFormat(name=SimpleText), long_ld=DocValuesFormat(name=SimpleText), datedv=DocValuesFormat(name=Memory), stringdv=DocValuesFormat(name=SimpleText), longdv=DocValuesFormat(name=Lucene45), stringdvm=DocValuesFormat(name=Lucene45), floatdv=DocValuesFormat(name=Lucene45), float_fd=DocValuesFormat(name=Disk), doubledv=DocValuesFormat(name=SimpleText), intdv=DocValuesFormat(name=Disk)}, sim=DefaultSimilarity, locale=es, timezone=America/Argentina/Tucuman
   [junit4]   2> NOTE: Linux 3.8.0-34-generic amd64/Oracle Corporation 1.7.0_60-ea (64-bit)/cpus=8,threads=1,free=49755024,total=172072960
   [junit4]   2> NOTE: All tests run in this JVM: [TestSchemaSimilarityResource, DeleteShardTest, IndexSchemaTest, TestLRUCache, ClusterStateUpdateTest, DocumentBuilderTest, TestSolrQueryParser, SpellPossibilityIteratorTest, TestInfoStreamLogging, UUIDFieldTest, StatelessScriptUpdateProcessorFactoryTest, DirectUpdateHandlerOptimizeTest, BJQParserTest, TestSchemaVersionResource, TestRandomDVFaceting, TestTrie, JsonLoaderTest, PeerSyncTest, TestSystemIdResolver, TestLFUCache, TestPerFieldSimilarity, TestDocBasedVersionConstraints, TestConfig, TestShardHandlerFactory, CacheHeaderTest, DOMUtilTest, TestStressVersions, TestJmxMonitoredMap, TestFunctionQuery, TestPseudoReturnFields, ShowFileRequestHandlerTest, PrimitiveFieldTypeTest, InfoHandlerTest, BinaryUpdateRequestHandlerTest, TestUniqueKeyFieldResource, ModifyConfFileTest, AssignTest, HdfsRecoveryZkTest, SyncSliceTest, UpdateRequestProcessorFactoryTest, AbstractAnalyticsFacetTest, TriLevelCompositeIdRoutingTest, RecoveryZkTest, TestCollapseQParserPlugin, TestSolrIndexConfig, TestNoOpRegenerator, TestWriterPerf, SuggestComponentTest, TestSolrXmlPersistor, DateMathParserTest, TestDocumentBuilder, TestRealTimeGet, ZkControllerTest, TestPHPSerializedResponseWriter, RegexBoostProcessorTest, TestDocSet, ShardRoutingTest, TermsComponentTest, NoFacetTest, SimpleFacetsTest, TestPostingsSolrHighlighter, TestMergePolicyConfig, BadComponentTest, CoreMergeIndexesAdminHandlerTest, CoreAdminHandlerTest, SuggesterTest, CSVRequestHandlerTest, OverseerCollectionProcessorTest, TestValueSourceCache, CopyFieldTest, SampleTest, TestRemoteStreaming, TestLuceneMatchVersion, EnumFieldTest, SoftAutoCommitTest, RangeFacetTest, EchoParamsTest, WordBreakSolrSpellCheckerTest, SliceStateUpdateTest, TestBadConfig, TestSolrXMLSerializer, TestCharFilters, TestDistributedMissingSort, TestSort, QueryParsingTest, QueryElevationComponentTest, BasicDistributedZk2Test, OpenCloseCoreStressTest, OverseerTest, FullSolrCloudDistribCmdsTest, TestReplicationHandler, TestFaceting, TestStressReorder, TestReload, DistributedTermsComponentTest, TestRangeQuery, TestCoreContainer, TestSolr4Spatial, SolrCoreTest, SolrCmdDistributorTest, BadIndexSchemaTest, ConvertedLegacyTest, TestFiltering, DocValuesTest, TestStressLucene, SuggesterWFSTTest, TestCSVLoader, SchemaVersionSpecificBehaviorTest, TestUpdate, TestAtomicUpdateErrorCases, TestSolrDeletionPolicy1, XsltUpdateRequestHandlerTest, TestSurroundQueryParser, TestQueryUtils, StandardRequestHandlerTest, TestReversedWildcardFilterFactory, FileBasedSpellCheckerTest, PathHierarchyTokenizerFactoryTest, MoreLikeThisHandlerTest, TestArbitraryIndexDir, IndexSchemaRuntimeFieldTest, SolrPluginUtilsTest, ReturnFieldsTest, MBeansHandlerTest, PingRequestHandlerTest, SearchHandlerTest, UpdateParamsTest, ResponseLogComponentTest, TestSolrDeletionPolicy2, MultiTermTest, TestBinaryField, TestSearchPerf, NumericFieldsTest, MinimalSchemaTest, TestElisionMultitermQuery, TestFuzzyAnalyzedSuggestions, ExternalFileFieldSortTest, DirectSolrConnectionTest, TestPhraseSuggestions, SynonymTokenizerTest, TestXIncludeConfig, TestSweetSpotSimilarityFactory, TestDFRSimilarityFactory, TestLMDirichletSimilarityFactory, TestLMJelinekMercerSimilarityFactory, TestBM25SimilarityFactory, TestFastWriter, LegacyHTMLStripCharFilterTest, ResourceLoaderTest, ScriptEngineTest, OpenExchangeRatesOrgProviderTest, URLClassifyProcessorTest, PluginInfoTest, TestFastLRUCache, PreAnalyzedFieldTest, TestSuggestSpellingConverter, DateFieldTest, SpellingQueryConverterTest, ClusterStateTest, TestUtils, ZkNodePropsTest, SliceStateTest, SystemInfoHandlerTest, CircularListTest, SolrTestCaseJ4Test, ExpressionTest]
   [junit4] Completed on J0 in 0.80s, 12 tests, 6 failures <<< FAILURES!

[...truncated 165 lines...]
BUILD FAILED
/mnt/ssd/jenkins/workspace/Lucene-Solr-trunk-Linux/build.xml:453: The following error occurred while executing this line:
/mnt/ssd/jenkins/workspace/Lucene-Solr-trunk-Linux/build.xml:433: The following error occurred while executing this line:
/mnt/ssd/jenkins/workspace/Lucene-Solr-trunk-Linux/build.xml:39: The following error occurred while executing this line:
/mnt/ssd/jenkins/workspace/Lucene-Solr-trunk-Linux/extra-targets.xml:37: The following error occurred while executing this line:
/mnt/ssd/jenkins/workspace/Lucene-Solr-trunk-Linux/solr/build.xml:189: The following error occurred while executing this line:
/mnt/ssd/jenkins/workspace/Lucene-Solr-trunk-Linux/solr/common-build.xml:491: The following error occurred while executing this line:
/mnt/ssd/jenkins/workspace/Lucene-Solr-trunk-Linux/lucene/common-build.xml:1304: The following error occurred while executing this line:
/mnt/ssd/jenkins/workspace/Lucene-Solr-trunk-Linux/lucene/common-build.xml:937: There were test failures: 357 suites, 1572 tests, 6 failures, 34 ignored (6 assumptions)

Total time: 46 minutes 49 seconds
Build step 'Invoke Ant' marked build as failure
Description set: Java: 64bit/jdk1.7.0_60-ea-b01 -XX:+UseCompressedOops -XX:+UseSerialGC
Archiving artifacts
Recording test results
Email was triggered for: Failure
Sending email for trigger: Failure



Mime
View raw message