lucene-dev mailing list archives

Site index · List index
Message view « Date » · « Thread »
Top « Date » · « Thread »
From Policeman Jenkins Server <jenk...@thetaphi.de>
Subject [JENKINS] Lucene-Solr-trunk-Linux (64bit/jdk1.7.0_45) - Build # 8753 - Failure!
Date Fri, 20 Dec 2013 00:56:15 GMT
Build: http://jenkins.thetaphi.de/job/Lucene-Solr-trunk-Linux/8753/
Java: 64bit/jdk1.7.0_45 -XX:-UseCompressedOops -XX:+UseSerialGC

2 tests failed.
FAILED:  org.apache.solr.morphlines.cell.SolrCellMorphlineTest.testSolrCellDocumentTypes2

Error Message:
key:ignored_creation_date expected:<[2007-10-01T16:13:56Z]> but was:<[२००७-१०-०१T१६:१३:५६Z]>

Stack Trace:
java.lang.AssertionError: key:ignored_creation_date expected:<[2007-10-01T16:13:56Z]> but was:<[२००७-१०-०१T१६:१३:५६Z]>
	at __randomizedtesting.SeedInfo.seed([4BE440EC2E2C3C6C:C064FB0C29DAAF92]:0)
	at org.junit.Assert.fail(Assert.java:93)
	at org.junit.Assert.failNotEquals(Assert.java:647)
	at org.junit.Assert.assertEquals(Assert.java:128)
	at org.apache.solr.morphlines.solr.AbstractSolrMorphlineTestBase.testDocumentTypesInternal(AbstractSolrMorphlineTestBase.java:165)
	at org.apache.solr.morphlines.cell.SolrCellMorphlineTest.testSolrCellDocumentTypes2(SolrCellMorphlineTest.java:254)
	at sun.reflect.NativeMethodAccessorImpl.invoke0(Native Method)
	at sun.reflect.NativeMethodAccessorImpl.invoke(NativeMethodAccessorImpl.java:57)
	at sun.reflect.DelegatingMethodAccessorImpl.invoke(DelegatingMethodAccessorImpl.java:43)
	at java.lang.reflect.Method.invoke(Method.java:606)
	at com.carrotsearch.randomizedtesting.RandomizedRunner.invoke(RandomizedRunner.java:1559)
	at com.carrotsearch.randomizedtesting.RandomizedRunner.access$600(RandomizedRunner.java:79)
	at com.carrotsearch.randomizedtesting.RandomizedRunner$6.evaluate(RandomizedRunner.java:737)
	at com.carrotsearch.randomizedtesting.RandomizedRunner$7.evaluate(RandomizedRunner.java:773)
	at com.carrotsearch.randomizedtesting.RandomizedRunner$8.evaluate(RandomizedRunner.java:787)
	at com.carrotsearch.randomizedtesting.rules.SystemPropertiesRestoreRule$1.evaluate(SystemPropertiesRestoreRule.java:53)
	at org.apache.lucene.util.TestRuleSetupTeardownChained$1.evaluate(TestRuleSetupTeardownChained.java:50)
	at org.apache.lucene.util.TestRuleFieldCacheSanity$1.evaluate(TestRuleFieldCacheSanity.java:51)
	at org.apache.lucene.util.AbstractBeforeAfterRule$1.evaluate(AbstractBeforeAfterRule.java:46)
	at com.carrotsearch.randomizedtesting.rules.SystemPropertiesInvariantRule$1.evaluate(SystemPropertiesInvariantRule.java:55)
	at org.apache.lucene.util.TestRuleThreadAndTestName$1.evaluate(TestRuleThreadAndTestName.java:49)
	at org.apache.lucene.util.TestRuleIgnoreAfterMaxFailures$1.evaluate(TestRuleIgnoreAfterMaxFailures.java:70)
	at org.apache.lucene.util.TestRuleMarkFailure$1.evaluate(TestRuleMarkFailure.java:48)
	at com.carrotsearch.randomizedtesting.rules.StatementAdapter.evaluate(StatementAdapter.java:36)
	at com.carrotsearch.randomizedtesting.ThreadLeakControl$StatementRunner.run(ThreadLeakControl.java:358)
	at com.carrotsearch.randomizedtesting.ThreadLeakControl.forkTimeoutingTask(ThreadLeakControl.java:782)
	at com.carrotsearch.randomizedtesting.ThreadLeakControl$3.evaluate(ThreadLeakControl.java:442)
	at com.carrotsearch.randomizedtesting.RandomizedRunner.runSingleTest(RandomizedRunner.java:746)
	at com.carrotsearch.randomizedtesting.RandomizedRunner$3.evaluate(RandomizedRunner.java:648)
	at com.carrotsearch.randomizedtesting.RandomizedRunner$4.evaluate(RandomizedRunner.java:682)
	at com.carrotsearch.randomizedtesting.RandomizedRunner$5.evaluate(RandomizedRunner.java:693)
	at com.carrotsearch.randomizedtesting.rules.StatementAdapter.evaluate(StatementAdapter.java:36)
	at com.carrotsearch.randomizedtesting.rules.SystemPropertiesRestoreRule$1.evaluate(SystemPropertiesRestoreRule.java:53)
	at org.apache.lucene.util.AbstractBeforeAfterRule$1.evaluate(AbstractBeforeAfterRule.java:46)
	at org.apache.lucene.util.TestRuleStoreClassName$1.evaluate(TestRuleStoreClassName.java:42)
	at com.carrotsearch.randomizedtesting.rules.SystemPropertiesInvariantRule$1.evaluate(SystemPropertiesInvariantRule.java:55)
	at com.carrotsearch.randomizedtesting.rules.NoShadowingOrOverridesOnMethodsRule$1.evaluate(NoShadowingOrOverridesOnMethodsRule.java:39)
	at com.carrotsearch.randomizedtesting.rules.NoShadowingOrOverridesOnMethodsRule$1.evaluate(NoShadowingOrOverridesOnMethodsRule.java:39)
	at com.carrotsearch.randomizedtesting.rules.StatementAdapter.evaluate(StatementAdapter.java:36)
	at org.apache.lucene.util.TestRuleAssertionsRequired$1.evaluate(TestRuleAssertionsRequired.java:43)
	at org.apache.lucene.util.TestRuleMarkFailure$1.evaluate(TestRuleMarkFailure.java:48)
	at org.apache.lucene.util.TestRuleIgnoreAfterMaxFailures$1.evaluate(TestRuleIgnoreAfterMaxFailures.java:70)
	at org.apache.lucene.util.TestRuleIgnoreTestSuites$1.evaluate(TestRuleIgnoreTestSuites.java:55)
	at com.carrotsearch.randomizedtesting.rules.StatementAdapter.evaluate(StatementAdapter.java:36)
	at com.carrotsearch.randomizedtesting.ThreadLeakControl$StatementRunner.run(ThreadLeakControl.java:358)
	at java.lang.Thread.run(Thread.java:744)


FAILED:  org.apache.solr.morphlines.cell.SolrCellMorphlineTest.testSolrCellDocumentTypes

Error Message:
key:ignored_creation_date expected:<[2011-09-02T10:11:00Z]> but was:<[२०११-०९-०२T१०:११:००Z]>

Stack Trace:
java.lang.AssertionError: key:ignored_creation_date expected:<[2011-09-02T10:11:00Z]> but was:<[२०११-०९-०२T१०:११:००Z]>
	at __randomizedtesting.SeedInfo.seed([4BE440EC2E2C3C6C:D127E3724BF762B9]:0)
	at org.junit.Assert.fail(Assert.java:93)
	at org.junit.Assert.failNotEquals(Assert.java:647)
	at org.junit.Assert.assertEquals(Assert.java:128)
	at org.apache.solr.morphlines.solr.AbstractSolrMorphlineTestBase.testDocumentTypesInternal(AbstractSolrMorphlineTestBase.java:165)
	at org.apache.solr.morphlines.cell.SolrCellMorphlineTest.testSolrCellDocumentTypes(SolrCellMorphlineTest.java:192)
	at sun.reflect.NativeMethodAccessorImpl.invoke0(Native Method)
	at sun.reflect.NativeMethodAccessorImpl.invoke(NativeMethodAccessorImpl.java:57)
	at sun.reflect.DelegatingMethodAccessorImpl.invoke(DelegatingMethodAccessorImpl.java:43)
	at java.lang.reflect.Method.invoke(Method.java:606)
	at com.carrotsearch.randomizedtesting.RandomizedRunner.invoke(RandomizedRunner.java:1559)
	at com.carrotsearch.randomizedtesting.RandomizedRunner.access$600(RandomizedRunner.java:79)
	at com.carrotsearch.randomizedtesting.RandomizedRunner$6.evaluate(RandomizedRunner.java:737)
	at com.carrotsearch.randomizedtesting.RandomizedRunner$7.evaluate(RandomizedRunner.java:773)
	at com.carrotsearch.randomizedtesting.RandomizedRunner$8.evaluate(RandomizedRunner.java:787)
	at com.carrotsearch.randomizedtesting.rules.SystemPropertiesRestoreRule$1.evaluate(SystemPropertiesRestoreRule.java:53)
	at org.apache.lucene.util.TestRuleSetupTeardownChained$1.evaluate(TestRuleSetupTeardownChained.java:50)
	at org.apache.lucene.util.TestRuleFieldCacheSanity$1.evaluate(TestRuleFieldCacheSanity.java:51)
	at org.apache.lucene.util.AbstractBeforeAfterRule$1.evaluate(AbstractBeforeAfterRule.java:46)
	at com.carrotsearch.randomizedtesting.rules.SystemPropertiesInvariantRule$1.evaluate(SystemPropertiesInvariantRule.java:55)
	at org.apache.lucene.util.TestRuleThreadAndTestName$1.evaluate(TestRuleThreadAndTestName.java:49)
	at org.apache.lucene.util.TestRuleIgnoreAfterMaxFailures$1.evaluate(TestRuleIgnoreAfterMaxFailures.java:70)
	at org.apache.lucene.util.TestRuleMarkFailure$1.evaluate(TestRuleMarkFailure.java:48)
	at com.carrotsearch.randomizedtesting.rules.StatementAdapter.evaluate(StatementAdapter.java:36)
	at com.carrotsearch.randomizedtesting.ThreadLeakControl$StatementRunner.run(ThreadLeakControl.java:358)
	at com.carrotsearch.randomizedtesting.ThreadLeakControl.forkTimeoutingTask(ThreadLeakControl.java:782)
	at com.carrotsearch.randomizedtesting.ThreadLeakControl$3.evaluate(ThreadLeakControl.java:442)
	at com.carrotsearch.randomizedtesting.RandomizedRunner.runSingleTest(RandomizedRunner.java:746)
	at com.carrotsearch.randomizedtesting.RandomizedRunner$3.evaluate(RandomizedRunner.java:648)
	at com.carrotsearch.randomizedtesting.RandomizedRunner$4.evaluate(RandomizedRunner.java:682)
	at com.carrotsearch.randomizedtesting.RandomizedRunner$5.evaluate(RandomizedRunner.java:693)
	at com.carrotsearch.randomizedtesting.rules.StatementAdapter.evaluate(StatementAdapter.java:36)
	at com.carrotsearch.randomizedtesting.rules.SystemPropertiesRestoreRule$1.evaluate(SystemPropertiesRestoreRule.java:53)
	at org.apache.lucene.util.AbstractBeforeAfterRule$1.evaluate(AbstractBeforeAfterRule.java:46)
	at org.apache.lucene.util.TestRuleStoreClassName$1.evaluate(TestRuleStoreClassName.java:42)
	at com.carrotsearch.randomizedtesting.rules.SystemPropertiesInvariantRule$1.evaluate(SystemPropertiesInvariantRule.java:55)
	at com.carrotsearch.randomizedtesting.rules.NoShadowingOrOverridesOnMethodsRule$1.evaluate(NoShadowingOrOverridesOnMethodsRule.java:39)
	at com.carrotsearch.randomizedtesting.rules.NoShadowingOrOverridesOnMethodsRule$1.evaluate(NoShadowingOrOverridesOnMethodsRule.java:39)
	at com.carrotsearch.randomizedtesting.rules.StatementAdapter.evaluate(StatementAdapter.java:36)
	at org.apache.lucene.util.TestRuleAssertionsRequired$1.evaluate(TestRuleAssertionsRequired.java:43)
	at org.apache.lucene.util.TestRuleMarkFailure$1.evaluate(TestRuleMarkFailure.java:48)
	at org.apache.lucene.util.TestRuleIgnoreAfterMaxFailures$1.evaluate(TestRuleIgnoreAfterMaxFailures.java:70)
	at org.apache.lucene.util.TestRuleIgnoreTestSuites$1.evaluate(TestRuleIgnoreTestSuites.java:55)
	at com.carrotsearch.randomizedtesting.rules.StatementAdapter.evaluate(StatementAdapter.java:36)
	at com.carrotsearch.randomizedtesting.ThreadLeakControl$StatementRunner.run(ThreadLeakControl.java:358)
	at java.lang.Thread.run(Thread.java:744)




Build Log:
[...truncated 18249 lines...]
   [junit4] Suite: org.apache.solr.morphlines.cell.SolrCellMorphlineTest
   [junit4]   1> 2013-12-20 00:55:28,658 INFO  [SUITE-SolrCellMorphlineTest-seed#[4BE440EC2E2C3C6C]-worker] solr.SolrTestCaseJ4 (SolrTestCaseJ4.java:initCore(454)) - ####initCore
   [junit4]   1> 2013-12-20 00:55:28,695 INFO  [SUITE-SolrCellMorphlineTest-seed#[4BE440EC2E2C3C6C]-worker] core.SolrResourceLoader (SolrResourceLoader.java:<init>(116)) - new SolrResourceLoader for directory: '/mnt/ssd/jenkins/workspace/Lucene-Solr-trunk-Linux/solr/contrib/map-reduce/src/test-files/solr/collection1/'
   [junit4]   1> 2013-12-20 00:55:29,258 INFO  [SUITE-SolrCellMorphlineTest-seed#[4BE440EC2E2C3C6C]-worker] core.SolrConfig (SolrConfig.java:initLibs(503)) - Adding specified lib dirs to ClassLoader
   [junit4]   1> 2013-12-20 00:55:29,259 WARN  [SUITE-SolrCellMorphlineTest-seed#[4BE440EC2E2C3C6C]-worker] core.SolrResourceLoader (SolrResourceLoader.java:addToClassLoader(170)) - Can't find (or read) directory to add to classloader: ../../../contrib/extraction/lib (resolved as: /mnt/ssd/jenkins/workspace/Lucene-Solr-trunk-Linux/solr/contrib/map-reduce/src/test-files/solr/collection1/../../../contrib/extraction/lib).
   [junit4]   1> 2013-12-20 00:55:29,260 WARN  [SUITE-SolrCellMorphlineTest-seed#[4BE440EC2E2C3C6C]-worker] core.SolrResourceLoader (SolrResourceLoader.java:addToClassLoader(170)) - Can't find (or read) directory to add to classloader: ../../../dist/ (resolved as: /mnt/ssd/jenkins/workspace/Lucene-Solr-trunk-Linux/solr/contrib/map-reduce/src/test-files/solr/collection1/../../../dist).
   [junit4]   1> 2013-12-20 00:55:29,261 WARN  [SUITE-SolrCellMorphlineTest-seed#[4BE440EC2E2C3C6C]-worker] core.SolrResourceLoader (SolrResourceLoader.java:addToClassLoader(170)) - Can't find (or read) directory to add to classloader: ../../../contrib/clustering/lib/ (resolved as: /mnt/ssd/jenkins/workspace/Lucene-Solr-trunk-Linux/solr/contrib/map-reduce/src/test-files/solr/collection1/../../../contrib/clustering/lib).
   [junit4]   1> 2013-12-20 00:55:29,262 WARN  [SUITE-SolrCellMorphlineTest-seed#[4BE440EC2E2C3C6C]-worker] core.SolrResourceLoader (SolrResourceLoader.java:addToClassLoader(170)) - Can't find (or read) directory to add to classloader: ../../../dist/ (resolved as: /mnt/ssd/jenkins/workspace/Lucene-Solr-trunk-Linux/solr/contrib/map-reduce/src/test-files/solr/collection1/../../../dist).
   [junit4]   1> 2013-12-20 00:55:29,262 WARN  [SUITE-SolrCellMorphlineTest-seed#[4BE440EC2E2C3C6C]-worker] core.SolrResourceLoader (SolrResourceLoader.java:addToClassLoader(170)) - Can't find (or read) directory to add to classloader: ../../../contrib/langid/lib/ (resolved as: /mnt/ssd/jenkins/workspace/Lucene-Solr-trunk-Linux/solr/contrib/map-reduce/src/test-files/solr/collection1/../../../contrib/langid/lib).
   [junit4]   1> 2013-12-20 00:55:29,263 WARN  [SUITE-SolrCellMorphlineTest-seed#[4BE440EC2E2C3C6C]-worker] core.SolrResourceLoader (SolrResourceLoader.java:addToClassLoader(170)) - Can't find (or read) directory to add to classloader: ../../../dist/ (resolved as: /mnt/ssd/jenkins/workspace/Lucene-Solr-trunk-Linux/solr/contrib/map-reduce/src/test-files/solr/collection1/../../../dist).
   [junit4]   1> 2013-12-20 00:55:29,264 WARN  [SUITE-SolrCellMorphlineTest-seed#[4BE440EC2E2C3C6C]-worker] core.SolrResourceLoader (SolrResourceLoader.java:addToClassLoader(170)) - Can't find (or read) directory to add to classloader: ../../../contrib/velocity/lib (resolved as: /mnt/ssd/jenkins/workspace/Lucene-Solr-trunk-Linux/solr/contrib/map-reduce/src/test-files/solr/collection1/../../../contrib/velocity/lib).
   [junit4]   1> 2013-12-20 00:55:29,265 WARN  [SUITE-SolrCellMorphlineTest-seed#[4BE440EC2E2C3C6C]-worker] core.SolrResourceLoader (SolrResourceLoader.java:addToClassLoader(170)) - Can't find (or read) directory to add to classloader: ../../../dist/ (resolved as: /mnt/ssd/jenkins/workspace/Lucene-Solr-trunk-Linux/solr/contrib/map-reduce/src/test-files/solr/collection1/../../../dist).
   [junit4]   1> 2013-12-20 00:55:29,265 WARN  [SUITE-SolrCellMorphlineTest-seed#[4BE440EC2E2C3C6C]-worker] core.SolrResourceLoader (SolrResourceLoader.java:addToClassLoader(170)) - Can't find (or read) directory to add to classloader: /non/existent/dir/yields/warning (resolved as: /non/existent/dir/yields/warning).
   [junit4]   1> 2013-12-20 00:55:29,446 INFO  [SUITE-SolrCellMorphlineTest-seed#[4BE440EC2E2C3C6C]-worker] core.SolrConfig (SolrConfig.java:<init>(160)) - Using Lucene MatchVersion: LUCENE_43
   [junit4]   1> 2013-12-20 00:55:29,608 INFO  [SUITE-SolrCellMorphlineTest-seed#[4BE440EC2E2C3C6C]-worker] core.Config (SolrConfig.java:<init>(262)) - Loaded SolrConfig: /mnt/ssd/jenkins/workspace/Lucene-Solr-trunk-Linux/solr/contrib/map-reduce/src/test-files/solr/collection1/conf/solrconfig.xml
   [junit4]   1> 2013-12-20 00:55:29,621 INFO  [SUITE-SolrCellMorphlineTest-seed#[4BE440EC2E2C3C6C]-worker] schema.IndexSchema (IndexSchema.java:readSchema(426)) - Reading Solr Schema from /mnt/ssd/jenkins/workspace/Lucene-Solr-trunk-Linux/solr/contrib/map-reduce/src/test-files/solr/collection1/conf/schema.xml
   [junit4]   1> 2013-12-20 00:55:29,708 INFO  [SUITE-SolrCellMorphlineTest-seed#[4BE440EC2E2C3C6C]-worker] schema.IndexSchema (IndexSchema.java:readSchema(454)) - [null] Schema name=example
   [junit4]   1> 2013-12-20 00:55:30,622 INFO  [SUITE-SolrCellMorphlineTest-seed#[4BE440EC2E2C3C6C]-worker] schema.IndexSchema (IndexSchema.java:readSchema(552)) - unique key field: id
   [junit4]   1> 2013-12-20 00:55:30,795 INFO  [SUITE-SolrCellMorphlineTest-seed#[4BE440EC2E2C3C6C]-worker] schema.FileExchangeRateProvider (CurrencyField.java:reload(781)) - Reloading exchange rates from file currency.xml
   [junit4]   1> 2013-12-20 00:55:30,807 INFO  [SUITE-SolrCellMorphlineTest-seed#[4BE440EC2E2C3C6C]-worker] schema.FileExchangeRateProvider (CurrencyField.java:reload(781)) - Reloading exchange rates from file currency.xml
   [junit4]   1> 2013-12-20 00:55:30,955 INFO  [SUITE-SolrCellMorphlineTest-seed#[4BE440EC2E2C3C6C]-worker] core.SolrResourceLoader (SolrResourceLoader.java:locateSolrHome(711)) - JNDI not configured for solr (NoInitialContextEx)
   [junit4]   1> 2013-12-20 00:55:30,956 INFO  [SUITE-SolrCellMorphlineTest-seed#[4BE440EC2E2C3C6C]-worker] core.SolrResourceLoader (SolrResourceLoader.java:locateSolrHome(723)) - using system property solr.solr.home: /mnt/ssd/jenkins/workspace/Lucene-Solr-trunk-Linux/solr/contrib/map-reduce/src/test-files/solr
   [junit4]   1> 2013-12-20 00:55:30,957 INFO  [SUITE-SolrCellMorphlineTest-seed#[4BE440EC2E2C3C6C]-worker] core.SolrResourceLoader (SolrResourceLoader.java:<init>(116)) - new SolrResourceLoader for directory: '/mnt/ssd/jenkins/workspace/Lucene-Solr-trunk-Linux/solr/contrib/map-reduce/src/test-files/solr/'
   [junit4]   1> 2013-12-20 00:55:30,991 INFO  [SUITE-SolrCellMorphlineTest-seed#[4BE440EC2E2C3C6C]-worker] core.SolrResourceLoader (SolrResourceLoader.java:locateSolrHome(711)) - JNDI not configured for solr (NoInitialContextEx)
   [junit4]   1> 2013-12-20 00:55:30,991 INFO  [SUITE-SolrCellMorphlineTest-seed#[4BE440EC2E2C3C6C]-worker] core.SolrResourceLoader (SolrResourceLoader.java:locateSolrHome(723)) - using system property solr.solr.home: /mnt/ssd/jenkins/workspace/Lucene-Solr-trunk-Linux/solr/contrib/map-reduce/src/test-files/solr
   [junit4]   1> 2013-12-20 00:55:30,992 INFO  [SUITE-SolrCellMorphlineTest-seed#[4BE440EC2E2C3C6C]-worker] core.SolrResourceLoader (SolrResourceLoader.java:<init>(112)) - new SolrResourceLoader for deduced Solr Home: '/mnt/ssd/jenkins/workspace/Lucene-Solr-trunk-Linux/solr/contrib/map-reduce/src/test-files/solr/'
   [junit4]   1> 2013-12-20 00:55:31,112 INFO  [SUITE-SolrCellMorphlineTest-seed#[4BE440EC2E2C3C6C]-worker] core.CoreContainer (CoreContainer.java:<init>(107)) - New CoreContainer 515799507
   [junit4]   1> 2013-12-20 00:55:31,113 INFO  [SUITE-SolrCellMorphlineTest-seed#[4BE440EC2E2C3C6C]-worker] core.CoreContainer (CoreContainer.java:load(187)) - Loading cores into CoreContainer [instanceDir=/mnt/ssd/jenkins/workspace/Lucene-Solr-trunk-Linux/solr/contrib/map-reduce/src/test-files/solr/]
   [junit4]   1> 2013-12-20 00:55:31,133 INFO  [SUITE-SolrCellMorphlineTest-seed#[4BE440EC2E2C3C6C]-worker] component.HttpShardHandlerFactory (HttpShardHandlerFactory.java:getParameter(169)) - Setting socketTimeout to: 0
   [junit4]   1> 2013-12-20 00:55:31,133 INFO  [SUITE-SolrCellMorphlineTest-seed#[4BE440EC2E2C3C6C]-worker] component.HttpShardHandlerFactory (HttpShardHandlerFactory.java:getParameter(169)) - Setting urlScheme to: http://
   [junit4]   1> 2013-12-20 00:55:31,134 INFO  [SUITE-SolrCellMorphlineTest-seed#[4BE440EC2E2C3C6C]-worker] component.HttpShardHandlerFactory (HttpShardHandlerFactory.java:getParameter(169)) - Setting connTimeout to: 0
   [junit4]   1> 2013-12-20 00:55:31,135 INFO  [SUITE-SolrCellMorphlineTest-seed#[4BE440EC2E2C3C6C]-worker] component.HttpShardHandlerFactory (HttpShardHandlerFactory.java:getParameter(169)) - Setting maxConnectionsPerHost to: 20
   [junit4]   1> 2013-12-20 00:55:31,135 INFO  [SUITE-SolrCellMorphlineTest-seed#[4BE440EC2E2C3C6C]-worker] component.HttpShardHandlerFactory (HttpShardHandlerFactory.java:getParameter(169)) - Setting corePoolSize to: 0
   [junit4]   1> 2013-12-20 00:55:31,136 INFO  [SUITE-SolrCellMorphlineTest-seed#[4BE440EC2E2C3C6C]-worker] component.HttpShardHandlerFactory (HttpShardHandlerFactory.java:getParameter(169)) - Setting maximumPoolSize to: 2147483647
   [junit4]   1> 2013-12-20 00:55:31,136 INFO  [SUITE-SolrCellMorphlineTest-seed#[4BE440EC2E2C3C6C]-worker] component.HttpShardHandlerFactory (HttpShardHandlerFactory.java:getParameter(169)) - Setting maxThreadIdleTime to: 5
   [junit4]   1> 2013-12-20 00:55:31,137 INFO  [SUITE-SolrCellMorphlineTest-seed#[4BE440EC2E2C3C6C]-worker] component.HttpShardHandlerFactory (HttpShardHandlerFactory.java:getParameter(169)) - Setting sizeOfQueue to: -1
   [junit4]   1> 2013-12-20 00:55:31,137 INFO  [SUITE-SolrCellMorphlineTest-seed#[4BE440EC2E2C3C6C]-worker] component.HttpShardHandlerFactory (HttpShardHandlerFactory.java:getParameter(169)) - Setting fairnessPolicy to: false
   [junit4]   1> 2013-12-20 00:55:31,373 INFO  [SUITE-SolrCellMorphlineTest-seed#[4BE440EC2E2C3C6C]-worker] logging.LogWatcher (LogWatcher.java:createWatcher(153)) - SLF4J impl is org.slf4j.impl.Log4jLoggerFactory
   [junit4]   1> 2013-12-20 00:55:31,375 INFO  [SUITE-SolrCellMorphlineTest-seed#[4BE440EC2E2C3C6C]-worker] logging.LogWatcher (LogWatcher.java:newRegisteredLogWatcher(138)) - Registering Log Listener [Log4j (org.slf4j.impl.Log4jLoggerFactory)]
   [junit4]   1> 2013-12-20 00:55:31,377 INFO  [SUITE-SolrCellMorphlineTest-seed#[4BE440EC2E2C3C6C]-worker] core.CoreContainer (CoreContainer.java:load(213)) - Host Name: 
   [junit4]   1> 2013-12-20 00:55:31,478 INFO  [coreLoadExecutor-3-thread-1] core.CoreContainer (CoreContainer.java:create(574)) - Creating SolrCore 'collection1' using instanceDir: /mnt/ssd/jenkins/workspace/Lucene-Solr-trunk-Linux/solr/contrib/map-reduce/src/test-files/solr/collection1
   [junit4]   1> 2013-12-20 00:55:31,480 INFO  [coreLoadExecutor-3-thread-1] core.SolrResourceLoader (SolrResourceLoader.java:<init>(116)) - new SolrResourceLoader for directory: '/mnt/ssd/jenkins/workspace/Lucene-Solr-trunk-Linux/solr/contrib/map-reduce/src/test-files/solr/collection1/'
   [junit4]   1> 2013-12-20 00:55:31,563 INFO  [coreLoadExecutor-3-thread-1] core.SolrConfig (SolrConfig.java:initLibs(503)) - Adding specified lib dirs to ClassLoader
   [junit4]   1> 2013-12-20 00:55:31,564 WARN  [coreLoadExecutor-3-thread-1] core.SolrResourceLoader (SolrResourceLoader.java:addToClassLoader(170)) - Can't find (or read) directory to add to classloader: ../../../contrib/extraction/lib (resolved as: /mnt/ssd/jenkins/workspace/Lucene-Solr-trunk-Linux/solr/contrib/map-reduce/src/test-files/solr/collection1/../../../contrib/extraction/lib).
   [junit4]   1> 2013-12-20 00:55:31,564 WARN  [coreLoadExecutor-3-thread-1] core.SolrResourceLoader (SolrResourceLoader.java:addToClassLoader(170)) - Can't find (or read) directory to add to classloader: ../../../dist/ (resolved as: /mnt/ssd/jenkins/workspace/Lucene-Solr-trunk-Linux/solr/contrib/map-reduce/src/test-files/solr/collection1/../../../dist).
   [junit4]   1> 2013-12-20 00:55:31,565 WARN  [coreLoadExecutor-3-thread-1] core.SolrResourceLoader (SolrResourceLoader.java:addToClassLoader(170)) - Can't find (or read) directory to add to classloader: ../../../contrib/clustering/lib/ (resolved as: /mnt/ssd/jenkins/workspace/Lucene-Solr-trunk-Linux/solr/contrib/map-reduce/src/test-files/solr/collection1/../../../contrib/clustering/lib).
   [junit4]   1> 2013-12-20 00:55:31,565 WARN  [coreLoadExecutor-3-thread-1] core.SolrResourceLoader (SolrResourceLoader.java:addToClassLoader(170)) - Can't find (or read) directory to add to classloader: ../../../dist/ (resolved as: /mnt/ssd/jenkins/workspace/Lucene-Solr-trunk-Linux/solr/contrib/map-reduce/src/test-files/solr/collection1/../../../dist).
   [junit4]   1> 2013-12-20 00:55:31,566 WARN  [coreLoadExecutor-3-thread-1] core.SolrResourceLoader (SolrResourceLoader.java:addToClassLoader(170)) - Can't find (or read) directory to add to classloader: ../../../contrib/langid/lib/ (resolved as: /mnt/ssd/jenkins/workspace/Lucene-Solr-trunk-Linux/solr/contrib/map-reduce/src/test-files/solr/collection1/../../../contrib/langid/lib).
   [junit4]   1> 2013-12-20 00:55:31,567 WARN  [coreLoadExecutor-3-thread-1] core.SolrResourceLoader (SolrResourceLoader.java:addToClassLoader(170)) - Can't find (or read) directory to add to classloader: ../../../dist/ (resolved as: /mnt/ssd/jenkins/workspace/Lucene-Solr-trunk-Linux/solr/contrib/map-reduce/src/test-files/solr/collection1/../../../dist).
   [junit4]   1> 2013-12-20 00:55:31,567 WARN  [coreLoadExecutor-3-thread-1] core.SolrResourceLoader (SolrResourceLoader.java:addToClassLoader(170)) - Can't find (or read) directory to add to classloader: ../../../contrib/velocity/lib (resolved as: /mnt/ssd/jenkins/workspace/Lucene-Solr-trunk-Linux/solr/contrib/map-reduce/src/test-files/solr/collection1/../../../contrib/velocity/lib).
   [junit4]   1> 2013-12-20 00:55:31,568 WARN  [coreLoadExecutor-3-thread-1] core.SolrResourceLoader (SolrResourceLoader.java:addToClassLoader(170)) - Can't find (or read) directory to add to classloader: ../../../dist/ (resolved as: /mnt/ssd/jenkins/workspace/Lucene-Solr-trunk-Linux/solr/contrib/map-reduce/src/test-files/solr/collection1/../../../dist).
   [junit4]   1> 2013-12-20 00:55:31,568 WARN  [coreLoadExecutor-3-thread-1] core.SolrResourceLoader (SolrResourceLoader.java:addToClassLoader(170)) - Can't find (or read) directory to add to classloader: /non/existent/dir/yields/warning (resolved as: /non/existent/dir/yields/warning).
   [junit4]   1> 2013-12-20 00:55:31,651 INFO  [coreLoadExecutor-3-thread-1] core.SolrConfig (SolrConfig.java:<init>(160)) - Using Lucene MatchVersion: LUCENE_43
   [junit4]   1> 2013-12-20 00:55:31,738 INFO  [coreLoadExecutor-3-thread-1] core.Config (SolrConfig.java:<init>(262)) - Loaded SolrConfig: /mnt/ssd/jenkins/workspace/Lucene-Solr-trunk-Linux/solr/contrib/map-reduce/src/test-files/solr/collection1/conf/solrconfig.xml
   [junit4]   1> 2013-12-20 00:55:31,739 INFO  [coreLoadExecutor-3-thread-1] schema.IndexSchema (IndexSchema.java:readSchema(426)) - Reading Solr Schema from /mnt/ssd/jenkins/workspace/Lucene-Solr-trunk-Linux/solr/contrib/map-reduce/src/test-files/solr/collection1/conf/schema.xml
   [junit4]   1> 2013-12-20 00:55:31,800 INFO  [coreLoadExecutor-3-thread-1] schema.IndexSchema (IndexSchema.java:readSchema(454)) - [collection1] Schema name=example
   [junit4]   1> 2013-12-20 00:55:32,385 INFO  [coreLoadExecutor-3-thread-1] schema.IndexSchema (IndexSchema.java:readSchema(552)) - unique key field: id
   [junit4]   1> 2013-12-20 00:55:32,416 INFO  [coreLoadExecutor-3-thread-1] schema.FileExchangeRateProvider (CurrencyField.java:reload(781)) - Reloading exchange rates from file currency.xml
   [junit4]   1> 2013-12-20 00:55:32,425 INFO  [coreLoadExecutor-3-thread-1] schema.FileExchangeRateProvider (CurrencyField.java:reload(781)) - Reloading exchange rates from file currency.xml
   [junit4]   1> 2013-12-20 00:55:32,515 INFO  [coreLoadExecutor-3-thread-1] core.SolrCore (SolrCore.java:initDirectoryFactory(440)) - org.apache.solr.core.MockDirectoryFactory
   [junit4]   1> 2013-12-20 00:55:32,524 INFO  [coreLoadExecutor-3-thread-1] core.SolrCore (SolrCore.java:<init>(690)) - [collection1] Opening new SolrCore at /mnt/ssd/jenkins/workspace/Lucene-Solr-trunk-Linux/solr/contrib/map-reduce/src/test-files/solr/collection1/, dataDir=/mnt/ssd/jenkins/workspace/Lucene-Solr-trunk-Linux/solr/build/contrib/solr-morphlines-cell/test/J0/./solrtest-SolrCellMorphlineTest-1387500928663/
   [junit4]   1> 2013-12-20 00:55:32,526 INFO  [coreLoadExecutor-3-thread-1] core.JmxMonitoredMap (JmxMonitoredMap.java:<init>(85)) - No JMX servers found, not exposing Solr information with JMX.
   [junit4]   1> 2013-12-20 00:55:32,537 INFO  [coreLoadExecutor-3-thread-1] core.SolrCore (SolrCore.java:initListeners(355)) - [collection1] Added SolrEventListener for newSearcher: org.apache.solr.core.QuerySenderListener{queries=[]}
   [junit4]   1> 2013-12-20 00:55:32,538 INFO  [coreLoadExecutor-3-thread-1] core.SolrCore (SolrCore.java:initListeners(351)) - [collection1] Added SolrEventListener for firstSearcher: org.apache.solr.core.QuerySenderListener{queries=[{q=static firstSearcher warming in solrconfig.xml}]}
   [junit4]   1> 2013-12-20 00:55:32,565 INFO  [coreLoadExecutor-3-thread-1] core.CachingDirectoryFactory (CachingDirectoryFactory.java:get(360)) - return new directory for /mnt/ssd/jenkins/workspace/Lucene-Solr-trunk-Linux/solr/build/contrib/solr-morphlines-cell/test/J0/./solrtest-SolrCellMorphlineTest-1387500928663
   [junit4]   1> 2013-12-20 00:55:32,566 INFO  [coreLoadExecutor-3-thread-1] core.SolrCore (SolrCore.java:getNewIndexDir(285)) - New index directory detected: old=null new=/mnt/ssd/jenkins/workspace/Lucene-Solr-trunk-Linux/solr/build/contrib/solr-morphlines-cell/test/J0/./solrtest-SolrCellMorphlineTest-1387500928663/index/
   [junit4]   1> 2013-12-20 00:55:32,567 WARN  [coreLoadExecutor-3-thread-1] core.SolrCore (SolrCore.java:initIndex(506)) - [collection1] Solr index directory '/mnt/ssd/jenkins/workspace/Lucene-Solr-trunk-Linux/solr/build/contrib/solr-morphlines-cell/test/J0/./solrtest-SolrCellMorphlineTest-1387500928663/index' doesn't exist. Creating new index...
   [junit4]   1> 2013-12-20 00:55:32,575 INFO  [coreLoadExecutor-3-thread-1] core.CachingDirectoryFactory (CachingDirectoryFactory.java:get(360)) - return new directory for /mnt/ssd/jenkins/workspace/Lucene-Solr-trunk-Linux/solr/build/contrib/solr-morphlines-cell/test/J0/./solrtest-SolrCellMorphlineTest-1387500928663/index
   [junit4]   1> 2013-12-20 00:55:32,617 INFO  [coreLoadExecutor-3-thread-1] core.SolrCore (SolrDeletionPolicy.java:onCommit(98)) - SolrDeletionPolicy.onCommit: commits: num=1
   [junit4]   1> 	commit{dir=MockDirectoryWrapper(org.apache.lucene.store.RAMDirectory@3971846 lockFactory=org.apache.lucene.store.NativeFSLockFactory@2c231468),segFN=segments_1,generation=1}
   [junit4]   1> 2013-12-20 00:55:32,619 INFO  [coreLoadExecutor-3-thread-1] core.SolrCore (SolrDeletionPolicy.java:updateCommits(165)) - newest commit generation = 1
   [junit4]   1> 2013-12-20 00:55:32,628 INFO  [coreLoadExecutor-3-thread-1] core.SolrCore (SolrCore.java:initWriters(1995)) - created json: solr.JSONResponseWriter
   [junit4]   1> 2013-12-20 00:55:32,628 INFO  [coreLoadExecutor-3-thread-1] core.SolrCore (SolrCore.java:initWriters(1977)) - adding lazy queryResponseWriter: solr.VelocityResponseWriter
   [junit4]   1> 2013-12-20 00:55:32,630 INFO  [coreLoadExecutor-3-thread-1] core.SolrCore (SolrCore.java:initWriters(1995)) - created velocity: solr.VelocityResponseWriter
   [junit4]   1> 2013-12-20 00:55:32,639 INFO  [coreLoadExecutor-3-thread-1] core.SolrCore (SolrCore.java:initWriters(1995)) - created xslt: solr.XSLTResponseWriter
   [junit4]   1> 2013-12-20 00:55:32,639 INFO  [coreLoadExecutor-3-thread-1] response.XSLTResponseWriter (XSLTResponseWriter.java:init(63)) - xsltCacheLifetimeSeconds=5
   [junit4]   1> 2013-12-20 00:55:32,887 INFO  [coreLoadExecutor-3-thread-1] core.SolrCore (SolrCore.java:loadUpdateProcessorChains(925)) - no updateRequestProcessorChain defined as default, creating implicit default
   [junit4]   1> 2013-12-20 00:55:32,909 INFO  [coreLoadExecutor-3-thread-1] core.RequestHandlers (RequestHandlers.java:initHandlersFromConfig(165)) - created /select: solr.SearchHandler
   [junit4]   1> 2013-12-20 00:55:32,910 INFO  [coreLoadExecutor-3-thread-1] core.RequestHandlers (RequestHandlers.java:initHandlersFromConfig(165)) - created /query: solr.SearchHandler
   [junit4]   1> 2013-12-20 00:55:32,914 INFO  [coreLoadExecutor-3-thread-1] core.RequestHandlers (RequestHandlers.java:initHandlersFromConfig(165)) - created /get: solr.RealTimeGetHandler
   [junit4]   1> 2013-12-20 00:55:32,915 INFO  [coreLoadExecutor-3-thread-1] core.RequestHandlers (RequestHandlers.java:initHandlersFromConfig(165)) - created /browse: solr.SearchHandler
   [junit4]   1> 2013-12-20 00:55:32,922 INFO  [coreLoadExecutor-3-thread-1] core.RequestHandlers (RequestHandlers.java:initHandlersFromConfig(165)) - created /update: solr.UpdateRequestHandler
   [junit4]   1> 2013-12-20 00:55:32,927 WARN  [coreLoadExecutor-3-thread-1] core.SolrResourceLoader (SolrResourceLoader.java:findClass(486)) - Solr loaded a deprecated plugin/analysis class [solr.JsonUpdateRequestHandler]. Please consult documentation how to replace it accordingly.
   [junit4]   1> 2013-12-20 00:55:32,927 INFO  [coreLoadExecutor-3-thread-1] core.RequestHandlers (RequestHandlers.java:initHandlersFromConfig(165)) - created /update/json: solr.JsonUpdateRequestHandler
   [junit4]   1> 2013-12-20 00:55:32,932 WARN  [coreLoadExecutor-3-thread-1] core.SolrResourceLoader (SolrResourceLoader.java:findClass(486)) - Solr loaded a deprecated plugin/analysis class [solr.CSVRequestHandler]. Please consult documentation how to replace it accordingly.
   [junit4]   1> 2013-12-20 00:55:32,933 INFO  [coreLoadExecutor-3-thread-1] core.RequestHandlers (RequestHandlers.java:initHandlersFromConfig(165)) - created /update/csv: solr.CSVRequestHandler
   [junit4]   1> 2013-12-20 00:55:32,933 INFO  [coreLoadExecutor-3-thread-1] core.RequestHandlers (RequestHandlers.java:initHandlersFromConfig(147)) - adding lazy requestHandler: solr.FieldAnalysisRequestHandler
   [junit4]   1> 2013-12-20 00:55:32,934 INFO  [coreLoadExecutor-3-thread-1] core.RequestHandlers (RequestHandlers.java:initHandlersFromConfig(165)) - created /analysis/field: solr.FieldAnalysisRequestHandler
   [junit4]   1> 2013-12-20 00:55:32,935 INFO  [coreLoadExecutor-3-thread-1] core.RequestHandlers (RequestHandlers.java:initHandlersFromConfig(147)) - adding lazy requestHandler: solr.DocumentAnalysisRequestHandler
   [junit4]   1> 2013-12-20 00:55:32,935 INFO  [coreLoadExecutor-3-thread-1] core.RequestHandlers (RequestHandlers.java:initHandlersFromConfig(165)) - created /analysis/document: solr.DocumentAnalysisRequestHandler
   [junit4]   1> 2013-12-20 00:55:32,940 INFO  [coreLoadExecutor-3-thread-1] core.RequestHandlers (RequestHandlers.java:initHandlersFromConfig(165)) - created /admin/: solr.admin.AdminHandlers
   [junit4]   1> 2013-12-20 00:55:32,945 INFO  [coreLoadExecutor-3-thread-1] core.RequestHandlers (RequestHandlers.java:initHandlersFromConfig(165)) - created /admin/ping: solr.PingRequestHandler
   [junit4]   1> 2013-12-20 00:55:32,950 INFO  [coreLoadExecutor-3-thread-1] core.RequestHandlers (RequestHandlers.java:initHandlersFromConfig(165)) - created /debug/dump: solr.DumpRequestHandler
   [junit4]   1> 2013-12-20 00:55:32,963 INFO  [coreLoadExecutor-3-thread-1] core.RequestHandlers (RequestHandlers.java:initHandlersFromConfig(165)) - created /replication: solr.ReplicationHandler
   [junit4]   1> 2013-12-20 00:55:32,964 INFO  [coreLoadExecutor-3-thread-1] core.RequestHandlers (RequestHandlers.java:initHandlersFromConfig(147)) - adding lazy requestHandler: solr.SearchHandler
   [junit4]   1> 2013-12-20 00:55:32,964 INFO  [coreLoadExecutor-3-thread-1] core.RequestHandlers (RequestHandlers.java:initHandlersFromConfig(165)) - created /spell: solr.SearchHandler
   [junit4]   1> 2013-12-20 00:55:32,965 INFO  [coreLoadExecutor-3-thread-1] core.RequestHandlers (RequestHandlers.java:initHandlersFromConfig(147)) - adding lazy requestHandler: solr.SearchHandler
   [junit4]   1> 2013-12-20 00:55:32,965 INFO  [coreLoadExecutor-3-thread-1] core.RequestHandlers (RequestHandlers.java:initHandlersFromConfig(165)) - created /tvrh: solr.SearchHandler
   [junit4]   1> 2013-12-20 00:55:32,966 INFO  [coreLoadExecutor-3-thread-1] core.RequestHandlers (RequestHandlers.java:initHandlersFromConfig(147)) - adding lazy requestHandler: solr.SearchHandler
   [junit4]   1> 2013-12-20 00:55:32,966 INFO  [coreLoadExecutor-3-thread-1] core.RequestHandlers (RequestHandlers.java:initHandlersFromConfig(165)) - created /terms: solr.SearchHandler
   [junit4]   1> 2013-12-20 00:55:32,967 INFO  [coreLoadExecutor-3-thread-1] core.RequestHandlers (RequestHandlers.java:initHandlersFromConfig(147)) - adding lazy requestHandler: solr.SearchHandler
   [junit4]   1> 2013-12-20 00:55:32,967 INFO  [coreLoadExecutor-3-thread-1] core.RequestHandlers (RequestHandlers.java:initHandlersFromConfig(165)) - created /elevate: solr.SearchHandler
   [junit4]   1> 2013-12-20 00:55:33,000 INFO  [coreLoadExecutor-3-thread-1] loader.XMLLoader (XMLLoader.java:init(111)) - xsltCacheLifetimeSeconds=60
   [junit4]   1> 2013-12-20 00:55:33,018 INFO  [coreLoadExecutor-3-thread-1] loader.XMLLoader (XMLLoader.java:init(111)) - xsltCacheLifetimeSeconds=60
   [junit4]   1> 2013-12-20 00:55:33,020 INFO  [coreLoadExecutor-3-thread-1] loader.XMLLoader (XMLLoader.java:init(111)) - xsltCacheLifetimeSeconds=60
   [junit4]   1> 2013-12-20 00:55:33,050 INFO  [coreLoadExecutor-3-thread-1] core.SolrCore (CommitTracker.java:<init>(83)) - Hard AutoCommit: if uncommited for 60000ms; 
   [junit4]   1> 2013-12-20 00:55:33,050 INFO  [coreLoadExecutor-3-thread-1] core.SolrCore (CommitTracker.java:<init>(83)) - Soft AutoCommit: if uncommited for 1000ms; 
   [junit4]   1> 2013-12-20 00:55:33,053 INFO  [coreLoadExecutor-3-thread-1] core.SolrCore (SolrDeletionPolicy.java:onInit(85)) - SolrDeletionPolicy.onInit: commits: num=1
   [junit4]   1> 	commit{dir=MockDirectoryWrapper(org.apache.lucene.store.RAMDirectory@3971846 lockFactory=org.apache.lucene.store.NativeFSLockFactory@2c231468),segFN=segments_1,generation=1}
   [junit4]   1> 2013-12-20 00:55:33,054 INFO  [coreLoadExecutor-3-thread-1] core.SolrCore (SolrDeletionPolicy.java:updateCommits(165)) - newest commit generation = 1
   [junit4]   1> 2013-12-20 00:55:33,066 INFO  [coreLoadExecutor-3-thread-1] search.SolrIndexSearcher (SolrIndexSearcher.java:<init>(198)) - Opening Searcher@62d99734 main
   [junit4]   1> 2013-12-20 00:55:33,075 INFO  [coreLoadExecutor-3-thread-1] component.SpellCheckComponent (SpellCheckComponent.java:inform(619)) - Initializing spell checkers
   [junit4]   1> 2013-12-20 00:55:33,092 INFO  [coreLoadExecutor-3-thread-1] spelling.DirectSolrSpellChecker (DirectSolrSpellChecker.java:init(102)) - init: {name=default,field=name,classname=solr.DirectSolrSpellChecker,distanceMeasure=internal,accuracy=0.5,maxEdits=2,minPrefix=1,maxInspections=5,minQueryLength=4,maxQueryFrequency=0.01}
   [junit4]   1> 2013-12-20 00:55:33,110 INFO  [coreLoadExecutor-3-thread-1] component.SpellCheckComponent (SpellCheckComponent.java:inform(668)) - No queryConverter defined, using default converter
   [junit4]   1> 2013-12-20 00:55:33,114 INFO  [coreLoadExecutor-3-thread-1] component.QueryElevationComponent (QueryElevationComponent.java:inform(222)) - Loading QueryElevation from: /mnt/ssd/jenkins/workspace/Lucene-Solr-trunk-Linux/solr/contrib/map-reduce/src/test-files/solr/collection1/conf/elevate.xml
   [junit4]   1> 2013-12-20 00:55:33,179 INFO  [coreLoadExecutor-3-thread-1] handler.ReplicationHandler (ReplicationHandler.java:inform(965)) - Commits will be reserved for  10000
   [junit4]   1> 2013-12-20 00:55:33,180 INFO  [searcherExecutor-4-thread-1] core.SolrCore (QuerySenderListener.java:newSearcher(44)) - QuerySenderListener sending requests to Searcher@62d99734 main{StandardDirectoryReader(segments_1:1:nrt)}
   [junit4]   1> 2013-12-20 00:55:33,180 INFO  [coreLoadExecutor-3-thread-1] core.CoreContainer (CoreContainer.java:registerCore(478)) - registering core: collection1
   [junit4]   1> 2013-12-20 00:55:33,187 INFO  [SUITE-SolrCellMorphlineTest-seed#[4BE440EC2E2C3C6C]-worker] solr.SolrTestCaseJ4 (SolrTestCaseJ4.java:initCore(473)) - ####initCore end
   [junit4]   2> Creating dataDir: /mnt/ssd/jenkins/workspace/Lucene-Solr-trunk-Linux/solr/build/contrib/solr-morphlines-cell/test/J0/./solrtest-SolrCellMorphlineTest-1387500928663
   [junit4]   1> 2013-12-20 00:55:33,207 INFO  [TEST-SolrCellMorphlineTest.testTransformValue-seed#[4BE440EC2E2C3C6C]] solr.SolrTestCaseJ4 (SolrTestCaseJ4.java:setUp(222)) - ###Starting testTransformValue
   [junit4]   1> 2013-12-20 00:55:33,273 INFO  [searcherExecutor-4-thread-1] core.SolrCore (SolrCore.java:execute(1879)) - [collection1] webapp=null path=null params={event=firstSearcher&distrib=false&q=static+firstSearcher+warming+in+solrconfig.xml} hits=0 status=0 QTime=90 
   [junit4]   1> 2013-12-20 00:55:33,275 INFO  [searcherExecutor-4-thread-1] core.SolrCore (QuerySenderListener.java:newSearcher(91)) - QuerySenderListener done.
   [junit4]   1> 2013-12-20 00:55:33,276 INFO  [searcherExecutor-4-thread-1] component.SpellCheckComponent (SpellCheckComponent.java:newSearcher(709)) - Loading spell index for spellchecker: default
   [junit4]   1> 2013-12-20 00:55:33,276 INFO  [searcherExecutor-4-thread-1] component.SpellCheckComponent (SpellCheckComponent.java:newSearcher(709)) - Loading spell index for spellchecker: wordbreak
   [junit4]   1> 2013-12-20 00:55:33,277 INFO  [searcherExecutor-4-thread-1] core.SolrCore (SolrCore.java:registerSearcher(1827)) - [collection1] Registered new searcher Searcher@62d99734 main{StandardDirectoryReader(segments_1:1:nrt)}
   [junit4]   1> 2013-12-20 00:55:33,415 INFO  [TEST-SolrCellMorphlineTest.testTransformValue-seed#[4BE440EC2E2C3C6C]] processor.LogUpdateProcessor (LogUpdateProcessorFactory.java:finish(198)) - [collection1] webapp=null path=/update params={} {deleteByQuery=*:* (-1454900178689458176)} 0 168
   [junit4]   1> 2013-12-20 00:55:33,417 INFO  [TEST-SolrCellMorphlineTest.testTransformValue-seed#[4BE440EC2E2C3C6C]] update.UpdateHandler (DirectUpdateHandler2.java:commit(521)) - start commit{,optimize=false,openSearcher=true,waitSearcher=true,expungeDeletes=false,softCommit=false,prepareCommit=false}
   [junit4]   1> 2013-12-20 00:55:33,418 INFO  [TEST-SolrCellMorphlineTest.testTransformValue-seed#[4BE440EC2E2C3C6C]] update.UpdateHandler (DirectUpdateHandler2.java:commit(561)) - No uncommitted changes. Skipping IW.commit.
   [junit4]   1> 2013-12-20 00:55:33,420 INFO  [TEST-SolrCellMorphlineTest.testTransformValue-seed#[4BE440EC2E2C3C6C]] search.SolrIndexSearcher (SolrIndexSearcher.java:<init>(198)) - Opening Searcher@169fd990 main
   [junit4]   1> 2013-12-20 00:55:33,422 INFO  [TEST-SolrCellMorphlineTest.testTransformValue-seed#[4BE440EC2E2C3C6C]] update.UpdateHandler (DirectUpdateHandler2.java:commit(612)) - end_commit_flush
   [junit4]   1> 2013-12-20 00:55:33,422 INFO  [searcherExecutor-4-thread-1] core.SolrCore (QuerySenderListener.java:newSearcher(44)) - QuerySenderListener sending requests to Searcher@169fd990 main{StandardDirectoryReader(segments_1:1:nrt)}
   [junit4]   1> 2013-12-20 00:55:33,424 INFO  [searcherExecutor-4-thread-1] core.SolrCore (QuerySenderListener.java:newSearcher(91)) - QuerySenderListener done.
   [junit4]   1> 2013-12-20 00:55:33,425 INFO  [searcherExecutor-4-thread-1] core.SolrCore (SolrCore.java:registerSearcher(1827)) - [collection1] Registered new searcher Searcher@169fd990 main{StandardDirectoryReader(segments_1:1:nrt)}
   [junit4]   1> 2013-12-20 00:55:33,427 INFO  [TEST-SolrCellMorphlineTest.testTransformValue-seed#[4BE440EC2E2C3C6C]] processor.LogUpdateProcessor (LogUpdateProcessorFactory.java:finish(198)) - [collection1] webapp=null path=/update params={commit=true&softCommit=false&waitSearcher=true} {commit=} 0 10
   [junit4]   1> 2013-12-20 00:55:33,464 INFO  [TEST-SolrCellMorphlineTest.testTransformValue-seed#[4BE440EC2E2C3C6C]] solr.SolrTestCaseJ4 (SolrTestCaseJ4.java:tearDown(227)) - ###Ending testTransformValue
   [junit4]   1> 2013-12-20 00:55:33,485 INFO  [TEST-SolrCellMorphlineTest.testSolrCellXML-seed#[4BE440EC2E2C3C6C]] solr.SolrTestCaseJ4 (SolrTestCaseJ4.java:setUp(222)) - ###Starting testSolrCellXML
   [junit4]   1> 2013-12-20 00:55:33,488 INFO  [TEST-SolrCellMorphlineTest.testSolrCellXML-seed#[4BE440EC2E2C3C6C]] processor.LogUpdateProcessor (LogUpdateProcessorFactory.java:finish(198)) - [collection1] webapp=null path=/update params={} {deleteByQuery=*:* (-1454900178831015936)} 0 2
   [junit4]   1> 2013-12-20 00:55:33,490 INFO  [TEST-SolrCellMorphlineTest.testSolrCellXML-seed#[4BE440EC2E2C3C6C]] update.UpdateHandler (DirectUpdateHandler2.java:commit(521)) - start commit{,optimize=false,openSearcher=true,waitSearcher=true,expungeDeletes=false,softCommit=false,prepareCommit=false}
   [junit4]   1> 2013-12-20 00:55:33,491 INFO  [TEST-SolrCellMorphlineTest.testSolrCellXML-seed#[4BE440EC2E2C3C6C]] update.UpdateHandler (DirectUpdateHandler2.java:commit(561)) - No uncommitted changes. Skipping IW.commit.
   [junit4]   1> 2013-12-20 00:55:33,492 INFO  [TEST-SolrCellMorphlineTest.testSolrCellXML-seed#[4BE440EC2E2C3C6C]] search.SolrIndexSearcher (SolrIndexSearcher.java:<init>(198)) - Opening Searcher@2c9a30b1 main
   [junit4]   1> 2013-12-20 00:55:33,494 INFO  [TEST-SolrCellMorphlineTest.testSolrCellXML-seed#[4BE440EC2E2C3C6C]] update.UpdateHandler (DirectUpdateHandler2.java:commit(612)) - end_commit_flush
   [junit4]   1> 2013-12-20 00:55:33,494 INFO  [searcherExecutor-4-thread-1] core.SolrCore (QuerySenderListener.java:newSearcher(44)) - QuerySenderListener sending requests to Searcher@2c9a30b1 main{StandardDirectoryReader(segments_1:1:nrt)}
   [junit4]   1> 2013-12-20 00:55:33,496 INFO  [searcherExecutor-4-thread-1] core.SolrCore (QuerySenderListener.java:newSearcher(91)) - QuerySenderListener done.
   [junit4]   1> 2013-12-20 00:55:33,496 INFO  [searcherExecutor-4-thread-1] core.SolrCore (SolrCore.java:registerSearcher(1827)) - [collection1] Registered new searcher Searcher@2c9a30b1 main{StandardDirectoryReader(segments_1:1:nrt)}
   [junit4]   1> 2013-12-20 00:55:33,497 INFO  [TEST-SolrCellMorphlineTest.testSolrCellXML-seed#[4BE440EC2E2C3C6C]] processor.LogUpdateProcessor (LogUpdateProcessorFactory.java:finish(198)) - [collection1] webapp=null path=/update params={commit=true&softCommit=false&waitSearcher=true} {commit=} 0 8
   [junit4]   1> 2013-12-20 00:55:33,692 INFO  [TEST-SolrCellMorphlineTest.testSolrCellXML-seed#[4BE440EC2E2C3C6C]] api.MorphlineContext (MorphlineContext.java:importCommandBuilders(75)) - Importing commands
   [junit4]   1> 2013-12-20 00:55:34,985 INFO  [TEST-SolrCellMorphlineTest.testSolrCellXML-seed#[4BE440EC2E2C3C6C]] core.SolrResourceLoader (SolrResourceLoader.java:<init>(116)) - new SolrResourceLoader for directory: '/mnt/ssd/jenkins/workspace/Lucene-Solr-trunk-Linux/solr/contrib/map-reduce/src/test-files/solr/collection1/'
   [junit4]   1> 2013-12-20 00:55:35,067 INFO  [TEST-SolrCellMorphlineTest.testSolrCellXML-seed#[4BE440EC2E2C3C6C]] core.SolrConfig (SolrConfig.java:initLibs(503)) - Adding specified lib dirs to ClassLoader
   [junit4]   1> 2013-12-20 00:55:35,067 WARN  [TEST-SolrCellMorphlineTest.testSolrCellXML-seed#[4BE440EC2E2C3C6C]] core.SolrResourceLoader (SolrResourceLoader.java:addToClassLoader(170)) - Can't find (or read) directory to add to classloader: ../../../contrib/extraction/lib (resolved as: /mnt/ssd/jenkins/workspace/Lucene-Solr-trunk-Linux/solr/contrib/map-reduce/src/test-files/solr/collection1/../../../contrib/extraction/lib).
   [junit4]   1> 2013-12-20 00:55:35,068 WARN  [TEST-SolrCellMorphlineTest.testSolrCellXML-seed#[4BE440EC2E2C3C6C]] core.SolrResourceLoader (SolrResourceLoader.java:addToClassLoader(170)) - Can't find (or read) directory to add to classloader: ../../../dist/ (resolved as: /mnt/ssd/jenkins/workspace/Lucene-Solr-trunk-Linux/solr/contrib/map-reduce/src/test-files/solr/collection1/../../../dist).
   [junit4]   1> 2013-12-20 00:55:35,069 WARN  [TEST-SolrCellMorphlineTest.testSolrCellXML-seed#[4BE440EC2E2C3C6C]] core.SolrResourceLoader (SolrResourceLoader.java:addToClassLoader(170)) - Can't find (or read) directory to add to classloader: ../../../contrib/clustering/lib/ (resolved as: /mnt/ssd/jenkins/workspace/Lucene-Solr-trunk-Linux/solr/contrib/map-reduce/src/test-files/solr/collection1/../../../contrib/clustering/lib).
   [junit4]   1> 2013-12-20 00:55:35,069 WARN  [TEST-SolrCellMorphlineTest.testSolrCellXML-seed#[4BE440EC2E2C3C6C]] core.SolrResourceLoader (SolrResourceLoader.java:addToClassLoader(170)) - Can't find (or read) directory to add to classloader: ../../../dist/ (resolved as: /mnt/ssd/jenkins/workspace/Lucene-Solr-trunk-Linux/solr/contrib/map-reduce/src/test-files/solr/collection1/../../../dist).
   [junit4]   1> 2013-12-20 00:55:35,070 WARN  [TEST-SolrCellMorphlineTest.testSolrCellXML-seed#[4BE440EC2E2C3C6C]] core.SolrResourceLoader (SolrResourceLoader.java:addToClassLoader(170)) - Can't find (or read) directory to add to classloader: ../../../contrib/langid/lib/ (resolved as: /mnt/ssd/jenkins/workspace/Lucene-Solr-trunk-Linux/solr/contrib/map-reduce/src/test-files/solr/collection1/../../../contrib/langid/lib).
   [junit4]   1> 2013-12-20 00:55:35,070 WARN  [TEST-SolrCellMorphlineTest.testSolrCellXML-seed#[4BE440EC2E2C3C6C]] core.SolrResourceLoader (SolrResourceLoader.java:addToClassLoader(170)) - Can't find (or read) directory to add to classloader: ../../../dist/ (resolved as: /mnt/ssd/jenkins/workspace/Lucene-Solr-trunk-Linux/solr/contrib/map-reduce/src/test-files/solr/collection1/../../../dist).
   [junit4]   1> 2013-12-20 00:55:35,071 WARN  [TEST-SolrCellMorphlineTest.testSolrCellXML-seed#[4BE440EC2E2C3C6C]] core.SolrResourceLoader (SolrResourceLoader.java:addToClassLoader(170)) - Can't find (or read) directory to add to classloader: ../../../contrib/velocity/lib (resolved as: /mnt/ssd/jenkins/workspace/Lucene-Solr-trunk-Linux/solr/contrib/map-reduce/src/test-files/solr/collection1/../../../contrib/velocity/lib).
   [junit4]   1> 2013-12-20 00:55:35,072 WARN  [TEST-SolrCellMorphlineTest.testSolrCellXML-seed#[4BE440EC2E2C3C6C]] core.SolrResourceLoader (SolrResourceLoader.java:addToClassLoader(170)) - Can't find (or read) directory to add to classloader: ../../../dist/ (resolved as: /mnt/ssd/jenkins/workspace/Lucene-Solr-trunk-Linux/solr/contrib/map-reduce/src/test-files/solr/collection1/../../../dist).
   [junit4]   1> 2013-12-20 00:55:35,072 WARN  [TEST-SolrCellMorphlineTest.testSolrCellXML-seed#[4BE440EC2E2C3C6C]] core.SolrResourceLoader (SolrResourceLoader.java:addToClassLoader(170)) - Can't find (or read) directory to add to classloader: /non/existent/dir/yields/warning (resolved as: /non/existent/dir/yields/warning).
   [junit4]   1> 2013-12-20 00:55:35,110 INFO  [TEST-SolrCellMorphlineTest.testSolrCellXML-seed#[4BE440EC2E2C3C6C]] core.SolrConfig (SolrConfig.java:<init>(160)) - Using Lucene MatchVersion: LUCENE_43
   [junit4]   1> 2013-12-20 00:55:35,202 INFO  [TEST-SolrCellMorphlineTest.testSolrCellXML-seed#[4BE440EC2E2C3C6C]] core.Config (SolrConfig.java:<init>(262)) - Loaded SolrConfig: solrconfig.xml
   [junit4]   1> 2013-12-20 00:55:35,203 INFO  [TEST-SolrCellMorphlineTest.testSolrCellXML-seed#[4BE440EC2E2C3C6C]] schema.IndexSchema (IndexSchema.java:readSchema(426)) - Reading Solr Schema from schema.xml
   [junit4]   1> 2013-12-20 00:55:35,252 INFO  [TEST-SolrCellMorphlineTest.testSolrCellXML-seed#[4BE440EC2E2C3C6C]] schema.IndexSchema (IndexSchema.java:readSchema(454)) - [null] Schema name=example
   [junit4]   1> 2013-12-20 00:55:35,781 INFO  [TEST-SolrCellMorphlineTest.testSolrCellXML-seed#[4BE440EC2E2C3C6C]] schema.IndexSchema (IndexSchema.java:readSchema(552)) - unique key field: id
   [junit4]   1> 2013-12-20 00:55:35,808 INFO  [TEST-SolrCellMorphlineTest.testSolrCellXML-seed#[4BE440EC2E2C3C6C]] schema.FileExchangeRateProvider (CurrencyField.java:reload(781)) - Reloading exchange rates from file currency.xml
   [junit4]   1> 2013-12-20 00:55:35,816 INFO  [TEST-SolrCellMorphlineTest.testSolrCellXML-seed#[4BE440EC2E2C3C6C]] schema.FileExchangeRateProvider (CurrencyField.java:reload(781)) - Reloading exchange rates from file currency.xml
   [junit4]   1> 2013-12-20 00:55:35,886 INFO  [TEST-SolrCellMorphlineTest.testSolrCellXML-seed#[4BE440EC2E2C3C6C]] core.SolrResourceLoader (SolrResourceLoader.java:<init>(116)) - new SolrResourceLoader for directory: '/mnt/ssd/jenkins/workspace/Lucene-Solr-trunk-Linux/solr/contrib/map-reduce/src/test-files/solr/collection1/'
   [junit4]   1> 2013-12-20 00:55:35,940 INFO  [TEST-SolrCellMorphlineTest.testSolrCellXML-seed#[4BE440EC2E2C3C6C]] core.SolrConfig (SolrConfig.java:initLibs(503)) - Adding specified lib dirs to ClassLoader
   [junit4]   1> 2013-12-20 00:55:35,941 WARN  [TEST-SolrCellMorphlineTest.testSolrCellXML-seed#[4BE440EC2E2C3C6C]] core.SolrResourceLoader (SolrResourceLoader.java:addToClassLoader(170)) - Can't find (or read) directory to add to classloader: ../../../contrib/extraction/lib (resolved as: /mnt/ssd/jenkins/workspace/Lucene-Solr-trunk-Linux/solr/contrib/map-reduce/src/test-files/solr/collection1/../../../contrib/extraction/lib).
   [junit4]   1> 2013-12-20 00:55:35,941 WARN  [TEST-SolrCellMorphlineTest.testSolrCellXML-seed#[4BE440EC2E2C3C6C]] core.SolrResourceLoader (SolrResourceLoader.java:addToClassLoader(170)) - Can't find (or read) directory to add to classloader: ../../../dist/ (resolved as: /mnt/ssd/jenkins/workspace/Lucene-Solr-trunk-Linux/solr/contrib/map-reduce/src/test-files/solr/collection1/../../../dist).
   [junit4]   1> 2013-12-20 00:55:35,942 WARN  [TEST-SolrCellMorphlineTest.testSolrCellXML-seed#[4BE440EC2E2C3C6C]] core.SolrResourceLoader (SolrResourceLoader.java:addToClassLoader(170)) - Can't find (or read) directory to add to classloader: ../../../contrib/clustering/lib/ (resolved as: /mnt/ssd/jenkins/workspace/Lucene-Solr-trunk-Linux/solr/contrib/map-reduce/src/test-files/solr/collection1/../../../contrib/clustering/lib).
   [junit4]   1> 2013-12-20 00:55:35,943 WARN  [TEST-SolrCellMorphlineTest.testSolrCellXML-seed#[4BE440EC2E2C3C6C]] core.SolrResourceLoader (SolrResourceLoader.java:addToClassLoader(170)) - Can't find (or read) directory to add to classloader: ../../../dist/ (resolved as: /mnt/ssd/jenkins/workspace/Lucene-Solr-trunk-Linux/solr/contrib/map-reduce/src/test-files/solr/collection1/../../../dist).
   [junit4]   1> 2013-12-20 00:55:35,943 WARN  [TEST-SolrCellMorphlineTest.testSolrCellXML-seed#[4BE440EC2E2C3C6C]] core.SolrResourceLoader (SolrResourceLoader.java:addToClassLoader(170)) - Can't find (or read) directory to add to classloader: ../../../contrib/langid/lib/ (resolved as: /mnt/ssd/jenkins/workspace/Lucene-Solr-trunk-Linux/solr/contrib/map-reduce/src/test-files/solr/collection1/../../../contrib/langid/lib).
   [junit4]   1> 2013-12-20 00:55:35,944 WARN  [TEST-SolrCellMorphlineTest.testSolrCellXML-seed#[4BE440EC2E2C3C6C]] core.SolrResourceLoader (SolrResourceLoader.java:addToClassLoader(170)) - Can't find (or read) directory to add to classloader: ../../../dist/ (resolved as: /mnt/ssd/jenkins/workspace/Lucene-Solr-trunk-Linux/solr/contrib/map-reduce/src/test-files/solr/collection1/../../../dist).
   [junit4]   1> 2013-12-20 00:55:35,944 WARN  [TEST-SolrCellMorphlineTest.testSolrCellXML-seed#[4BE440EC2E2C3C6C]] core.SolrResourceLoader (SolrResourceLoader.java:addToClassLoader(170)) - Can't find (or read) directory to add to classloader: ../../../contrib/velocity/lib (resolved as: /mnt/ssd/jenkins/workspace/Lucene-Solr-trunk-Linux/solr/contrib/map-reduce/src/test-files/solr/collection1/../../../contrib/velocity/lib).
   [junit4]   1> 2013-12-20 00:55:35,945 WARN  [TEST-SolrCellMorphlineTest.testSolrCellXML-seed#[4BE440EC2E2C3C6C]] core.SolrResourceLoader (SolrResourceLoader.java:addToClassLoader(170)) - Can't find (or read) directory to add to classloader: ../../../dist/ (resolved as: /mnt/ssd/jenkins/workspace/Lucene-Solr-trunk-Linux/solr/contrib/map-reduce/src/test-files/solr/collection1/../../../dist).
   [junit4]   1> 2013-12-20 00:55:35,945 WARN  [TEST-SolrCellMorphlineTest.testSolrCellXML-seed#[4BE440EC2E2C3C6C]] core.SolrResourceLoader (SolrResourceLoader.java:addToClassLoader(170)) - Can't find (or read) directory to add to classloader: /non/existent/dir/yields/warning (resolved as: /non/existent/dir/yields/warning).
   [junit4]   1> 2013-12-20 00:55:35,983 INFO  [TEST-SolrCellMorphlineTest.testSolrCellXML-seed#[4BE440EC2E2C3C6C]] core.SolrConfig (SolrConfig.java:<init>(160)) - Using Lucene MatchVersion: LUCENE_43
   [junit4]   1> 2013-12-20 00:55:36,062 INFO  [TEST-SolrCellMorphlineTest.testSolrCellXML-seed#[4BE440EC2E2C3C6C]] core.Config (SolrConfig.java:<init>(262)) - Loaded SolrConfig: solrconfig.xml
   [junit4]   1> 2013-12-20 00:55:36,063 INFO  [TEST-SolrCellMorphlineTest.testSolrCellXML-seed#[4BE440EC2E2C3C6C]] schema.IndexSchema (IndexSchema.java:readSchema(426)) - Reading Solr Schema from schema.xml
   [junit4]   1> 2013-12-20 00:55:36,119 INFO  [TEST-SolrCellMorphlineTest.testSolrCellXML-seed#[4BE440EC2E2C3C6C]] schema.IndexSchema (IndexSchema.java:readSchema(454)) - [null] Schema name=example
   [junit4]   1> 2013-12-20 00:55:36,681 INFO  [TEST-SolrCellMorphlineTest.testSolrCellXML-seed#[4BE440EC2E2C3C6C]] schema.IndexSchema (IndexSchema.java:readSchema(552)) - unique key field: id
   [junit4]   1> 2013-12-20 00:55:36,710 INFO  [TEST-SolrCellMorphlineTest.testSolrCellXML-seed#[4BE440EC2E2C3C6C]] schema.FileExchangeRateProvider (CurrencyField.java:reload(781)) - Reloading exchange rates from file currency.xml
   [junit4]   1> 2013-12-20 00:55:36,716 INFO  [TEST-SolrCellMorphlineTest.testSolrCellXML-seed#[4BE440EC2E2C3C6C]] schema.FileExchangeRateProvider (CurrencyField.java:reload(781)) - Reloading exchange rates from file currency.xml
   [junit4]   1> 2013-12-20 00:55:36,747 INFO  [TEST-SolrCellMorphlineTest.testSolrCellXML-seed#[4BE440EC2E2C3C6C]] core.SolrResourceLoader (SolrResourceLoader.java:<init>(116)) - new SolrResourceLoader for directory: '/mnt/ssd/jenkins/workspace/Lucene-Solr-trunk-Linux/solr/contrib/map-reduce/src/test-files/solr/collection1/'
   [junit4]   1> 2013-12-20 00:55:36,787 INFO  [TEST-SolrCellMorphlineTest.testSolrCellXML-seed#[4BE440EC2E2C3C6C]] core.SolrConfig (SolrConfig.java:initLibs(503)) - Adding specified lib dirs to ClassLoader
   [junit4]   1> 2013-12-20 00:55:36,788 WARN  [TEST-SolrCellMorphlineTest.testSolrCellXML-seed#[4BE440EC2E2C3C6C]] core.SolrResourceLoader (SolrResourceLoader.java:addToClassLoader(170)) - Can't find (or read) directory to add to classloader: ../../../contrib/extraction/lib (resolved as: /mnt/ssd/jenkins/workspace/Lucene-Solr-trunk-Linux/solr/contrib/map-reduce/src/test-files/solr/collection1/../../../contrib/extraction/lib).
   [junit4]   1> 2013-12-20 00:55:36,788 WARN  [TEST-SolrCellMorphlineTest.testSolrCellXML-seed#[4BE440EC2E2C3C6C]] core.SolrResourceLoader (SolrResourceLoader.java:addToClassLoader(170)) - Can't find (or read) directory to add to classloader: ../../../dist/ (resolved as: /mnt/ssd/jenkins/workspace/Lucene-Solr-trunk-Linux/solr/contrib/map-reduce/src/test-files/solr/collection1/../../../dist).
   [junit4]   1> 2013-12-20 00:55:36,789 WARN  [TEST-SolrCellMorphlineTest.testSolrCellXML-seed#[4BE440EC2E2C3C6C]] core.SolrResourceLoader (SolrResourceLoader.java:addToClassLoader(170)) - Can't find (or read) directory to add to classloader: ../../../contrib/clustering/lib/ (resolved as: /mnt/ssd/jenkins/workspace/Lucene-Solr-trunk-Linux/solr/contrib/map-reduce/src/test-files/solr/collection1/../../../contrib/clustering/lib).
   [junit4]   1> 2013-12-20 00:55:36,789 WARN  [TEST-SolrCellMorphlineTest.testSolrCellXML-seed#[4BE440EC2E2C3C6C]] core.SolrResourceLoader (SolrResourceLoader.java:addToClassLoader(170)) - Can't find (or read) directory to add to classloader: ../../../dist/ (resolved as: /mnt/ssd/jenkins/workspace/Lucene-Solr-trunk-Linux/solr/contrib/map-reduce/src/test-files/solr/collection1/../../../dist).
   [junit4]   1> 2013-12-20 00:55:36,790 WARN  [TEST-SolrCellMorphlineTest.testSolrCellXML-seed#[4BE440EC2E2C3C6C]] core.SolrResourceLoader (SolrResourceLoader.java:addToClassLoader(170)) - Can't find (or read) directory to add to classloader: ../../../contrib/langid/lib/ (resolved as: /mnt/ssd/jenkins/workspace/Lucene-Solr-trunk-Linux/solr/contrib/map-reduce/src/test-files/solr/collection1/../../../contrib/langid/lib).
   [junit4]   1> 2013-12-20 00:55:36,790 WARN  [TEST-SolrCellMorphlineTest.testSolrCellXML-seed#[4BE440EC2E2C3C6C]] core.SolrResourceLoader (SolrResourceLoader.java:addToClassLoader(170)) - Can't find (or read) directory to add to classloader: ../../../dist/ (resolved as: /mnt/ssd/jenkins/workspace/Lucene-Solr-trunk-Linux/solr/contrib/map-reduce/src/test-files/solr/collection1/../../../dist).
   [junit4]   1> 2013-12-20 00:55:36,791 WARN  [TEST-SolrCellMorphlineTest.testSolrCellXML-seed#[4BE440EC2E2C3C6C]] core.SolrResourceLoader (SolrResourceLoader.java:addToClassLoader(170)) - Can't find (or read) directory to add to classloader: ../../../contrib/velocity/lib (resolved as: /mnt/ssd/jenkins/workspace/Lucene-Solr-trunk-Linux/solr/contrib/map-reduce/src/test-files/solr/collection1/../../../contrib/velocity/lib).
   [junit4]   1> 2013-12-20 00:55:36,791 WARN  [TEST-SolrCellMorphlineTest.testSolrCellXML-seed#[4BE440EC2E2C3C6C]] core.SolrResourceLoader (SolrResourceLoader.java:addToClassLoader(170)) - Can't find (or read) directory to add to classloader: ../../../dist/ (resolved as: /mnt/ssd/jenkins/workspace/Lucene-Solr-trunk-Linux/solr/contrib/map-reduce/src/test-files/solr/collection1/../../../dist).
   [junit4]   1> 2013-12-20 00:55:36,792 WARN  [TEST-SolrCellMorphlineTest.testSolrCellXML-seed#[4BE440EC2E2C3C6C]] core.SolrResourceLoader (SolrResourceLoader.java:addToClassLoader(170)) - Can't find (or read) directory to add to classloader: /non/existent/dir/yields/warning (resolved as: /non/existent/dir/yields/warning).
   [junit4]   1> 2013-12-20 00:55:36,834 INFO  [TEST-SolrCellMorphlineTest.testSolrCellXML-seed#[4BE440EC2E2C3C6C]] core.SolrConfig (SolrConfig.java:<init>(160)) - Using Lucene MatchVersion: LUCENE_43
   [junit4]   1> 2013-12-20 00:55:36,905 INFO  [TEST-SolrCellMorphlineTest.testSolrCellXML-seed#[4BE440EC2E2C3C6C]] core.Config (SolrConfig.java:<init>(262)) - Loaded SolrConfig: solrconfig.xml
   [junit4]   1> 2013-12-20 00:55:36,906 INFO  [TEST-SolrCellMorphlineTest.testSolrCellXML-seed#[4BE440EC2E2C3C6C]] schema.IndexSchema (IndexSchema.java:readSchema(426)) - Reading Solr Schema from schema.xml
   [junit4]   1> 2013-12-20 00:55:36,937 INFO  [TEST-SolrCellMorphlineTest.testSolrCellXML-seed#[4BE440EC2E2C3C6C]] schema.IndexSchema (IndexSchema.java:readSchema(454)) - [null] Schema name=example
   [junit4]   1> 2013-12-20 00:55:37,510 INFO  [TEST-SolrCellMorphlineTest.testSolrCellXML-seed#[4BE440EC2E2C3C6C]] schema.IndexSchema (IndexSchema.java:readSchema(552)) - unique key field: id
   [junit4]   1> 2013-12-20 00:55:37,535 INFO  [TEST-SolrCellMorphlineTest.testSolrCellXML-seed#[4BE440EC2E2C3C6C]] schema.FileExchangeRateProvider (CurrencyField.java:reload(781)) - Reloading exchange rates from file currency.xml
   [junit4]   1> 2013-12-20 00:55:37,542 INFO  [TEST-SolrCellMorphlineTest.testSolrCellXML-seed#[4BE440EC2E2C3C6C]] schema.FileExchangeRateProvider (CurrencyField.java:reload(781)) - Reloading exchange rates from file currency.xml
   [junit4]   1> 2013-12-20 00:55:37,587 INFO  [TEST-SolrCellMorphlineTest.testSolrCellXML-seed#[4BE440EC2E2C3C6C]] processor.LogUpdateProcessor (LogUpdateProcessorFactory.java:finish(198)) - [collection1] webapp=null path=/update params={} {deleteByQuery=*:* (-1454900183130177536)} 0 2
   [junit4]   1> 2013-12-20 00:55:37,588 INFO  [TEST-SolrCellMorphlineTest.testSolrCellXML-seed#[4BE440EC2E2C3C6C]] update.UpdateHandler (DirectUpdateHandler2.java:commit(521)) - start commit{,optimize=false,openSearcher=true,waitSearcher=true,expungeDeletes=false,softCommit=false,prepareCommit=false}
   [junit4]   1> 2013-12-20 00:55:37,589 INFO  [TEST-SolrCellMorphlineTest.testSolrCellXML-seed#[4BE440EC2E2C3C6C]] update.UpdateHandler (DirectUpdateHandler2.java:commit(561)) - No uncommitted changes. Skipping IW.commit.
   [junit4]   1> 2013-12-20 00:55:37,590 INFO  [TEST-SolrCellMorphlineTest.testSolrCellXML-seed#[4BE440EC2E2C3C6C]] search.SolrIndexSearcher (SolrIndexSearcher.java:<init>(198)) - Opening Searcher@226d8d0a main
   [junit4]   1> 2013-12-20 00:55:37,591 INFO  [TEST-SolrCellMorphlineTest.testSolrCellXML-seed#[4BE440EC2E2C3C6C]] update.UpdateHandler (DirectUpdateHandler2.java:commit(612)) - end_commit_flush
   [junit4]   1> 2013-12-20 00:55:37,591 INFO  [searcherExecutor-4-thread-1] core.SolrCore (QuerySenderListener.java:newSearcher(44)) - QuerySenderListener sending requests to Searcher@226d8d0a main{StandardDirectoryReader(segments_1:1:nrt)}
   [junit4]   1> 2013-12-20 00:55:37,592 INFO  [searcherExecutor-4-thread-1] core.SolrCore (QuerySenderListener.java:newSearcher(91)) - QuerySenderListener done.
   [junit4]   1> 2013-12-20 00:55:37,593 INFO  [searcherExecutor-4-thread-1] core.SolrCore (SolrCore.java:registerSearcher(1827)) - [collection1] Registered new searcher Searcher@226d8d0a main{StandardDirectoryReader(segments_1:1:nrt)}
   [junit4]   1> 2013-12-20 00:55:37,593 INFO  [TEST-SolrCellMorphlineTest.testSolrCellXML-seed#[4BE440EC2E2C3C6C]] processor.LogUpdateProcessor (LogUpdateProcessorFactory.java:finish(198)) - [collection1] webapp=null path=/update params={commit=true&softCommit=false&waitSearcher=true} {commit=} 0 5
   [junit4]   1> 2013-12-20 00:55:37,688 INFO  [TEST-SolrCellMorphlineTest.testSolrCellXML-seed#[4BE440EC2E2C3C6C]] processor.LogUpdateProcessor (LogUpdateProcessorFactory.java:finish(198)) - [collection1] webapp=null path=/update params={} {add=[testXML2.xml#0 (1454900183195189248)]} 0 41
   [junit4]   1> 2013-12-20 00:55:37,689 INFO  [TEST-SolrCellMorphlineTest.testSolrCellXML-seed#[4BE440EC2E2C3C6C]] update.UpdateHandler (DirectUpdateHandler2.java:commit(521)) - start commit{,optimize=false,openSearcher=true,waitSearcher=true,expungeDeletes=false,softCommit=true,prepareCommit=false}
   [junit4]   1> 2013-12-20 00:55:37,798 INFO  [TEST-SolrCellMorphlineTest.testSolrCellXML-seed#[4BE440EC2E2C3C6C]] search.SolrIndexSearcher (SolrIndexSearcher.java:<init>(198)) - Opening Searcher@2d8fcb6 main
   [junit4]   1> 2013-12-20 00:55:37,799 INFO  [TEST-SolrCellMorphlineTest.testSolrCellXML-seed#[4BE440EC2E2C3C6C]] update.UpdateHandler (DirectUpdateHandler2.java:commit(612)) - end_commit_flush
   [junit4]   1> 2013-12-20 00:55:37,800 INFO  [searcherExecutor-4-thread-1] core.SolrCore (QuerySenderListener.java:newSearcher(44)) - QuerySenderListener sending requests to Searcher@2d8fcb6 main{StandardDirectoryReader(segments_1:3:nrt _0(5.0):C1)}
   [junit4]   1> 2013-12-20 00:55:37,801 INFO  [searcherExecutor-4-thread-1] core.SolrCore (QuerySenderListener.java:newSearcher(91)) - QuerySenderListener done.
   [junit4]   1> 2013-12-20 00:55:37,802 INFO  [searcherExecutor-4-thread-1] core.SolrCore (SolrCore.java:registerSearcher(1827)) - [collection1] Registered new searcher Searcher@2d8fcb6 main{StandardDirectoryReader(segments_1:3:nrt _0(5.0):C1)}
   [junit4]   1> 2013-12-20 00:55:37,803 INFO  [TEST-SolrCellMorphlineTest.testSolrCellXML-seed#[4BE440EC2E2C3C6C]] processor.LogUpdateProcessor (LogUpdateProcessorFactory.java:finish(198)) - [collection1] webapp=null path=/update params={commit=true&softCommit=true&waitSearcher=true} {commit=} 0 114
   [junit4]   1> 2013-12-20 00:55:37,833 INFO  [TEST-SolrCellMorphlineTest.testSolrCellXML-seed#[4BE440EC2E2C3C6C]] core.SolrCore (SolrCore.java:execute(1879)) - [collection1] webapp=null path=/select params={q=*%3A*&rows=2147483647} hits=1 status=0 QTime=25 
   [junit4]   1> 2013-12-20 00:55:37,844 INFO  [TEST-SolrCellMorphlineTest.testSolrCellXML-seed#[4BE440EC2E2C3C6C]] update.UpdateHandler (DirectUpdateHandler2.java:commit(521)) - start commit{,optimize=false,openSearcher=true,waitSearcher=true,expungeDeletes=false,softCommit=true,prepareCommit=false}
   [junit4]   1> 2013-12-20 00:55:37,844 INFO  [TEST-SolrCellMorphlineTest.testSolrCellXML-seed#[4BE440EC2E2C3C6C]] search.SolrIndexSearcher (SolrIndexSearcher.java:<init>(198)) - Opening Searcher@17507edd main
   [junit4]   1> 2013-12-20 00:55:37,845 INFO  [TEST-SolrCellMorphlineTest.testSolrCellXML-seed#[4BE440EC2E2C3C6C]] update.UpdateHandler (DirectUpdateHandler2.java:commit(612)) - end_commit_flush
   [junit4]   1> 2013-12-20 00:55:37,845 INFO  [searcherExecutor-4-thread-1] core.SolrCore (QuerySenderListener.java:newSearcher(44)) - QuerySenderListener sending requests to Searcher@17507edd main{StandardDirectoryReader(segments_1:3:nrt _0(5.0):C1)}
   [junit4]   1> 2013-12-20 00:55:37,846 INFO  [searcherExecutor-4-thread-1] core.SolrCore (QuerySenderListener.java:newSearcher(91)) - QuerySenderListener done.
   [junit4]   1> 2013-12-20 00:55:37,847 INFO  [searcherExecutor-4-thread-1] core.SolrCore (SolrCore.java:registerSearcher(1827)) - [collection1] Registered new searcher Searcher@17507edd main{StandardDirectoryReader(segments_1:3:nrt _0(5.0):C1)}
   [junit4]   1> 2013-12-20 00:55:37,847 INFO  [TEST-SolrCellMorphlineTest.testSolrCellXML-seed#[4BE440EC2E2C3C6C]] processor.LogUpdateProcessor (LogUpdateProcessorFactory.java:finish(198)) - [collection1] webapp=null path=/update params={commit=true&softCommit=true&waitSearcher=true} {commit=} 0 3
   [junit4]   1> 2013-12-20 00:55:37,848 INFO  [TEST-SolrCellMorphlineTest.testSolrCellXML-seed#[4BE440EC2E2C3C6C]] core.SolrCore (SolrCore.java:execute(1879)) - [collection1] webapp=null path=/select params={q=*%3A*&rows=2147483647} hits=1 status=0 QTime=0 
   [junit4]   1> 2013-12-20 00:55:37,849 INFO  [TEST-SolrCellMorphlineTest.testSolrCellXML-seed#[4BE440EC2E2C3C6C]] solr.SolrTestCaseJ4 (SolrTestCaseJ4.java:tearDown(227)) - ###Ending testSolrCellXML
   [junit4]   1> 2013-12-20 00:55:37,861 INFO  [TEST-SolrCellMorphlineTest.testSolrCellDocumentTypes2-seed#[4BE440EC2E2C3C6C]] solr.SolrTestCaseJ4 (SolrTestCaseJ4.java:setUp(222)) - ###Starting testSolrCellDocumentTypes2
   [junit4]   1> 2013-12-20 00:55:37,907 INFO  [TEST-SolrCellMorphlineTest.testSolrCellDocumentTypes2-seed#[4BE440EC2E2C3C6C]] search.SolrIndexSearcher (SolrIndexSearcher.java:<init>(198)) - Opening Searcher@2a728ed1 realtime
   [junit4]   1> 2013-12-20 00:55:37,907 INFO  [TEST-SolrCellMorphlineTest.testSolrCellDocumentTypes2-seed#[4BE440EC2E2C3C6C]] processor.LogUpdateProcessor (LogUpdateProcessorFactory.java:finish(198)) - [collection1] webapp=null path=/update params={} {deleteByQuery=*:* (-1454900183418535936)} 0 46
   [junit4]   1> 2013-12-20 00:55:37,908 INFO  [TEST-SolrCellMorphlineTest.testSolrCellDocumentTypes2-seed#[4BE440EC2E2C3C6C]] update.UpdateHandler (DirectUpdateHandler2.java:commit(521)) - start commit{,optimize=false,openSearcher=true,waitSearcher=true,expungeDeletes=false,softCommit=false,prepareCommit=false}
   [junit4]   1> 2013-12-20 00:55:37,909 INFO  [TEST-SolrCellMorphlineTest.testSolrCellDocumentTypes2-seed#[4BE440EC2E2C3C6C]] core.SolrCore (SolrDeletionPolicy.java:onCommit(98)) - SolrDeletionPolicy.onCommit: commits: num=2
   [junit4]   1> 	commit{dir=MockDirectoryWrapper(org.apache.lucene.store.RAMDirectory@3971846 lockFactory=org.apache.lucene.store.NativeFSLockFactory@2c231468),segFN=segments_1,generation=1}
   [junit4]   1> 	commit{dir=MockDirectoryWrapper(org.apache.lucene.store.RAMDirectory@3971846 lockFactory=org.apache.lucene.store.NativeFSLockFactory@2c231468),segFN=segments_2,generation=2}
   [junit4]   1> 2013-12-20 00:55:37,910 INFO  [TEST-SolrCellMorphlineTest.testSolrCellDocumentTypes2-seed#[4BE440EC2E2C3C6C]] core.SolrCore (SolrDeletionPolicy.java:updateCommits(165)) - newest commit generation = 2
   [junit4]   1> 2013-12-20 00:55:37,910 INFO  [TEST-SolrCellMorphlineTest.testSolrCellDocumentTypes2-seed#[4BE440EC2E2C3C6C]] search.SolrIndexSearcher (SolrIndexSearcher.java:<init>(198)) - Opening Searcher@3cba2d07 main
   [junit4]   1> 2013-12-20 00:55:37,911 INFO  [TEST-SolrCellMorphlineTest.testSolrCellDocumentTypes2-seed#[4BE440EC2E2C3C6C]] update.UpdateHandler (DirectUpdateHandler2.java:commit(612)) - end_commit_flush
   [junit4]   1> 2013-12-20 00:55:37,911 INFO  [searcherExecutor-4-thread-1] core.SolrCore (QuerySenderListener.java:newSearcher(44)) - QuerySenderListener sending requests to Searcher@3cba2d07 main{StandardDirectoryReader(segments_1:5:nrt)}
   [junit4]   1> 2013-12-20 00:55:37,913 INFO  [searcherExecutor-4-thread-1] core.SolrCore (QuerySenderListener.java:newSearcher(91)) - QuerySenderListener done.
   [junit4]   1> 2013-12-20 00:55:37,914 INFO  [searcherExecutor-4-thread-1] core.SolrCore (SolrCore.java:registerSearcher(1827)) - [collection1] Registered new searcher Searcher@3cba2d07 main{StandardDirectoryReader(segments_1:5:nrt)}
   [junit4]   1> 2013-12-20 00:55:37,916 INFO  [TEST-SolrCellMorphlineTest.testSolrCellDocumentTypes2-seed#[4BE440EC2E2C3C6C]] processor.LogUpdateProcessor (LogUpdateProcessorFactory.java:finish(198)) - [collection1] webapp=null path=/update params={commit=true&softCommit=false&waitSearcher=true} {commit=} 0 8
   [junit4]   1> 2013-12-20 00:55:37,952 INFO  [TEST-SolrCellMorphlineTest.testSolrCellDocumentTypes2-seed#[4BE440EC2E2C3C6C]] api.MorphlineContext (MorphlineContext.java:importCommandBuilders(75)) - Importing commands
   [junit4]   1> 2013-12-20 00:55:40,303 INFO  [TEST-SolrCellMorphlineTest.testSolrCellDocumentTypes2-seed#[4BE440EC2E2C3C6C]] core.SolrResourceLoader (SolrResourceLoader.java:<init>(116)) - new SolrResourceLoader for directory: '/mnt/ssd/jenkins/workspace/Lucene-Solr-trunk-Linux/solr/contrib/map-reduce/src/test-files/solr/collection1/'
   [junit4]   1> 2013-12-20 00:55:40,347 INFO  [TEST-SolrCellMorphlineTest.testSolrCellDocumentTypes2-seed#[4BE440EC2E2C3C6C]] core.SolrConfig (SolrConfig.java:initLibs(503)) - Adding specified lib dirs to ClassLoader
   [junit4]   1> 2013-12-20 00:55:40,349 WARN  [TEST-SolrCellMorphlineTest.testSolrCellDocumentTypes2-seed#[4BE440EC2E2C3C6C]] core.SolrResourceLoader (SolrResourceLoader.java:addToClassLoader(170)) - Can't find (or read) directory to add to classloader: ../../../contrib/extraction/lib (resolved as: /mnt/ssd/jenkins/workspace/Lucene-Solr-trunk-Linux/solr/contrib/map-reduce/src/test-files/solr/collection1/../../../contrib/extraction/lib).
   [junit4]   1> 2013-12-20 00:55:40,350 WARN  [TEST-SolrCellMorphlineTest.testSolrCellDocumentTypes2-seed#[4BE440EC2E2C3C6C]] core.SolrResourceLoader (SolrResourceLoader.java:addToClassLoader(170)) - Can't find (or read) directory to add to classloader: ../../../dist/ (resolved as: /mnt/ssd/jenkins/workspace/Lucene-Solr-trunk-Linux/solr/contrib/map-reduce/src/test-files/solr/collection1/../../../dist).
   [junit4]   1> 2013-12-20 00:55:40,351 WARN  [TEST-SolrCellMorphlineTest.testSolrCellDocumentTypes2-seed#[4BE440EC2E2C3C6C]] core.SolrResourceLoader (SolrResourceLoader.java:addToClassLoader(170)) - Can't find (or read) directory to add to classloader: ../../../contrib/clustering/lib/ (resolved as: /mnt/ssd/jenkins/workspace/Lucene-Solr-trunk-Linux/solr/contrib/map-reduce/src/test-files/solr/collection1/../../../contrib/clustering/lib).
   [junit4]   1> 2013-12-20 00:55:40,352 WARN  [TEST-SolrCellMorphlineTest.testSolrCellDocumentTypes2-seed#[4BE440EC2E2C3C6C]] core.SolrResourceLoader (SolrResourceLoader.java:addToClassLoader(170)) - Can't find (or read) directory to add to classloader: ../../../dist/ (resolved as: /mnt/ssd/jenkins/workspace/Lucene-Solr-trunk-Linux/solr/contrib/map-reduce/src/test-files/solr/collection1/../../../dist).
   [junit4]   1> 2013-12-20 00:55:40,353 WARN  [TEST-SolrCellMorphlineTest.testSolrCellDocumentTypes2-seed#[4BE440EC2E2C3C6C]] core.SolrResourceLoader (SolrResourceLoader.java:addToClassLoader(170)) - Can't find (or read) directory to add to classloader: ../../../contrib/langid/lib/ (resolved as: /mnt/ssd/jenkins/workspace/Lucene-Solr-trunk-Linux/solr/contrib/map-reduce/src/test-files/solr/collection1/../../../contrib/langid/lib).
   [junit4]   1> 2013-12-20 00:55:40,354 WARN  [TEST-SolrCellMorphlineTest.testSolrCellDocumentTypes2-seed#[4BE440EC2E2C3C6C]] core.SolrResourceLoader (SolrResourceLoader.java:addToClassLoader(170)) - Can't find (or read) directory to add to classloader: ../../../dist/ (resolved as: /mnt/ssd/jenkins/workspace/Lucene-Solr-trunk-Linux/solr/contrib/map-reduce/src/test-files/solr/collection1/../../../dist).
   [junit4]   1> 2013-12-20 00:55:40,355 WARN  [TEST-SolrCellMorphlineTest.testSolrCellDocumentTypes2-seed#[4BE440EC2E2C3C6C]] core.SolrResourceLoader (SolrResourceLoader.java:addToClassLoader(170)) - Can't find (or read) directory to add to classloader: ../../../contrib/velocity/lib (resolved as: /mnt/ssd/jenkins/workspace/Lucene-Solr-trunk-Linux/solr/contrib/map-reduce/src/test-files/solr/collection1/../../../contrib/velocity/lib).
   [junit4]   1> 2013-12-20 00:55:40,357 WARN  [TEST-SolrCellMorphlineTest.testSolrCellDocumentTypes2-seed#[4BE440EC2E2C3C6C]] core.SolrResourceLoader (SolrResourceLoader.java:addToClassLoader(170)) - Can't find (or read) directory to add to classloader: ../../../dist/ (resolved as: /mnt/ssd/jenkins/workspace/Lucene-Solr-trunk-Linux/solr/contrib/map-reduce/src/test-files/solr/collection1/../../../dist).
   [junit4]   1> 2013-12-20 00:55:40,358 WARN  [TEST-SolrCellMorphlineTest.testSolrCellDocumentTypes2-seed#[4BE440EC2E2C3C6C]] core.SolrResourceLoader (SolrResourceLoader.java:addToClassLoader(170)) - Can't find (or read) directory to add to classloader: /non/existent/dir/yields/warning (resolved as: /non/existent/dir/yields/warning).
   [junit4]   1> 2013-12-20 00:55:40,403 INFO  [TEST-SolrCellMorphlineTest.testSolrCellDocumentTypes2-seed#[4BE440EC2E2C3C6C]] core.SolrConfig (SolrConfig.java:<init>(160)) - Using Lucene MatchVersion: LUCENE_43
   [junit4]   1> 2013-12-20 00:55:40,488 INFO  [TEST-SolrCellMorphlineTest.testSolrCellDocumentTypes2-seed#[4BE440EC2E2C3C6C]] core.Config (SolrConfig.java:<init>(262)) - Loaded SolrConfig: solrconfig.xml
   [junit4]   1> 2013-12-20 00:55:40,489 INFO  [TEST-SolrCellMorphlineTest.testSolrCellDocumentTypes2-seed#[4BE440EC2E2C3C6C]] schema.IndexSchema (IndexSchema.java:readSchema(426)) - Reading Solr Schema from schema.xml
   [junit4]   1> 2013-12-20 00:55:40,522 INFO  [TEST-SolrCellMorphlineTest.testSolrCellDocumentTypes2-seed#[4BE440EC2E2C3C6C]] schema.IndexSchema (IndexSchema.java:readSchema(454)) - [null] Schema name=example
   [junit4]   1> 2013-12-20 00:55:41,045 INFO  [TEST-SolrCellMorphlineTest.testSolrCellDocumentTypes2-seed#[4BE440EC2E2C3C6C]] schema.IndexSchema (IndexSchema.java:readSchema(552)) - unique key field: id
   [junit4]   1> 2013-12-20 00:55:41,069 INFO  [TEST-SolrCellMorphlineTest.testSolrCellDocumentTypes2-seed#[4BE440EC2E2C3C6C]] schema.FileExchangeRateProvider (CurrencyField.java:reload(781)) - Reloading exchange rates from file currency.xml
   [junit4]   1> 2013-12-20 00:55:41,074 INFO  [TEST-SolrCellMorphlineTest.testSolrCellDocumentTypes2-seed#[4BE440EC2E2C3C6C]] schema.FileExchangeRateProvider (CurrencyField.java:reload(781)) - Reloading exchange rates from file currency.xml
   [junit4]   1> 2013-12-20 00:55:41,102 INFO  [TEST-SolrCellMorphlineTest.testSolrCellDocumentTypes2-seed#[4BE440EC2E2C3C6C]] core.SolrResourceLoader (SolrResourceLoader.java:<init>(116)) - new SolrResourceLoader for directory: '/mnt/ssd/jenkins/workspace/Lucene-Solr-trunk-Linux/solr/contrib/map-reduce/src/test-files/solr/collection1/'
   [junit4]   1> 2013-12-20 00:55:41,158 INFO  [TEST-SolrCellMorphlineTest.testSolrCellDocumentTypes2-seed#[4BE440EC2E2C3C6C]] core.SolrConfig (SolrConfig.java:initLibs(503)) - Adding specified lib dirs to ClassLoader
   [junit4]   1> 2013-12-20 00:55:41,159 WARN  [TEST-SolrCellMorphlineTest.testSolrCellDocumentTypes2-seed#[4BE440EC2E2C3C6C]] core.SolrResourceLoader (SolrResourceLoader.java:addToClassLoader(170)) - Can't find (or read) directory to add to classloader: ../../../contrib/extraction/lib (resolved as: /mnt/ssd/jenkins/workspace/Lucene-Solr-trunk-Linux/solr/contrib/map-reduce/src/test-files/solr/collection1/../../../contrib/extraction/lib).
   [junit4]   1> 2013-12-20 00:55:41,160 WARN  [TEST-SolrCellMorphlineTest.testSolrCellDocumentTypes2-seed#[4BE440EC2E2C3C6C]] core.SolrResourceLoader (SolrResourceLoader.java:addToClassLoader(170)) - Can't find (or read) directory to add to classloader: ../../../dist/ (resolved as: /mnt/ssd/jenkins/workspace/Lucene-Solr-trunk-Linux/solr/contrib/map-reduce/src/test-files/solr/collection1/../../../dist).
   [junit4]   1> 2013-12-20 00:55:41,160 WARN  [TEST-SolrCellMorphlineTest.testSolrCellDocumentTypes2-seed#[4BE440EC2E2C3C6C]] core.SolrResourceLoader (SolrResourceLoader.java:addToClassLoader(170)) - Can't find (or read) directory to add to classloader: ../../../contrib/clustering/lib/ (resolved as: /mnt/ssd/jenkins/workspace/Lucene-Solr-trunk-Linux/solr/contrib/map-reduce/src/test-files/solr/collection1/../../../contrib/clustering/lib).
   [junit4]   1> 2013-12-20 00:55:41,161 WARN  [TEST-SolrCellMorphlineTest.testSolrCellDocumentTypes2-seed#[4BE440EC2E2C3C6C]] core.SolrResourceLoader (SolrResourceLoader.java:addToClassLoader(170)) - Can't find (or read) directory to add to classloader: ../../../dist/ (resolved as: /mnt/ssd/jenkins/workspace/Lucene-Solr-trunk-Linux/solr/contrib/map-reduce/src/test-files/solr/collection1/../../../dist).
   [junit4]   1> 2013-12-20 00:55:41,161 WARN  [TEST-SolrCellMorphlineTest.testSolrCellDocumentTypes2-seed#[4BE440EC2E2C3C6C]] core.SolrResourceLoader (SolrResourceLoader.java:addToClassLoader(170)) - Can't find (or read) directory to add to classloader: ../../../contrib/langid/lib/ (resolved as: /mnt/ssd/jenkins/workspace/Lucene-Solr-trunk-Linux/solr/contrib/map-reduce/src/test-files/solr/collection1/../../../contrib/langid/lib).
   [junit4]   1> 2013-12-20 00:55:41,162 WARN  [TEST-SolrCellMorphlineTest.testSolrCellDocumentTypes2-seed#[4BE440EC2E2C3C6C]] core.SolrResourceLoader (SolrResourceLoader.java:addToClassLoader(170)) - Can't find (or read) directory to add to classloader: ../../../dist/ (resolved as: /mnt/ssd/jenkins/workspace/Lucene-Solr-trunk-Linux/solr/contrib/map-reduce/src/test-files/solr/collection1/../../../dist).
   [junit4]   1> 2013-12-20 00:55:41,163 WARN  [TEST-SolrCellMorphlineTest.testSolrCellDocumentTypes2-seed#[4BE440EC2E2C3C6C]] core.SolrResourceLoader (SolrResourceLoader.java:addToClassLoader(170)) - Can't find (or read) directory to add to classloader: ../../../contrib/velocity/lib (resolved as: /mnt/ssd/jenkins/workspace/Lucene-Solr-trunk-Linux/solr/contrib/map-reduce/src/test-files/solr/collection1/../../../contrib/velocity/lib).
   [junit4]   1> 2013-12-20 00:55:41,163 WARN  [TEST-SolrCellMorphlineTest.testSolrCellDocumentTypes2-seed#[4BE440EC2E2C3C6C]] core.SolrResourceLoader (SolrResourceLoader.java:addToClassLoader(170)) - Can't find (or read) directory to add to classloader: ../../../dist/ (resolved as: /mnt/ssd/jenkins/workspace/Lucene-Solr-trunk-Linux/solr/contrib/map-reduce/src/test-files/solr/collection1/../../../dist).
   [junit4]   1> 2013-12-20 00:55:41,164 WARN  [TEST-SolrCellMorphlineTest.testSolrCellDocumentTypes2-seed#[4BE440EC2E2C3C6C]] core.SolrResourceLoader (SolrResourceLoader.java:addToClassLoader(170)) - Can't find (or read) directory to add to classloader: /non/existent/dir/yields/warning (resolved as: /non/existent/dir/yields/warning).
   [junit4]   1> 2013-12-20 00:55:41,199 INFO  [TEST-SolrCellMorphlineTest.testSolrCellDocumentTypes2-seed#[4BE440EC2E2C3C6C]] core.SolrConfig (SolrConfig.java:<init>(160)) - Using Lucene MatchVersion: LUCENE_43
   [junit4]   1> 2013-12-20 00:55:41,273 INFO  [TEST-SolrCellMorphlineTest.testSolrCellDocumentTypes2-seed#[4BE440EC2E2C3C6C]] core.Config (SolrConfig.java:<init>(262)) - Loaded SolrConfig: solrconfig.xml
   [junit4]   1> 2013-12-20 00:55:41,274 INFO  [TEST-SolrCellMorphlineTest.testSolrCellDocumentTypes2-seed#[4BE440EC2E2C3C6C]] schema.IndexSchema (IndexSchema.java:readSchema(426)) - Reading Solr Schema from schema.xml
   [junit4]   1> 2013-12-20 00:55:41,297 INFO  [TEST-SolrCellMorphlineTest.testSolrCellDocumentTypes2-seed#[4BE440EC2E2C3C6C]] schema.IndexSchema (IndexSchema.java:readSchema(454)) - [null] Schema name=example
   [junit4]   1> 2013-12-20 00:55:41,832 INFO  [TEST-SolrCellMorphlineTest.testSolrCellDocumentTypes2-seed#[4BE440EC2E2C3C6C]] schema.IndexSchema (IndexSchema.java:readSchema(552)) - unique key field: id
   [junit4]   1> 2013-12-20 00:55:41,854 INFO  [TEST-SolrCellMorphlineTest.testSolrCellDocumentTypes2-seed#[4BE440EC2E2C3C6C]] schema.FileExchangeRateProvider (CurrencyField.java:reload(781)) - Reloading exchange rates from file currency.xml
   [junit4]   1> 2013-12-20 00:55:41,859 INFO  [TEST-SolrCellMorphlineTest.testSolrCellDocumentTypes2-seed#[4BE440EC2E2C3C6C]] schema.FileExchangeRateProvider (CurrencyField.java:reload(781)) - Reloading exchange rates from file currency.xml
   [junit4]   1> 2013-12-20 00:55:42,307 INFO  [TEST-SolrCellMorphlineTest.testSolrCellDocumentTypes2-seed#[4BE440EC2E2C3C6C]] core.SolrResourceLoader (SolrResourceLoader.java:<init>(116)) - new SolrResourceLoader for directory: '/mnt/ssd/jenkins/workspace/Lucene-Solr-trunk-Linux/solr/contrib/map-reduce/src/test-files/solr/collection1/'
   [junit4]   1> 2013-12-20 00:55:42,340 INFO  [TEST-SolrCellMorphlineTest.testSolrCellDocumentTypes2-seed#[4BE440EC2E2C3C6C]] core.SolrConfig (SolrConfig.java:initLibs(503)) - Adding specified lib dirs to ClassLoader
   [junit4]   1> 2013-12-20 00:55:42,340 WARN  [TEST-SolrCellMorphlineTest.testSolrCellDocumentTypes2-seed#[4BE440EC2E2C3C6C]] core.SolrResourceLoader (SolrResourceLoader.java:addToClassLoader(170)) - Can't find (or read) directory to add to classloader: ../../../contrib/extraction/lib (resolved as: /mnt/ssd/jenkins/workspace/Lucene-Solr-trunk-Linux/solr/contrib/map-reduce/src/test-files/solr/collection1/../../../contrib/extraction/lib).
   [junit4]   1> 2013-12-20 00:55:42,341 WARN  [TEST-SolrCellMorphlineTest.testSolrCellDocumentTypes2-seed#[4BE440EC2E2C3C6C]] core.SolrResourceLoader (SolrResourceLoader.java:addToClassLoader(170)) - Can't find (or read) directory to add to classloader: ../../../dist/ (resolved as: /mnt/ssd/jenkins/workspace/Lucene-Solr-trunk-Linux/solr/contrib/map-reduce/src/test-files/solr/collection1/../../../dist).
   [junit4]   1> 2013-12-20 00:55:42,341 WARN  [TEST-SolrCellMorphlineTest.testSolrCellDocumentTypes2-seed#[4BE440EC2E2C3C6C]] core.SolrResourceLoader (SolrResourceLoader.java:addToClassLoader(170)) - Can't find (or read) directory to add to classloader: ../../../contrib/clustering/lib/ (resolved as: /mnt/ssd/jenkins/workspace/Lucene-Solr-trunk-Linux/solr/contrib/map-reduce/src/test-files/solr/collection1/../../../contrib/clustering/lib).
   [junit4]   1> 2013-12-20 00:55:42,342 WARN  [TEST-SolrCellMorphlineTest.testSolrCellDocumentTypes2-seed#[4BE440EC2E2C3C6C]] core.SolrResourceLoader (SolrResourceLoader.java:addToClassLoader(170)) - Can't find (or read) directory to add to classloader: ../../../dist/ (resolved as: /mnt/ssd/jenkins/workspace/Lucene-Solr-trunk-Linux/solr/contrib/map-reduce/src/test-files/solr/collection1/../../../dist).
   [junit4]   1> 2013-12-20 00:55:42,343 WARN  [TEST-SolrCellMorphlineTest.testSolrCellDocumentTypes2-seed#[4BE440EC2E2C3C6C]] core.SolrResourceLoader (SolrResourceLoader.java:addToClassLoader(170)) - Can't find (or read) directory to add to classloader: ../../../contrib/langid/lib/ (resolved as: /mnt/ssd/jenkins/workspace/Lucene-Solr-trunk-Linux/solr/contrib/map-reduce/src/test-files/solr/collection1/../../../contrib/langid/lib).
   [junit4]   1> 2013-12-20 00:55:42,343 WARN  [TEST-SolrCellMorphlineTest.testSolrCellDocumentTypes2-seed#[4BE440EC2E2C3C6C]] core.SolrResourceLoader (SolrResourceLoader.java:addToClassLoader(170)) - Can't find (or read) directory to add to classloader: ../../../dist/ (resolved as: /mnt/ssd/jenkins/workspace/Lucene-Solr-trunk-Linux/solr/contrib/map-reduce/src/test-files/solr/collection1/../../../dist).
   [junit4]   1> 2013-12-20 00:55:42,344 WARN  [TEST-SolrCellMorphlineTest.testSolrCellDocumentTypes2-seed#[4BE440EC2E2C3C6C]] core.SolrResourceLoader (SolrResourceLoader.java:addToClassLoader(170)) - Can't find (or read) directory to add to classloader: ../../../contrib/velocity/lib (resolved as: /mnt/ssd/jenkins/workspace/Lucene-Solr-trunk-Linux/solr/contrib/map-reduce/src/test-files/solr/collection1/../../../contrib/velocity/lib).
   [junit4]   1> 2013-12-20 00:55:42,344 WARN  [TEST-SolrCellMorphlineTest.testSolrCellDocumentTypes2-seed#[4BE440EC2E2C3C6C]] core.SolrResourceLoader (SolrResourceLoader.java:addToClassLoader(170)) - Can't find (or read) directory to add to classloader: ../../../dist/ (resolved as: /mnt/ssd/jenkins/workspace/Lucene-Solr-trunk-Linux/solr/contrib/map-reduce/src/test-files/solr/collection1/../../../dist).
   [junit4]   1> 2013-12-20 00:55:42,345 WARN  [TEST-SolrCellMorphlineTest.testSolrCellDocumentTypes2-seed#[4BE440EC2E2C3C6C]] core.SolrResourceLoader (SolrResourceLoader.java:addToClassLoader(170)) - Can't find (or read) directory to add to classloader: /non/existent/dir/yields/warning (resolved as: /non/existent/dir/yields/warning).
   [junit4]   1> 2013-12-20 00:55:42,381 INFO  [TEST-SolrCellMorphlineTest.testSolrCellDocumentTypes2-seed#[4BE440EC2E2C3C6C]] core.SolrConfig (SolrConfig.java:<init>(160)) - Using Lucene MatchVersion: LUCENE_43
   [junit4]   1> 2013-12-20 00:55:42,461 INFO  [TEST-SolrCellMorphlineTest.testSolrCellDocumentTypes2-seed#[4BE440EC2E2C3C6C]] core.Config (SolrConfig.java:<init>(262)) - Loaded SolrConfig: solrconfig.xml
   [junit4]   1> 2013-12-20 00:55:42,463 INFO  [TEST-SolrCellMorphlineTest.testSolrCellDocumentTypes2-seed#[4BE440EC2E2C3C6C]] schema.IndexSchema (IndexSchema.java:readSchema(426)) - Reading Solr Schema from schema.xml
   [junit4]   1> 2013-12-20 00:55:42,480 INFO  [TEST-SolrCellMorphlineTest.testSolrCellDocumentTypes2-seed#[4BE440EC2E2C3C6C]] schema.IndexSchema (IndexSchema.java:readSchema(454)) - [null] Schema name=example
   [junit4]   1> 2013-12-20 00:55:42,990 INFO  [TEST-SolrCellMorphlineTest.testSolrCellDocumentTypes2-seed#[4BE440EC2E2C3C6C]] schema.IndexSchema (IndexSchema.java:readSchema(552)) - unique key field: id
   [junit4]   1> 2013-12-20 00:55:43,012 INFO  [TEST-SolrCellMorphlineTest.testSolrCellDocumentTypes2-seed#[4BE440EC2E2C3C6C]] schema.FileExchangeRateProvider (CurrencyField.java:reload(781)) - Reloading exchange rates from file currency.xml
   [junit4]   1> 2013-12-20 00:55:43,017 INFO  [TEST-SolrCellMorphlineTest.testSolrCellDocumentTypes2-seed#[4BE440EC2E2C3C6C]] schema.FileExchangeRateProvider (CurrencyField.java:reload(781)) - Reloading exchange rates from file currency.xml
   [junit4]   1> 2013-12-20 00:55:43,041 INFO  [TEST-SolrCellMorphlineTest.testSolrCellDocumentTypes2-seed#[4BE440EC2E2C3C6C]] core.SolrResourceLoader (SolrResourceLoader.java:<init>(116)) - new SolrResourceLoader for directory: '/mnt/ssd/jenkins/workspace/Lucene-Solr-trunk-Linux/solr/contrib/map-reduce/src/test-files/solr/collection1/'
   [junit4]   1> 2013-12-20 00:55:43,080 INFO  [TEST-SolrCellMorphlineTest.testSolrCellDocumentTypes2-seed#[4BE440EC2E2C3C6C]] core.SolrConfig (SolrConfig.java:initLibs(503)) - Adding specified lib dirs to ClassLoader
   [junit4]   1> 2013-12-20 00:55:43,081 WARN  [TEST-SolrCellMorphlineTest.testSolrCellDocumentTypes2-seed#[4BE440EC2E2C3C6C]] core.SolrResourceLoader (SolrResourceLoader.java:addToClassLoader(170)) - Can't find (or read) directory to add to classloader:

[...truncated too long message...]

 00:55:55,413 INFO  [TEST-SolrCellMorphlineTest.testSolrCellDocumentTypes-seed#[4BE440EC2E2C3C6C]] update.UpdateHandler (DirectUpdateHandler2.java:commit(521)) - start commit{,optimize=false,openSearcher=true,waitSearcher=true,expungeDeletes=false,softCommit=true,prepareCommit=false}
   [junit4]   1> 2013-12-20 00:55:55,423 INFO  [TEST-SolrCellMorphlineTest.testSolrCellDocumentTypes-seed#[4BE440EC2E2C3C6C]] search.SolrIndexSearcher (SolrIndexSearcher.java:<init>(198)) - Opening Searcher@595dc9b4 main
   [junit4]   1> 2013-12-20 00:55:55,424 INFO  [TEST-SolrCellMorphlineTest.testSolrCellDocumentTypes-seed#[4BE440EC2E2C3C6C]] update.UpdateHandler (DirectUpdateHandler2.java:commit(612)) - end_commit_flush
   [junit4]   1> 2013-12-20 00:55:55,425 INFO  [searcherExecutor-4-thread-1] core.SolrCore (QuerySenderListener.java:newSearcher(44)) - QuerySenderListener sending requests to Searcher@595dc9b4 main{StandardDirectoryReader(segments_4:29:nrt _7(5.0):C1 _8(5.0):C1 _9(5.0):C1 _a(5.0):C1)}
   [junit4]   1> 2013-12-20 00:55:55,425 INFO  [searcherExecutor-4-thread-1] core.SolrCore (QuerySenderListener.java:newSearcher(91)) - QuerySenderListener done.
   [junit4]   1> 2013-12-20 00:55:55,426 INFO  [searcherExecutor-4-thread-1] core.SolrCore (SolrCore.java:registerSearcher(1827)) - [collection1] Registered new searcher Searcher@595dc9b4 main{StandardDirectoryReader(segments_4:29:nrt _7(5.0):C1 _8(5.0):C1 _9(5.0):C1 _a(5.0):C1)}
   [junit4]   1> 2013-12-20 00:55:55,426 INFO  [TEST-SolrCellMorphlineTest.testSolrCellDocumentTypes-seed#[4BE440EC2E2C3C6C]] processor.LogUpdateProcessor (LogUpdateProcessorFactory.java:finish(198)) - [collection1] webapp=null path=/update params={commit=true&softCommit=true&waitSearcher=true} {commit=} 0 13
   [junit4]   1> 2013-12-20 00:55:55,427 INFO  [TEST-SolrCellMorphlineTest.testSolrCellDocumentTypes-seed#[4BE440EC2E2C3C6C]] core.SolrCore (SolrCore.java:execute(1879)) - [collection1] webapp=null path=/select params={q=*%3A*&rows=2147483647} hits=4 status=0 QTime=0 
   [junit4]   1> 2013-12-20 00:55:55,430 INFO  [TEST-SolrCellMorphlineTest.testSolrCellDocumentTypes-seed#[4BE440EC2E2C3C6C]] solr.SolrTestCaseJ4 (SolrTestCaseJ4.java:tearDown(227)) - ###Ending testSolrCellDocumentTypes
   [junit4]   2> NOTE: reproduce with: ant test  -Dtestcase=SolrCellMorphlineTest -Dtests.method=testSolrCellDocumentTypes -Dtests.seed=4BE440EC2E2C3C6C -Dtests.multiplier=3 -Dtests.slow=true -Dtests.locale=hi_IN -Dtests.timezone=America/Port_of_Spain -Dtests.file.encoding=UTF-8
   [junit4] FAILURE 5.25s | SolrCellMorphlineTest.testSolrCellDocumentTypes <<<
   [junit4]    > Throwable #1: java.lang.AssertionError: key:ignored_creation_date expected:<[2011-09-02T10:11:00Z]> but was:<[२०११-०९-०२T१०:११:००Z]>
   [junit4]    > 	at __randomizedtesting.SeedInfo.seed([4BE440EC2E2C3C6C:D127E3724BF762B9]:0)
   [junit4]    > 	at org.apache.solr.morphlines.solr.AbstractSolrMorphlineTestBase.testDocumentTypesInternal(AbstractSolrMorphlineTestBase.java:165)
   [junit4]    > 	at org.apache.solr.morphlines.cell.SolrCellMorphlineTest.testSolrCellDocumentTypes(SolrCellMorphlineTest.java:192)
   [junit4]    > 	at java.lang.Thread.run(Thread.java:744)
   [junit4]   1> 2013-12-20 00:55:55,439 INFO  [SUITE-SolrCellMorphlineTest-seed#[4BE440EC2E2C3C6C]-worker] solr.SolrTestCaseJ4 (SolrTestCaseJ4.java:deleteCore(543)) - ###deleteCore
   [junit4]   1> 2013-12-20 00:55:55,440 INFO  [SUITE-SolrCellMorphlineTest-seed#[4BE440EC2E2C3C6C]-worker] core.CoreContainer (CoreContainer.java:shutdown(343)) - Shutting down CoreContainer instance=515799507
   [junit4]   1> 2013-12-20 00:55:55,440 INFO  [SUITE-SolrCellMorphlineTest-seed#[4BE440EC2E2C3C6C]-worker] core.SolrCore (SolrCore.java:close(997)) - [collection1]  CLOSING SolrCore org.apache.solr.core.SolrCore@274c1096
   [junit4]   1> 2013-12-20 00:55:55,441 INFO  [SUITE-SolrCellMorphlineTest-seed#[4BE440EC2E2C3C6C]-worker] update.UpdateHandler (DirectUpdateHandler2.java:close(687)) - closing DirectUpdateHandler2{commits=22,autocommit maxTime=60000ms,autocommits=0,soft autocommit maxTime=1000ms,soft autocommits=0,optimizes=0,rollbacks=0,expungeDeletes=0,docsPending=4,adds=0,deletesById=0,deletesByQuery=0,errors=0,cumulative_adds=11,cumulative_deletesById=0,cumulative_deletesByQuery=9,cumulative_errors=0,transaction_logs_total_size=17556,transaction_logs_total_number=9}
   [junit4]   1> 2013-12-20 00:55:55,442 INFO  [SUITE-SolrCellMorphlineTest-seed#[4BE440EC2E2C3C6C]-worker] update.SolrCoreState (SolrCoreState.java:decrefSolrCoreState(71)) - Closing SolrCoreState
   [junit4]   1> 2013-12-20 00:55:55,443 INFO  [SUITE-SolrCellMorphlineTest-seed#[4BE440EC2E2C3C6C]-worker] update.DefaultSolrCoreState (DefaultSolrCoreState.java:closeIndexWriter(65)) - SolrCoreState ref count has reached 0 - closing IndexWriter
   [junit4]   1> 2013-12-20 00:55:55,443 INFO  [SUITE-SolrCellMorphlineTest-seed#[4BE440EC2E2C3C6C]-worker] update.DefaultSolrCoreState (DefaultSolrCoreState.java:closeIndexWriter(67)) - closing IndexWriter with IndexWriterCloser
   [junit4]   1> 2013-12-20 00:55:55,444 INFO  [SUITE-SolrCellMorphlineTest-seed#[4BE440EC2E2C3C6C]-worker] core.SolrCore (SolrDeletionPolicy.java:onCommit(98)) - SolrDeletionPolicy.onCommit: commits: num=2
   [junit4]   1> 	commit{dir=MockDirectoryWrapper(org.apache.lucene.store.RAMDirectory@3971846 lockFactory=org.apache.lucene.store.NativeFSLockFactory@2c231468),segFN=segments_4,generation=4}
   [junit4]   1> 	commit{dir=MockDirectoryWrapper(org.apache.lucene.store.RAMDirectory@3971846 lockFactory=org.apache.lucene.store.NativeFSLockFactory@2c231468),segFN=segments_5,generation=5}
   [junit4]   1> 2013-12-20 00:55:55,445 INFO  [SUITE-SolrCellMorphlineTest-seed#[4BE440EC2E2C3C6C]-worker] core.SolrCore (SolrDeletionPolicy.java:updateCommits(165)) - newest commit generation = 5
   [junit4]   1> 2013-12-20 00:55:55,447 INFO  [SUITE-SolrCellMorphlineTest-seed#[4BE440EC2E2C3C6C]-worker] core.SolrCore (SolrCore.java:closeSearcher(1844)) - [collection1] Closing main searcher on request.
   [junit4]   1> 2013-12-20 00:55:55,448 INFO  [SUITE-SolrCellMorphlineTest-seed#[4BE440EC2E2C3C6C]-worker] core.CachingDirectoryFactory (CachingDirectoryFactory.java:close(168)) - Closing MockDirectoryFactory - 2 directories currently being tracked
   [junit4]   1> 2013-12-20 00:55:55,448 INFO  [SUITE-SolrCellMorphlineTest-seed#[4BE440EC2E2C3C6C]-worker] core.CachingDirectoryFactory (CachingDirectoryFactory.java:closeCacheValue(235)) - looking to close /mnt/ssd/jenkins/workspace/Lucene-Solr-trunk-Linux/solr/build/contrib/solr-morphlines-cell/test/J0/./solrtest-SolrCellMorphlineTest-1387500928663 [CachedDir<<refCount=0;path=/mnt/ssd/jenkins/workspace/Lucene-Solr-trunk-Linux/solr/build/contrib/solr-morphlines-cell/test/J0/./solrtest-SolrCellMorphlineTest-1387500928663;done=false>>]
   [junit4]   1> 2013-12-20 00:55:55,449 INFO  [SUITE-SolrCellMorphlineTest-seed#[4BE440EC2E2C3C6C]-worker] core.CachingDirectoryFactory (CachingDirectoryFactory.java:close(304)) - Closing directory: /mnt/ssd/jenkins/workspace/Lucene-Solr-trunk-Linux/solr/build/contrib/solr-morphlines-cell/test/J0/./solrtest-SolrCellMorphlineTest-1387500928663
   [junit4]   1> 2013-12-20 00:55:55,449 INFO  [SUITE-SolrCellMorphlineTest-seed#[4BE440EC2E2C3C6C]-worker] core.CachingDirectoryFactory (CachingDirectoryFactory.java:closeCacheValue(235)) - looking to close /mnt/ssd/jenkins/workspace/Lucene-Solr-trunk-Linux/solr/build/contrib/solr-morphlines-cell/test/J0/./solrtest-SolrCellMorphlineTest-1387500928663/index [CachedDir<<refCount=0;path=/mnt/ssd/jenkins/workspace/Lucene-Solr-trunk-Linux/solr/build/contrib/solr-morphlines-cell/test/J0/./solrtest-SolrCellMorphlineTest-1387500928663/index;done=false>>]
   [junit4]   1> 2013-12-20 00:55:55,450 INFO  [SUITE-SolrCellMorphlineTest-seed#[4BE440EC2E2C3C6C]-worker] core.CachingDirectoryFactory (CachingDirectoryFactory.java:close(304)) - Closing directory: /mnt/ssd/jenkins/workspace/Lucene-Solr-trunk-Linux/solr/build/contrib/solr-morphlines-cell/test/J0/./solrtest-SolrCellMorphlineTest-1387500928663/index
   [junit4]   2> NOTE: test params are: codec=CheapBastard, sim=RandomSimilarityProvider(queryNorm=false,coord=yes): {}, locale=hi_IN, timezone=America/Port_of_Spain
   [junit4]   2> NOTE: Linux 3.8.0-34-generic amd64/Oracle Corporation 1.7.0_45 (64-bit)/cpus=8,threads=1,free=46042872,total=135376896
   [junit4]   2> NOTE: All tests run in this JVM: [SolrCellMorphlineTest]
   [junit4] Completed in 27.76s, 5 tests, 2 failures <<< FAILURES!

[...truncated 10 lines...]
BUILD FAILED
/mnt/ssd/jenkins/workspace/Lucene-Solr-trunk-Linux/build.xml:453: The following error occurred while executing this line:
/mnt/ssd/jenkins/workspace/Lucene-Solr-trunk-Linux/build.xml:433: The following error occurred while executing this line:
/mnt/ssd/jenkins/workspace/Lucene-Solr-trunk-Linux/build.xml:39: The following error occurred while executing this line:
/mnt/ssd/jenkins/workspace/Lucene-Solr-trunk-Linux/extra-targets.xml:37: The following error occurred while executing this line:
/mnt/ssd/jenkins/workspace/Lucene-Solr-trunk-Linux/solr/build.xml:209: The following error occurred while executing this line:
/mnt/ssd/jenkins/workspace/Lucene-Solr-trunk-Linux/solr/common-build.xml:441: The following error occurred while executing this line:
/mnt/ssd/jenkins/workspace/Lucene-Solr-trunk-Linux/solr/common-build.xml:491: The following error occurred while executing this line:
/mnt/ssd/jenkins/workspace/Lucene-Solr-trunk-Linux/lucene/common-build.xml:1304: The following error occurred while executing this line:
/mnt/ssd/jenkins/workspace/Lucene-Solr-trunk-Linux/lucene/common-build.xml:937: There were test failures: 1 suite, 5 tests, 2 failures

Total time: 51 minutes 8 seconds
Build step 'Invoke Ant' marked build as failure
Description set: Java: 64bit/jdk1.7.0_45 -XX:-UseCompressedOops -XX:+UseSerialGC
Archiving artifacts
Recording test results
Email was triggered for: Failure
Sending email for trigger: Failure



Mime
View raw message