lucene-dev mailing list archives

Site index · List index
Message view « Date » · « Thread »
Top « Date » · « Thread »
From Policeman Jenkins Server <jenk...@thetaphi.de>
Subject [JENKINS] Lucene-Solr-trunk-Linux (64bit/ibm-j9-jdk7) - Build # 8530 - Failure!
Date Sun, 01 Dec 2013 10:05:59 GMT
Build: http://jenkins.thetaphi.de/job/Lucene-Solr-trunk-Linux/8530/
Java: 64bit/ibm-j9-jdk7 -Xjit:exclude={org/apache/lucene/util/fst/FST.pack(IIF)Lorg/apache/lucene/util/fst/FST;}

6 tests failed.
REGRESSION:  org.apache.solr.analytics.expression.ExpressionTest.addTest

Error Message:
Caught exception in getStatResult, xPath = /response/lst[@name='stats']/lst[@name='ar']/double[@name='sum']  raw data: <?xml version="1.0" encoding="UTF-8"?> <response>  <lst name="responseHeader">   <int name="status">0</int>   <int name="QTime">38</int> </lst> <result name="response" numFound="100" start="0"> </result> <lst name="stats">   <lst name="stats_fields"/> </lst> <lst name="stats">   <lst name="rr">     <str name="max">str9</str>     <str name="min">str0</str>     <str name="rmax">9rts</str>     <str name="rmin">0rts</str>   </lst>   <lst name="csr">     <str name="cs1">this is the first</str>     <str name="cs2">this is the second</str>     <str name="cs3">this is the third</str>   </lst>   <lst name="avr">     <double name="c">100.0</double>     <long name="count">100</long>     <null name="s"/>     <null name="sum"/>   </lst>   <lst name="cdr">     <date name="cd1">1800-12-31T23:59:59Z</date>     <date name="cd2">1804-06-30T23:59:59Z</date>     <str name="cs1">1800-12-31T23:59:59Z</str>     <str name="cs2">1804-06-30T23:59:59Z</str>   </lst>   <lst name="dmr">     <str name="cma">+2MONTHS</str>     <str name="cme">+2YEARS</str>     <date name="dmma">1812-02-29T23:59:59Z</date>     <date name="dmme">1807-12-31T23:59:59Z</date>     <date name="max">1811-12-31T23:59:59Z</date>     <date name="median">1805-12-31T23:59:59Z</date>   </lst>   <lst name="mr">     <long name="count">100</long>     <double name="mcm">70829.5</double>     <double name="mean">28.91</double>     <double name="median">24.5</double>     <double name="su">104076.0</double>     <double name="sum">2891.0</double>     <long name="unique">36</long>   </lst>   <lst name="dr">     <long name="count">100</long>     <null name="mc"/>     <null name="mean"/>     <null name="su"/>     <null name="sum"/>     <null name="unique"/>   </lst>   <lst name="pr">     <long name="count">100</long>     <double name="mc">1.2729436151389237E146</double>     <double name="mean">28.91</double>     <double name="su">3.9603293116911423E124</double>     <double name="sum">2891.0</double>     <long name="unique">36</long>   </lst>   <lst name="ar">     <long name="count">100</long>     <null name="mcm"/>     <null name="mean"/>     <null name="median"/>     <null name="su"/>     <null name="sum"/>     <null name="unique"/>   </lst>   <lst name="cnr">     <double name="c10">10.0</double>     <double name="c8">8.0</double>   </lst>   <lst name="nr">     <double name="c">-100.0</double>     <long name="count">100</long>     <double name="s">-2891.0</double>     <double name="sum">2891.0</double>   </lst>   <lst name="cr">     <str name="ccmax">this is the secondstr9</str>     <str name="ccmin">this is the firststr0</str>     <str name="csmax">this is the second</str>     <str name="csmin">this is the first</str>     <str name="max">str9</str>     <str name="min">str0</str>   </lst> </lst> </response> 

Stack Trace:
java.lang.AssertionError: Caught exception in getStatResult, xPath = /response/lst[@name='stats']/lst[@name='ar']/double[@name='sum'] 
raw data: <?xml version="1.0" encoding="UTF-8"?>
<response>

<lst name="responseHeader">
  <int name="status">0</int>
  <int name="QTime">38</int>
</lst>
<result name="response" numFound="100" start="0">
</result>
<lst name="stats">
  <lst name="stats_fields"/>
</lst>
<lst name="stats">
  <lst name="rr">
    <str name="max">str9</str>
    <str name="min">str0</str>
    <str name="rmax">9rts</str>
    <str name="rmin">0rts</str>
  </lst>
  <lst name="csr">
    <str name="cs1">this is the first</str>
    <str name="cs2">this is the second</str>
    <str name="cs3">this is the third</str>
  </lst>
  <lst name="avr">
    <double name="c">100.0</double>
    <long name="count">100</long>
    <null name="s"/>
    <null name="sum"/>
  </lst>
  <lst name="cdr">
    <date name="cd1">1800-12-31T23:59:59Z</date>
    <date name="cd2">1804-06-30T23:59:59Z</date>
    <str name="cs1">1800-12-31T23:59:59Z</str>
    <str name="cs2">1804-06-30T23:59:59Z</str>
  </lst>
  <lst name="dmr">
    <str name="cma">+2MONTHS</str>
    <str name="cme">+2YEARS</str>
    <date name="dmma">1812-02-29T23:59:59Z</date>
    <date name="dmme">1807-12-31T23:59:59Z</date>
    <date name="max">1811-12-31T23:59:59Z</date>
    <date name="median">1805-12-31T23:59:59Z</date>
  </lst>
  <lst name="mr">
    <long name="count">100</long>
    <double name="mcm">70829.5</double>
    <double name="mean">28.91</double>
    <double name="median">24.5</double>
    <double name="su">104076.0</double>
    <double name="sum">2891.0</double>
    <long name="unique">36</long>
  </lst>
  <lst name="dr">
    <long name="count">100</long>
    <null name="mc"/>
    <null name="mean"/>
    <null name="su"/>
    <null name="sum"/>
    <null name="unique"/>
  </lst>
  <lst name="pr">
    <long name="count">100</long>
    <double name="mc">1.2729436151389237E146</double>
    <double name="mean">28.91</double>
    <double name="su">3.9603293116911423E124</double>
    <double name="sum">2891.0</double>
    <long name="unique">36</long>
  </lst>
  <lst name="ar">
    <long name="count">100</long>
    <null name="mcm"/>
    <null name="mean"/>
    <null name="median"/>
    <null name="su"/>
    <null name="sum"/>
    <null name="unique"/>
  </lst>
  <lst name="cnr">
    <double name="c10">10.0</double>
    <double name="c8">8.0</double>
  </lst>
  <lst name="nr">
    <double name="c">-100.0</double>
    <long name="count">100</long>
    <double name="s">-2891.0</double>
    <double name="sum">2891.0</double>
  </lst>
  <lst name="cr">
    <str name="ccmax">this is the secondstr9</str>
    <str name="ccmin">this is the firststr0</str>
    <str name="csmax">this is the second</str>
    <str name="csmin">this is the first</str>
    <str name="max">str9</str>
    <str name="min">str0</str>
  </lst>
</lst>
</response>

	at __randomizedtesting.SeedInfo.seed([C3682787BC26C23C:35448A59FDE9C57B]:0)
	at org.junit.Assert.fail(Assert.java:93)
	at org.apache.solr.analytics.AbstractAnalyticsStatsTest.getStatResult(AbstractAnalyticsStatsTest.java:113)
	at org.apache.solr.analytics.expression.ExpressionTest.addTest(ExpressionTest.java:78)
	at sun.reflect.NativeMethodAccessorImpl.invoke0(Native Method)
	at sun.reflect.NativeMethodAccessorImpl.invoke(NativeMethodAccessorImpl.java:88)
	at sun.reflect.DelegatingMethodAccessorImpl.invoke(DelegatingMethodAccessorImpl.java:55)
	at java.lang.reflect.Method.invoke(Method.java:613)
	at com.carrotsearch.randomizedtesting.RandomizedRunner.invoke(RandomizedRunner.java:1559)
	at com.carrotsearch.randomizedtesting.RandomizedRunner.access$600(RandomizedRunner.java:79)
	at com.carrotsearch.randomizedtesting.RandomizedRunner$6.evaluate(RandomizedRunner.java:737)
	at com.carrotsearch.randomizedtesting.RandomizedRunner$7.evaluate(RandomizedRunner.java:773)
	at com.carrotsearch.randomizedtesting.RandomizedRunner$8.evaluate(RandomizedRunner.java:787)
	at com.carrotsearch.randomizedtesting.rules.SystemPropertiesRestoreRule$1.evaluate(SystemPropertiesRestoreRule.java:53)
	at org.apache.lucene.util.TestRuleSetupTeardownChained$1.evaluate(TestRuleSetupTeardownChained.java:50)
	at org.apache.lucene.util.TestRuleFieldCacheSanity$1.evaluate(TestRuleFieldCacheSanity.java:51)
	at org.apache.lucene.util.AbstractBeforeAfterRule$1.evaluate(AbstractBeforeAfterRule.java:46)
	at com.carrotsearch.randomizedtesting.rules.SystemPropertiesInvariantRule$1.evaluate(SystemPropertiesInvariantRule.java:55)
	at org.apache.lucene.util.TestRuleThreadAndTestName$1.evaluate(TestRuleThreadAndTestName.java:49)
	at org.apache.lucene.util.TestRuleIgnoreAfterMaxFailures$1.evaluate(TestRuleIgnoreAfterMaxFailures.java:70)
	at org.apache.lucene.util.TestRuleMarkFailure$1.evaluate(TestRuleMarkFailure.java:48)
	at com.carrotsearch.randomizedtesting.rules.StatementAdapter.evaluate(StatementAdapter.java:36)
	at com.carrotsearch.randomizedtesting.ThreadLeakControl$StatementRunner.run(ThreadLeakControl.java:358)
	at com.carrotsearch.randomizedtesting.ThreadLeakControl.forkTimeoutingTask(ThreadLeakControl.java:782)
	at com.carrotsearch.randomizedtesting.ThreadLeakControl$3.evaluate(ThreadLeakControl.java:442)
	at com.carrotsearch.randomizedtesting.RandomizedRunner.runSingleTest(RandomizedRunner.java:746)
	at com.carrotsearch.randomizedtesting.RandomizedRunner$3.evaluate(RandomizedRunner.java:648)
	at com.carrotsearch.randomizedtesting.RandomizedRunner$4.evaluate(RandomizedRunner.java:682)
	at com.carrotsearch.randomizedtesting.RandomizedRunner$5.evaluate(RandomizedRunner.java:693)
	at com.carrotsearch.randomizedtesting.rules.StatementAdapter.evaluate(StatementAdapter.java:36)
	at com.carrotsearch.randomizedtesting.rules.SystemPropertiesRestoreRule$1.evaluate(SystemPropertiesRestoreRule.java:53)
	at org.apache.lucene.util.AbstractBeforeAfterRule$1.evaluate(AbstractBeforeAfterRule.java:46)
	at org.apache.lucene.util.TestRuleStoreClassName$1.evaluate(TestRuleStoreClassName.java:42)
	at com.carrotsearch.randomizedtesting.rules.SystemPropertiesInvariantRule$1.evaluate(SystemPropertiesInvariantRule.java:55)
	at com.carrotsearch.randomizedtesting.rules.NoShadowingOrOverridesOnMethodsRule$1.evaluate(NoShadowingOrOverridesOnMethodsRule.java:39)
	at com.carrotsearch.randomizedtesting.rules.NoShadowingOrOverridesOnMethodsRule$1.evaluate(NoShadowingOrOverridesOnMethodsRule.java:39)
	at com.carrotsearch.randomizedtesting.rules.StatementAdapter.evaluate(StatementAdapter.java:36)
	at org.apache.lucene.util.TestRuleAssertionsRequired$1.evaluate(TestRuleAssertionsRequired.java:43)
	at org.apache.lucene.util.TestRuleMarkFailure$1.evaluate(TestRuleMarkFailure.java:48)
	at org.apache.lucene.util.TestRuleIgnoreAfterMaxFailures$1.evaluate(TestRuleIgnoreAfterMaxFailures.java:70)
	at org.apache.lucene.util.TestRuleIgnoreTestSuites$1.evaluate(TestRuleIgnoreTestSuites.java:55)
	at com.carrotsearch.randomizedtesting.rules.StatementAdapter.evaluate(StatementAdapter.java:36)
	at com.carrotsearch.randomizedtesting.ThreadLeakControl$StatementRunner.run(ThreadLeakControl.java:358)
	at java.lang.Thread.run(Thread.java:780)


REGRESSION:  org.apache.solr.analytics.expression.ExpressionTest.absoluteValueTest

Error Message:
Caught exception in getStatResult, xPath = /response/lst[@name='stats']/lst[@name='avr']/double[@name='sum']  raw data: <?xml version="1.0" encoding="UTF-8"?> <response>  <lst name="responseHeader">   <int name="status">0</int>   <int name="QTime">38</int> </lst> <result name="response" numFound="100" start="0"> </result> <lst name="stats">   <lst name="stats_fields"/> </lst> <lst name="stats">   <lst name="rr">     <str name="max">str9</str>     <str name="min">str0</str>     <str name="rmax">9rts</str>     <str name="rmin">0rts</str>   </lst>   <lst name="csr">     <str name="cs1">this is the first</str>     <str name="cs2">this is the second</str>     <str name="cs3">this is the third</str>   </lst>   <lst name="avr">     <double name="c">100.0</double>     <long name="count">100</long>     <null name="s"/>     <null name="sum"/>   </lst>   <lst name="cdr">     <date name="cd1">1800-12-31T23:59:59Z</date>     <date name="cd2">1804-06-30T23:59:59Z</date>     <str name="cs1">1800-12-31T23:59:59Z</str>     <str name="cs2">1804-06-30T23:59:59Z</str>   </lst>   <lst name="dmr">     <str name="cma">+2MONTHS</str>     <str name="cme">+2YEARS</str>     <date name="dmma">1812-02-29T23:59:59Z</date>     <date name="dmme">1807-12-31T23:59:59Z</date>     <date name="max">1811-12-31T23:59:59Z</date>     <date name="median">1805-12-31T23:59:59Z</date>   </lst>   <lst name="mr">     <long name="count">100</long>     <double name="mcm">70829.5</double>     <double name="mean">28.91</double>     <double name="median">24.5</double>     <double name="su">104076.0</double>     <double name="sum">2891.0</double>     <long name="unique">36</long>   </lst>   <lst name="dr">     <long name="count">100</long>     <null name="mc"/>     <null name="mean"/>     <null name="su"/>     <null name="sum"/>     <null name="unique"/>   </lst>   <lst name="pr">     <long name="count">100</long>     <double name="mc">1.2729436151389237E146</double>     <double name="mean">28.91</double>     <double name="su">3.9603293116911423E124</double>     <double name="sum">2891.0</double>     <long name="unique">36</long>   </lst>   <lst name="ar">     <long name="count">100</long>     <null name="mcm"/>     <null name="mean"/>     <null name="median"/>     <null name="su"/>     <null name="sum"/>     <null name="unique"/>   </lst>   <lst name="cnr">     <double name="c10">10.0</double>     <double name="c8">8.0</double>   </lst>   <lst name="nr">     <double name="c">-100.0</double>     <long name="count">100</long>     <double name="s">-2891.0</double>     <double name="sum">2891.0</double>   </lst>   <lst name="cr">     <str name="ccmax">this is the secondstr9</str>     <str name="ccmin">this is the firststr0</str>     <str name="csmax">this is the second</str>     <str name="csmin">this is the first</str>     <str name="max">str9</str>     <str name="min">str0</str>   </lst> </lst> </response> 

Stack Trace:
java.lang.AssertionError: Caught exception in getStatResult, xPath = /response/lst[@name='stats']/lst[@name='avr']/double[@name='sum'] 
raw data: <?xml version="1.0" encoding="UTF-8"?>
<response>

<lst name="responseHeader">
  <int name="status">0</int>
  <int name="QTime">38</int>
</lst>
<result name="response" numFound="100" start="0">
</result>
<lst name="stats">
  <lst name="stats_fields"/>
</lst>
<lst name="stats">
  <lst name="rr">
    <str name="max">str9</str>
    <str name="min">str0</str>
    <str name="rmax">9rts</str>
    <str name="rmin">0rts</str>
  </lst>
  <lst name="csr">
    <str name="cs1">this is the first</str>
    <str name="cs2">this is the second</str>
    <str name="cs3">this is the third</str>
  </lst>
  <lst name="avr">
    <double name="c">100.0</double>
    <long name="count">100</long>
    <null name="s"/>
    <null name="sum"/>
  </lst>
  <lst name="cdr">
    <date name="cd1">1800-12-31T23:59:59Z</date>
    <date name="cd2">1804-06-30T23:59:59Z</date>
    <str name="cs1">1800-12-31T23:59:59Z</str>
    <str name="cs2">1804-06-30T23:59:59Z</str>
  </lst>
  <lst name="dmr">
    <str name="cma">+2MONTHS</str>
    <str name="cme">+2YEARS</str>
    <date name="dmma">1812-02-29T23:59:59Z</date>
    <date name="dmme">1807-12-31T23:59:59Z</date>
    <date name="max">1811-12-31T23:59:59Z</date>
    <date name="median">1805-12-31T23:59:59Z</date>
  </lst>
  <lst name="mr">
    <long name="count">100</long>
    <double name="mcm">70829.5</double>
    <double name="mean">28.91</double>
    <double name="median">24.5</double>
    <double name="su">104076.0</double>
    <double name="sum">2891.0</double>
    <long name="unique">36</long>
  </lst>
  <lst name="dr">
    <long name="count">100</long>
    <null name="mc"/>
    <null name="mean"/>
    <null name="su"/>
    <null name="sum"/>
    <null name="unique"/>
  </lst>
  <lst name="pr">
    <long name="count">100</long>
    <double name="mc">1.2729436151389237E146</double>
    <double name="mean">28.91</double>
    <double name="su">3.9603293116911423E124</double>
    <double name="sum">2891.0</double>
    <long name="unique">36</long>
  </lst>
  <lst name="ar">
    <long name="count">100</long>
    <null name="mcm"/>
    <null name="mean"/>
    <null name="median"/>
    <null name="su"/>
    <null name="sum"/>
    <null name="unique"/>
  </lst>
  <lst name="cnr">
    <double name="c10">10.0</double>
    <double name="c8">8.0</double>
  </lst>
  <lst name="nr">
    <double name="c">-100.0</double>
    <long name="count">100</long>
    <double name="s">-2891.0</double>
    <double name="sum">2891.0</double>
  </lst>
  <lst name="cr">
    <str name="ccmax">this is the secondstr9</str>
    <str name="ccmin">this is the firststr0</str>
    <str name="csmax">this is the second</str>
    <str name="csmin">this is the first</str>
    <str name="max">str9</str>
    <str name="min">str0</str>
  </lst>
</lst>
</response>

	at __randomizedtesting.SeedInfo.seed([C3682787BC26C23C:E2C4079271BB9A5A]:0)
	at org.junit.Assert.fail(Assert.java:93)
	at org.apache.solr.analytics.AbstractAnalyticsStatsTest.getStatResult(AbstractAnalyticsStatsTest.java:113)
	at org.apache.solr.analytics.expression.ExpressionTest.absoluteValueTest(ExpressionTest.java:143)
	at sun.reflect.NativeMethodAccessorImpl.invoke0(Native Method)
	at sun.reflect.NativeMethodAccessorImpl.invoke(NativeMethodAccessorImpl.java:88)
	at sun.reflect.DelegatingMethodAccessorImpl.invoke(DelegatingMethodAccessorImpl.java:55)
	at java.lang.reflect.Method.invoke(Method.java:613)
	at com.carrotsearch.randomizedtesting.RandomizedRunner.invoke(RandomizedRunner.java:1559)
	at com.carrotsearch.randomizedtesting.RandomizedRunner.access$600(RandomizedRunner.java:79)
	at com.carrotsearch.randomizedtesting.RandomizedRunner$6.evaluate(RandomizedRunner.java:737)
	at com.carrotsearch.randomizedtesting.RandomizedRunner$7.evaluate(RandomizedRunner.java:773)
	at com.carrotsearch.randomizedtesting.RandomizedRunner$8.evaluate(RandomizedRunner.java:787)
	at com.carrotsearch.randomizedtesting.rules.SystemPropertiesRestoreRule$1.evaluate(SystemPropertiesRestoreRule.java:53)
	at org.apache.lucene.util.TestRuleSetupTeardownChained$1.evaluate(TestRuleSetupTeardownChained.java:50)
	at org.apache.lucene.util.TestRuleFieldCacheSanity$1.evaluate(TestRuleFieldCacheSanity.java:51)
	at org.apache.lucene.util.AbstractBeforeAfterRule$1.evaluate(AbstractBeforeAfterRule.java:46)
	at com.carrotsearch.randomizedtesting.rules.SystemPropertiesInvariantRule$1.evaluate(SystemPropertiesInvariantRule.java:55)
	at org.apache.lucene.util.TestRuleThreadAndTestName$1.evaluate(TestRuleThreadAndTestName.java:49)
	at org.apache.lucene.util.TestRuleIgnoreAfterMaxFailures$1.evaluate(TestRuleIgnoreAfterMaxFailures.java:70)
	at org.apache.lucene.util.TestRuleMarkFailure$1.evaluate(TestRuleMarkFailure.java:48)
	at com.carrotsearch.randomizedtesting.rules.StatementAdapter.evaluate(StatementAdapter.java:36)
	at com.carrotsearch.randomizedtesting.ThreadLeakControl$StatementRunner.run(ThreadLeakControl.java:358)
	at com.carrotsearch.randomizedtesting.ThreadLeakControl.forkTimeoutingTask(ThreadLeakControl.java:782)
	at com.carrotsearch.randomizedtesting.ThreadLeakControl$3.evaluate(ThreadLeakControl.java:442)
	at com.carrotsearch.randomizedtesting.RandomizedRunner.runSingleTest(RandomizedRunner.java:746)
	at com.carrotsearch.randomizedtesting.RandomizedRunner$3.evaluate(RandomizedRunner.java:648)
	at com.carrotsearch.randomizedtesting.RandomizedRunner$4.evaluate(RandomizedRunner.java:682)
	at com.carrotsearch.randomizedtesting.RandomizedRunner$5.evaluate(RandomizedRunner.java:693)
	at com.carrotsearch.randomizedtesting.rules.StatementAdapter.evaluate(StatementAdapter.java:36)
	at com.carrotsearch.randomizedtesting.rules.SystemPropertiesRestoreRule$1.evaluate(SystemPropertiesRestoreRule.java:53)
	at org.apache.lucene.util.AbstractBeforeAfterRule$1.evaluate(AbstractBeforeAfterRule.java:46)
	at org.apache.lucene.util.TestRuleStoreClassName$1.evaluate(TestRuleStoreClassName.java:42)
	at com.carrotsearch.randomizedtesting.rules.SystemPropertiesInvariantRule$1.evaluate(SystemPropertiesInvariantRule.java:55)
	at com.carrotsearch.randomizedtesting.rules.NoShadowingOrOverridesOnMethodsRule$1.evaluate(NoShadowingOrOverridesOnMethodsRule.java:39)
	at com.carrotsearch.randomizedtesting.rules.NoShadowingOrOverridesOnMethodsRule$1.evaluate(NoShadowingOrOverridesOnMethodsRule.java:39)
	at com.carrotsearch.randomizedtesting.rules.StatementAdapter.evaluate(StatementAdapter.java:36)
	at org.apache.lucene.util.TestRuleAssertionsRequired$1.evaluate(TestRuleAssertionsRequired.java:43)
	at org.apache.lucene.util.TestRuleMarkFailure$1.evaluate(TestRuleMarkFailure.java:48)
	at org.apache.lucene.util.TestRuleIgnoreAfterMaxFailures$1.evaluate(TestRuleIgnoreAfterMaxFailures.java:70)
	at org.apache.lucene.util.TestRuleIgnoreTestSuites$1.evaluate(TestRuleIgnoreTestSuites.java:55)
	at com.carrotsearch.randomizedtesting.rules.StatementAdapter.evaluate(StatementAdapter.java:36)
	at com.carrotsearch.randomizedtesting.ThreadLeakControl$StatementRunner.run(ThreadLeakControl.java:358)
	at java.lang.Thread.run(Thread.java:780)


REGRESSION:  org.apache.solr.analytics.expression.ExpressionTest.divideTest

Error Message:
Caught exception in getStatResult, xPath = /response/lst[@name='stats']/lst[@name='dr']/double[@name='sum']  raw data: <?xml version="1.0" encoding="UTF-8"?> <response>  <lst name="responseHeader">   <int name="status">0</int>   <int name="QTime">38</int> </lst> <result name="response" numFound="100" start="0"> </result> <lst name="stats">   <lst name="stats_fields"/> </lst> <lst name="stats">   <lst name="rr">     <str name="max">str9</str>     <str name="min">str0</str>     <str name="rmax">9rts</str>     <str name="rmin">0rts</str>   </lst>   <lst name="csr">     <str name="cs1">this is the first</str>     <str name="cs2">this is the second</str>     <str name="cs3">this is the third</str>   </lst>   <lst name="avr">     <double name="c">100.0</double>     <long name="count">100</long>     <null name="s"/>     <null name="sum"/>   </lst>   <lst name="cdr">     <date name="cd1">1800-12-31T23:59:59Z</date>     <date name="cd2">1804-06-30T23:59:59Z</date>     <str name="cs1">1800-12-31T23:59:59Z</str>     <str name="cs2">1804-06-30T23:59:59Z</str>   </lst>   <lst name="dmr">     <str name="cma">+2MONTHS</str>     <str name="cme">+2YEARS</str>     <date name="dmma">1812-02-29T23:59:59Z</date>     <date name="dmme">1807-12-31T23:59:59Z</date>     <date name="max">1811-12-31T23:59:59Z</date>     <date name="median">1805-12-31T23:59:59Z</date>   </lst>   <lst name="mr">     <long name="count">100</long>     <double name="mcm">70829.5</double>     <double name="mean">28.91</double>     <double name="median">24.5</double>     <double name="su">104076.0</double>     <double name="sum">2891.0</double>     <long name="unique">36</long>   </lst>   <lst name="dr">     <long name="count">100</long>     <null name="mc"/>     <null name="mean"/>     <null name="su"/>     <null name="sum"/>     <null name="unique"/>   </lst>   <lst name="pr">     <long name="count">100</long>     <double name="mc">1.2729436151389237E146</double>     <double name="mean">28.91</double>     <double name="su">3.9603293116911423E124</double>     <double name="sum">2891.0</double>     <long name="unique">36</long>   </lst>   <lst name="ar">     <long name="count">100</long>     <null name="mcm"/>     <null name="mean"/>     <null name="median"/>     <null name="su"/>     <null name="sum"/>     <null name="unique"/>   </lst>   <lst name="cnr">     <double name="c10">10.0</double>     <double name="c8">8.0</double>   </lst>   <lst name="nr">     <double name="c">-100.0</double>     <long name="count">100</long>     <double name="s">-2891.0</double>     <double name="sum">2891.0</double>   </lst>   <lst name="cr">     <str name="ccmax">this is the secondstr9</str>     <str name="ccmin">this is the firststr0</str>     <str name="csmax">this is the second</str>     <str name="csmin">this is the first</str>     <str name="max">str9</str>     <str name="min">str0</str>   </lst> </lst> </response> 

Stack Trace:
java.lang.AssertionError: Caught exception in getStatResult, xPath = /response/lst[@name='stats']/lst[@name='dr']/double[@name='sum'] 
raw data: <?xml version="1.0" encoding="UTF-8"?>
<response>

<lst name="responseHeader">
  <int name="status">0</int>
  <int name="QTime">38</int>
</lst>
<result name="response" numFound="100" start="0">
</result>
<lst name="stats">
  <lst name="stats_fields"/>
</lst>
<lst name="stats">
  <lst name="rr">
    <str name="max">str9</str>
    <str name="min">str0</str>
    <str name="rmax">9rts</str>
    <str name="rmin">0rts</str>
  </lst>
  <lst name="csr">
    <str name="cs1">this is the first</str>
    <str name="cs2">this is the second</str>
    <str name="cs3">this is the third</str>
  </lst>
  <lst name="avr">
    <double name="c">100.0</double>
    <long name="count">100</long>
    <null name="s"/>
    <null name="sum"/>
  </lst>
  <lst name="cdr">
    <date name="cd1">1800-12-31T23:59:59Z</date>
    <date name="cd2">1804-06-30T23:59:59Z</date>
    <str name="cs1">1800-12-31T23:59:59Z</str>
    <str name="cs2">1804-06-30T23:59:59Z</str>
  </lst>
  <lst name="dmr">
    <str name="cma">+2MONTHS</str>
    <str name="cme">+2YEARS</str>
    <date name="dmma">1812-02-29T23:59:59Z</date>
    <date name="dmme">1807-12-31T23:59:59Z</date>
    <date name="max">1811-12-31T23:59:59Z</date>
    <date name="median">1805-12-31T23:59:59Z</date>
  </lst>
  <lst name="mr">
    <long name="count">100</long>
    <double name="mcm">70829.5</double>
    <double name="mean">28.91</double>
    <double name="median">24.5</double>
    <double name="su">104076.0</double>
    <double name="sum">2891.0</double>
    <long name="unique">36</long>
  </lst>
  <lst name="dr">
    <long name="count">100</long>
    <null name="mc"/>
    <null name="mean"/>
    <null name="su"/>
    <null name="sum"/>
    <null name="unique"/>
  </lst>
  <lst name="pr">
    <long name="count">100</long>
    <double name="mc">1.2729436151389237E146</double>
    <double name="mean">28.91</double>
    <double name="su">3.9603293116911423E124</double>
    <double name="sum">2891.0</double>
    <long name="unique">36</long>
  </lst>
  <lst name="ar">
    <long name="count">100</long>
    <null name="mcm"/>
    <null name="mean"/>
    <null name="median"/>
    <null name="su"/>
    <null name="sum"/>
    <null name="unique"/>
  </lst>
  <lst name="cnr">
    <double name="c10">10.0</double>
    <double name="c8">8.0</double>
  </lst>
  <lst name="nr">
    <double name="c">-100.0</double>
    <long name="count">100</long>
    <double name="s">-2891.0</double>
    <double name="sum">2891.0</double>
  </lst>
  <lst name="cr">
    <str name="ccmax">this is the secondstr9</str>
    <str name="ccmin">this is the firststr0</str>
    <str name="csmax">this is the second</str>
    <str name="csmin">this is the first</str>
    <str name="max">str9</str>
    <str name="min">str0</str>
  </lst>
</lst>
</response>

	at __randomizedtesting.SeedInfo.seed([C3682787BC26C23C:9B65CC7198E4A0EA]:0)
	at org.junit.Assert.fail(Assert.java:93)
	at org.apache.solr.analytics.AbstractAnalyticsStatsTest.getStatResult(AbstractAnalyticsStatsTest.java:113)
	at org.apache.solr.analytics.expression.ExpressionTest.divideTest(ExpressionTest.java:106)
	at sun.reflect.NativeMethodAccessorImpl.invoke0(Native Method)
	at sun.reflect.NativeMethodAccessorImpl.invoke(NativeMethodAccessorImpl.java:88)
	at sun.reflect.DelegatingMethodAccessorImpl.invoke(DelegatingMethodAccessorImpl.java:55)
	at java.lang.reflect.Method.invoke(Method.java:613)
	at com.carrotsearch.randomizedtesting.RandomizedRunner.invoke(RandomizedRunner.java:1559)
	at com.carrotsearch.randomizedtesting.RandomizedRunner.access$600(RandomizedRunner.java:79)
	at com.carrotsearch.randomizedtesting.RandomizedRunner$6.evaluate(RandomizedRunner.java:737)
	at com.carrotsearch.randomizedtesting.RandomizedRunner$7.evaluate(RandomizedRunner.java:773)
	at com.carrotsearch.randomizedtesting.RandomizedRunner$8.evaluate(RandomizedRunner.java:787)
	at com.carrotsearch.randomizedtesting.rules.SystemPropertiesRestoreRule$1.evaluate(SystemPropertiesRestoreRule.java:53)
	at org.apache.lucene.util.TestRuleSetupTeardownChained$1.evaluate(TestRuleSetupTeardownChained.java:50)
	at org.apache.lucene.util.TestRuleFieldCacheSanity$1.evaluate(TestRuleFieldCacheSanity.java:51)
	at org.apache.lucene.util.AbstractBeforeAfterRule$1.evaluate(AbstractBeforeAfterRule.java:46)
	at com.carrotsearch.randomizedtesting.rules.SystemPropertiesInvariantRule$1.evaluate(SystemPropertiesInvariantRule.java:55)
	at org.apache.lucene.util.TestRuleThreadAndTestName$1.evaluate(TestRuleThreadAndTestName.java:49)
	at org.apache.lucene.util.TestRuleIgnoreAfterMaxFailures$1.evaluate(TestRuleIgnoreAfterMaxFailures.java:70)
	at org.apache.lucene.util.TestRuleMarkFailure$1.evaluate(TestRuleMarkFailure.java:48)
	at com.carrotsearch.randomizedtesting.rules.StatementAdapter.evaluate(StatementAdapter.java:36)
	at com.carrotsearch.randomizedtesting.ThreadLeakControl$StatementRunner.run(ThreadLeakControl.java:358)
	at com.carrotsearch.randomizedtesting.ThreadLeakControl.forkTimeoutingTask(ThreadLeakControl.java:782)
	at com.carrotsearch.randomizedtesting.ThreadLeakControl$3.evaluate(ThreadLeakControl.java:442)
	at com.carrotsearch.randomizedtesting.RandomizedRunner.runSingleTest(RandomizedRunner.java:746)
	at com.carrotsearch.randomizedtesting.RandomizedRunner$3.evaluate(RandomizedRunner.java:648)
	at com.carrotsearch.randomizedtesting.RandomizedRunner$4.evaluate(RandomizedRunner.java:682)
	at com.carrotsearch.randomizedtesting.RandomizedRunner$5.evaluate(RandomizedRunner.java:693)
	at com.carrotsearch.randomizedtesting.rules.StatementAdapter.evaluate(StatementAdapter.java:36)
	at com.carrotsearch.randomizedtesting.rules.SystemPropertiesRestoreRule$1.evaluate(SystemPropertiesRestoreRule.java:53)
	at org.apache.lucene.util.AbstractBeforeAfterRule$1.evaluate(AbstractBeforeAfterRule.java:46)
	at org.apache.lucene.util.TestRuleStoreClassName$1.evaluate(TestRuleStoreClassName.java:42)
	at com.carrotsearch.randomizedtesting.rules.SystemPropertiesInvariantRule$1.evaluate(SystemPropertiesInvariantRule.java:55)
	at com.carrotsearch.randomizedtesting.rules.NoShadowingOrOverridesOnMethodsRule$1.evaluate(NoShadowingOrOverridesOnMethodsRule.java:39)
	at com.carrotsearch.randomizedtesting.rules.NoShadowingOrOverridesOnMethodsRule$1.evaluate(NoShadowingOrOverridesOnMethodsRule.java:39)
	at com.carrotsearch.randomizedtesting.rules.StatementAdapter.evaluate(StatementAdapter.java:36)
	at org.apache.lucene.util.TestRuleAssertionsRequired$1.evaluate(TestRuleAssertionsRequired.java:43)
	at org.apache.lucene.util.TestRuleMarkFailure$1.evaluate(TestRuleMarkFailure.java:48)
	at org.apache.lucene.util.TestRuleIgnoreAfterMaxFailures$1.evaluate(TestRuleIgnoreAfterMaxFailures.java:70)
	at org.apache.lucene.util.TestRuleIgnoreTestSuites$1.evaluate(TestRuleIgnoreTestSuites.java:55)
	at com.carrotsearch.randomizedtesting.rules.StatementAdapter.evaluate(StatementAdapter.java:36)
	at com.carrotsearch.randomizedtesting.ThreadLeakControl$StatementRunner.run(ThreadLeakControl.java:358)
	at java.lang.Thread.run(Thread.java:780)


REGRESSION:  org.apache.solr.update.AutoCommitTest.testMaxTime

Error Message:
Exception during query

Stack Trace:
java.lang.RuntimeException: Exception during query
	at __randomizedtesting.SeedInfo.seed([C3682787BC26C23C:599C5A6522BC5E00]:0)
	at org.apache.solr.SolrTestCaseJ4.assertQ(SolrTestCaseJ4.java:641)
	at org.apache.solr.update.AutoCommitTest.testMaxTime(AutoCommitTest.java:227)
	at sun.reflect.NativeMethodAccessorImpl.invoke0(Native Method)
	at sun.reflect.NativeMethodAccessorImpl.invoke(NativeMethodAccessorImpl.java:88)
	at sun.reflect.DelegatingMethodAccessorImpl.invoke(DelegatingMethodAccessorImpl.java:55)
	at java.lang.reflect.Method.invoke(Method.java:613)
	at com.carrotsearch.randomizedtesting.RandomizedRunner.invoke(RandomizedRunner.java:1559)
	at com.carrotsearch.randomizedtesting.RandomizedRunner.access$600(RandomizedRunner.java:79)
	at com.carrotsearch.randomizedtesting.RandomizedRunner$6.evaluate(RandomizedRunner.java:737)
	at com.carrotsearch.randomizedtesting.RandomizedRunner$7.evaluate(RandomizedRunner.java:773)
	at com.carrotsearch.randomizedtesting.RandomizedRunner$8.evaluate(RandomizedRunner.java:787)
	at com.carrotsearch.randomizedtesting.rules.SystemPropertiesRestoreRule$1.evaluate(SystemPropertiesRestoreRule.java:53)
	at org.apache.lucene.util.TestRuleSetupTeardownChained$1.evaluate(TestRuleSetupTeardownChained.java:50)
	at org.apache.lucene.util.TestRuleFieldCacheSanity$1.evaluate(TestRuleFieldCacheSanity.java:51)
	at org.apache.lucene.util.AbstractBeforeAfterRule$1.evaluate(AbstractBeforeAfterRule.java:46)
	at com.carrotsearch.randomizedtesting.rules.SystemPropertiesInvariantRule$1.evaluate(SystemPropertiesInvariantRule.java:55)
	at org.apache.lucene.util.TestRuleThreadAndTestName$1.evaluate(TestRuleThreadAndTestName.java:49)
	at org.apache.lucene.util.TestRuleIgnoreAfterMaxFailures$1.evaluate(TestRuleIgnoreAfterMaxFailures.java:70)
	at org.apache.lucene.util.TestRuleMarkFailure$1.evaluate(TestRuleMarkFailure.java:48)
	at com.carrotsearch.randomizedtesting.rules.StatementAdapter.evaluate(StatementAdapter.java:36)
	at com.carrotsearch.randomizedtesting.ThreadLeakControl$StatementRunner.run(ThreadLeakControl.java:358)
	at com.carrotsearch.randomizedtesting.ThreadLeakControl.forkTimeoutingTask(ThreadLeakControl.java:782)
	at com.carrotsearch.randomizedtesting.ThreadLeakControl$3.evaluate(ThreadLeakControl.java:442)
	at com.carrotsearch.randomizedtesting.RandomizedRunner.runSingleTest(RandomizedRunner.java:746)
	at com.carrotsearch.randomizedtesting.RandomizedRunner$3.evaluate(RandomizedRunner.java:648)
	at com.carrotsearch.randomizedtesting.RandomizedRunner$4.evaluate(RandomizedRunner.java:682)
	at com.carrotsearch.randomizedtesting.RandomizedRunner$5.evaluate(RandomizedRunner.java:693)
	at com.carrotsearch.randomizedtesting.rules.StatementAdapter.evaluate(StatementAdapter.java:36)
	at com.carrotsearch.randomizedtesting.rules.SystemPropertiesRestoreRule$1.evaluate(SystemPropertiesRestoreRule.java:53)
	at org.apache.lucene.util.AbstractBeforeAfterRule$1.evaluate(AbstractBeforeAfterRule.java:46)
	at org.apache.lucene.util.TestRuleStoreClassName$1.evaluate(TestRuleStoreClassName.java:42)
	at com.carrotsearch.randomizedtesting.rules.SystemPropertiesInvariantRule$1.evaluate(SystemPropertiesInvariantRule.java:55)
	at com.carrotsearch.randomizedtesting.rules.NoShadowingOrOverridesOnMethodsRule$1.evaluate(NoShadowingOrOverridesOnMethodsRule.java:39)
	at com.carrotsearch.randomizedtesting.rules.NoShadowingOrOverridesOnMethodsRule$1.evaluate(NoShadowingOrOverridesOnMethodsRule.java:39)
	at com.carrotsearch.randomizedtesting.rules.StatementAdapter.evaluate(StatementAdapter.java:36)
	at org.apache.lucene.util.TestRuleAssertionsRequired$1.evaluate(TestRuleAssertionsRequired.java:43)
	at org.apache.lucene.util.TestRuleMarkFailure$1.evaluate(TestRuleMarkFailure.java:48)
	at org.apache.lucene.util.TestRuleIgnoreAfterMaxFailures$1.evaluate(TestRuleIgnoreAfterMaxFailures.java:70)
	at org.apache.lucene.util.TestRuleIgnoreTestSuites$1.evaluate(TestRuleIgnoreTestSuites.java:55)
	at com.carrotsearch.randomizedtesting.rules.StatementAdapter.evaluate(StatementAdapter.java:36)
	at com.carrotsearch.randomizedtesting.ThreadLeakControl$StatementRunner.run(ThreadLeakControl.java:358)
	at java.lang.Thread.run(Thread.java:780)
Caused by: java.lang.RuntimeException: REQUEST FAILED: xpath=//result[@numFound=0]
	xml response was: <?xml version="1.0" encoding="UTF-8"?>
<response>
<lst name="responseHeader"><int name="status">0</int><int name="QTime">2316</int></lst><result name="response" numFound="1" start="0"><doc><int name="id">529</int><int name="range_facet_si">529</int><arr name="range_facet_l"><long>529</long></arr><arr name="range_facet_sl"><long>529</long></arr><arr name="field_t"><str>what's inside?</str></arr><arr name="subject"><str>info</str></arr><long name="_version_">1453212922246332416</long><int name="intDefault">42</int><date name="timestamp">2013-12-01T09:57:20.216Z</date><arr name="multiDefault"><str>muLti-Default</str></arr></doc></result>
</response>

	request was:version=2.2&q=id:529&start=0&rows=20&qt=standard
	at org.apache.solr.SolrTestCaseJ4.assertQ(SolrTestCaseJ4.java:634)
	... 41 more


REGRESSION:  org.apache.solr.update.processor.SignatureUpdateProcessorFactoryTest.testMultiThreaded

Error Message:
expected:<1> but was:<2>

Stack Trace:
java.lang.AssertionError: expected:<1> but was:<2>
	at __randomizedtesting.SeedInfo.seed([C3682787BC26C23C:A2FDFD6754F7C8CA]:0)
	at org.junit.Assert.fail(Assert.java:93)
	at org.junit.Assert.failNotEquals(Assert.java:647)
	at org.junit.Assert.assertEquals(Assert.java:128)
	at org.junit.Assert.assertEquals(Assert.java:472)
	at org.junit.Assert.assertEquals(Assert.java:456)
	at org.apache.solr.update.processor.SignatureUpdateProcessorFactoryTest.checkNumDocs(SignatureUpdateProcessorFactoryTest.java:71)
	at org.apache.solr.update.processor.SignatureUpdateProcessorFactoryTest.testMultiThreaded(SignatureUpdateProcessorFactoryTest.java:222)
	at sun.reflect.NativeMethodAccessorImpl.invoke0(Native Method)
	at sun.reflect.NativeMethodAccessorImpl.invoke(NativeMethodAccessorImpl.java:88)
	at sun.reflect.DelegatingMethodAccessorImpl.invoke(DelegatingMethodAccessorImpl.java:55)
	at java.lang.reflect.Method.invoke(Method.java:613)
	at com.carrotsearch.randomizedtesting.RandomizedRunner.invoke(RandomizedRunner.java:1559)
	at com.carrotsearch.randomizedtesting.RandomizedRunner.access$600(RandomizedRunner.java:79)
	at com.carrotsearch.randomizedtesting.RandomizedRunner$6.evaluate(RandomizedRunner.java:737)
	at com.carrotsearch.randomizedtesting.RandomizedRunner$7.evaluate(RandomizedRunner.java:773)
	at com.carrotsearch.randomizedtesting.RandomizedRunner$8.evaluate(RandomizedRunner.java:787)
	at com.carrotsearch.randomizedtesting.rules.SystemPropertiesRestoreRule$1.evaluate(SystemPropertiesRestoreRule.java:53)
	at org.apache.lucene.util.TestRuleSetupTeardownChained$1.evaluate(TestRuleSetupTeardownChained.java:50)
	at org.apache.lucene.util.TestRuleFieldCacheSanity$1.evaluate(TestRuleFieldCacheSanity.java:51)
	at org.apache.lucene.util.AbstractBeforeAfterRule$1.evaluate(AbstractBeforeAfterRule.java:46)
	at com.carrotsearch.randomizedtesting.rules.SystemPropertiesInvariantRule$1.evaluate(SystemPropertiesInvariantRule.java:55)
	at org.apache.lucene.util.TestRuleThreadAndTestName$1.evaluate(TestRuleThreadAndTestName.java:49)
	at org.apache.lucene.util.TestRuleIgnoreAfterMaxFailures$1.evaluate(TestRuleIgnoreAfterMaxFailures.java:70)
	at org.apache.lucene.util.TestRuleMarkFailure$1.evaluate(TestRuleMarkFailure.java:48)
	at com.carrotsearch.randomizedtesting.rules.StatementAdapter.evaluate(StatementAdapter.java:36)
	at com.carrotsearch.randomizedtesting.ThreadLeakControl$StatementRunner.run(ThreadLeakControl.java:358)
	at com.carrotsearch.randomizedtesting.ThreadLeakControl.forkTimeoutingTask(ThreadLeakControl.java:782)
	at com.carrotsearch.randomizedtesting.ThreadLeakControl$3.evaluate(ThreadLeakControl.java:442)
	at com.carrotsearch.randomizedtesting.RandomizedRunner.runSingleTest(RandomizedRunner.java:746)
	at com.carrotsearch.randomizedtesting.RandomizedRunner$3.evaluate(RandomizedRunner.java:648)
	at com.carrotsearch.randomizedtesting.RandomizedRunner$4.evaluate(RandomizedRunner.java:682)
	at com.carrotsearch.randomizedtesting.RandomizedRunner$5.evaluate(RandomizedRunner.java:693)
	at com.carrotsearch.randomizedtesting.rules.StatementAdapter.evaluate(StatementAdapter.java:36)
	at com.carrotsearch.randomizedtesting.rules.SystemPropertiesRestoreRule$1.evaluate(SystemPropertiesRestoreRule.java:53)
	at org.apache.lucene.util.AbstractBeforeAfterRule$1.evaluate(AbstractBeforeAfterRule.java:46)
	at org.apache.lucene.util.TestRuleStoreClassName$1.evaluate(TestRuleStoreClassName.java:42)
	at com.carrotsearch.randomizedtesting.rules.SystemPropertiesInvariantRule$1.evaluate(SystemPropertiesInvariantRule.java:55)
	at com.carrotsearch.randomizedtesting.rules.NoShadowingOrOverridesOnMethodsRule$1.evaluate(NoShadowingOrOverridesOnMethodsRule.java:39)
	at com.carrotsearch.randomizedtesting.rules.NoShadowingOrOverridesOnMethodsRule$1.evaluate(NoShadowingOrOverridesOnMethodsRule.java:39)
	at com.carrotsearch.randomizedtesting.rules.StatementAdapter.evaluate(StatementAdapter.java:36)
	at org.apache.lucene.util.TestRuleAssertionsRequired$1.evaluate(TestRuleAssertionsRequired.java:43)
	at org.apache.lucene.util.TestRuleMarkFailure$1.evaluate(TestRuleMarkFailure.java:48)
	at org.apache.lucene.util.TestRuleIgnoreAfterMaxFailures$1.evaluate(TestRuleIgnoreAfterMaxFailures.java:70)
	at org.apache.lucene.util.TestRuleIgnoreTestSuites$1.evaluate(TestRuleIgnoreTestSuites.java:55)
	at com.carrotsearch.randomizedtesting.rules.StatementAdapter.evaluate(StatementAdapter.java:36)
	at com.carrotsearch.randomizedtesting.ThreadLeakControl$StatementRunner.run(ThreadLeakControl.java:358)
	at java.lang.Thread.run(Thread.java:780)


REGRESSION:  org.apache.solr.update.processor.SignatureUpdateProcessorFactoryTest.testDupeDetection

Error Message:
expected:<1> but was:<2>

Stack Trace:
java.lang.AssertionError: expected:<1> but was:<2>
	at __randomizedtesting.SeedInfo.seed([C3682787BC26C23C:9858DC4FBF616140]:0)
	at org.junit.Assert.fail(Assert.java:93)
	at org.junit.Assert.failNotEquals(Assert.java:647)
	at org.junit.Assert.assertEquals(Assert.java:128)
	at org.junit.Assert.assertEquals(Assert.java:472)
	at org.junit.Assert.assertEquals(Assert.java:456)
	at org.apache.solr.update.processor.SignatureUpdateProcessorFactoryTest.checkNumDocs(SignatureUpdateProcessorFactoryTest.java:71)
	at org.apache.solr.update.processor.SignatureUpdateProcessorFactoryTest.testDupeDetection(SignatureUpdateProcessorFactoryTest.java:119)
	at sun.reflect.NativeMethodAccessorImpl.invoke0(Native Method)
	at sun.reflect.NativeMethodAccessorImpl.invoke(NativeMethodAccessorImpl.java:88)
	at sun.reflect.DelegatingMethodAccessorImpl.invoke(DelegatingMethodAccessorImpl.java:55)
	at java.lang.reflect.Method.invoke(Method.java:613)
	at com.carrotsearch.randomizedtesting.RandomizedRunner.invoke(RandomizedRunner.java:1559)
	at com.carrotsearch.randomizedtesting.RandomizedRunner.access$600(RandomizedRunner.java:79)
	at com.carrotsearch.randomizedtesting.RandomizedRunner$6.evaluate(RandomizedRunner.java:737)
	at com.carrotsearch.randomizedtesting.RandomizedRunner$7.evaluate(RandomizedRunner.java:773)
	at com.carrotsearch.randomizedtesting.RandomizedRunner$8.evaluate(RandomizedRunner.java:787)
	at com.carrotsearch.randomizedtesting.rules.SystemPropertiesRestoreRule$1.evaluate(SystemPropertiesRestoreRule.java:53)
	at org.apache.lucene.util.TestRuleSetupTeardownChained$1.evaluate(TestRuleSetupTeardownChained.java:50)
	at org.apache.lucene.util.TestRuleFieldCacheSanity$1.evaluate(TestRuleFieldCacheSanity.java:51)
	at org.apache.lucene.util.AbstractBeforeAfterRule$1.evaluate(AbstractBeforeAfterRule.java:46)
	at com.carrotsearch.randomizedtesting.rules.SystemPropertiesInvariantRule$1.evaluate(SystemPropertiesInvariantRule.java:55)
	at org.apache.lucene.util.TestRuleThreadAndTestName$1.evaluate(TestRuleThreadAndTestName.java:49)
	at org.apache.lucene.util.TestRuleIgnoreAfterMaxFailures$1.evaluate(TestRuleIgnoreAfterMaxFailures.java:70)
	at org.apache.lucene.util.TestRuleMarkFailure$1.evaluate(TestRuleMarkFailure.java:48)
	at com.carrotsearch.randomizedtesting.rules.StatementAdapter.evaluate(StatementAdapter.java:36)
	at com.carrotsearch.randomizedtesting.ThreadLeakControl$StatementRunner.run(ThreadLeakControl.java:358)
	at com.carrotsearch.randomizedtesting.ThreadLeakControl.forkTimeoutingTask(ThreadLeakControl.java:782)
	at com.carrotsearch.randomizedtesting.ThreadLeakControl$3.evaluate(ThreadLeakControl.java:442)
	at com.carrotsearch.randomizedtesting.RandomizedRunner.runSingleTest(RandomizedRunner.java:746)
	at com.carrotsearch.randomizedtesting.RandomizedRunner$3.evaluate(RandomizedRunner.java:648)
	at com.carrotsearch.randomizedtesting.RandomizedRunner$4.evaluate(RandomizedRunner.java:682)
	at com.carrotsearch.randomizedtesting.RandomizedRunner$5.evaluate(RandomizedRunner.java:693)
	at com.carrotsearch.randomizedtesting.rules.StatementAdapter.evaluate(StatementAdapter.java:36)
	at com.carrotsearch.randomizedtesting.rules.SystemPropertiesRestoreRule$1.evaluate(SystemPropertiesRestoreRule.java:53)
	at org.apache.lucene.util.AbstractBeforeAfterRule$1.evaluate(AbstractBeforeAfterRule.java:46)
	at org.apache.lucene.util.TestRuleStoreClassName$1.evaluate(TestRuleStoreClassName.java:42)
	at com.carrotsearch.randomizedtesting.rules.SystemPropertiesInvariantRule$1.evaluate(SystemPropertiesInvariantRule.java:55)
	at com.carrotsearch.randomizedtesting.rules.NoShadowingOrOverridesOnMethodsRule$1.evaluate(NoShadowingOrOverridesOnMethodsRule.java:39)
	at com.carrotsearch.randomizedtesting.rules.NoShadowingOrOverridesOnMethodsRule$1.evaluate(NoShadowingOrOverridesOnMethodsRule.java:39)
	at com.carrotsearch.randomizedtesting.rules.StatementAdapter.evaluate(StatementAdapter.java:36)
	at org.apache.lucene.util.TestRuleAssertionsRequired$1.evaluate(TestRuleAssertionsRequired.java:43)
	at org.apache.lucene.util.TestRuleMarkFailure$1.evaluate(TestRuleMarkFailure.java:48)
	at org.apache.lucene.util.TestRuleIgnoreAfterMaxFailures$1.evaluate(TestRuleIgnoreAfterMaxFailures.java:70)
	at org.apache.lucene.util.TestRuleIgnoreTestSuites$1.evaluate(TestRuleIgnoreTestSuites.java:55)
	at com.carrotsearch.randomizedtesting.rules.StatementAdapter.evaluate(StatementAdapter.java:36)
	at com.carrotsearch.randomizedtesting.ThreadLeakControl$StatementRunner.run(ThreadLeakControl.java:358)
	at java.lang.Thread.run(Thread.java:780)




Build Log:
[...truncated 10160 lines...]
   [junit4] Suite: org.apache.solr.update.AutoCommitTest
   [junit4]   2> 164438 T644 oas.SolrTestCaseJ4.initCore ####initCore
   [junit4]   2> Creating dataDir: /mnt/ssd/jenkins/workspace/Lucene-Solr-trunk-Linux/solr/build/solr-core/test/J0/./solrtest-AutoCommitTest-1385891838233
   [junit4]   2> 164438 T644 oasc.SolrResourceLoader.<init> new SolrResourceLoader for directory: '/mnt/ssd/jenkins/workspace/Lucene-Solr-trunk-Linux/solr/build/solr-core/test-files/solr/collection1/'
   [junit4]   2> 164439 T644 oasc.SolrResourceLoader.replaceClassLoader Adding 'file:/mnt/ssd/jenkins/workspace/Lucene-Solr-trunk-Linux/solr/build/solr-core/test-files/solr/collection1/lib/classes/' to classloader
   [junit4]   2> 164439 T644 oasc.SolrResourceLoader.replaceClassLoader Adding 'file:/mnt/ssd/jenkins/workspace/Lucene-Solr-trunk-Linux/solr/build/solr-core/test-files/solr/collection1/lib/README' to classloader
   [junit4]   2> 164473 T644 oasc.SolrConfig.<init> Using Lucene MatchVersion: LUCENE_50
   [junit4]   2> 164514 T644 oasc.SolrConfig.<init> Loaded SolrConfig: solrconfig.xml
   [junit4]   2> 164514 T644 oass.IndexSchema.readSchema Reading Solr Schema from schema.xml
   [junit4]   2> 164521 T644 oass.IndexSchema.readSchema [null] Schema name=test
   [junit4]   2> 164830 T644 oass.OpenExchangeRatesOrgProvider.init Initialized with rates=open-exchange-rates.json, refreshInterval=1440.
   [junit4]   2> 164836 T644 oass.IndexSchema.readSchema default search field in schema is text
   [junit4]   2> 164840 T644 oass.IndexSchema.readSchema unique key field: id
   [junit4]   2> 164846 T644 oass.FileExchangeRateProvider.reload Reloading exchange rates from file currency.xml
   [junit4]   2> 164849 T644 oass.FileExchangeRateProvider.reload Reloading exchange rates from file currency.xml
   [junit4]   2> 164852 T644 oass.OpenExchangeRatesOrgProvider.reload Reloading exchange rates from open-exchange-rates.json
   [junit4]   2> 164853 T644 oass.OpenExchangeRatesOrgProvider$OpenExchangeRates.<init> WARN Unknown key IMPORTANT NOTE
   [junit4]   2> 164853 T644 oass.OpenExchangeRatesOrgProvider$OpenExchangeRates.<init> WARN Expected key, got STRING
   [junit4]   2> 164854 T644 oass.OpenExchangeRatesOrgProvider.reload Reloading exchange rates from open-exchange-rates.json
   [junit4]   2> 164854 T644 oass.OpenExchangeRatesOrgProvider$OpenExchangeRates.<init> WARN Unknown key IMPORTANT NOTE
   [junit4]   2> 164855 T644 oass.OpenExchangeRatesOrgProvider$OpenExchangeRates.<init> WARN Expected key, got STRING
   [junit4]   2> 164855 T644 oasc.SolrResourceLoader.locateSolrHome JNDI not configured for solr (NoInitialContextEx)
   [junit4]   2> 164855 T644 oasc.SolrResourceLoader.locateSolrHome using system property solr.solr.home: /mnt/ssd/jenkins/workspace/Lucene-Solr-trunk-Linux/solr/build/solr-core/test-files/solr
   [junit4]   2> 164856 T644 oasc.SolrResourceLoader.<init> new SolrResourceLoader for directory: '/mnt/ssd/jenkins/workspace/Lucene-Solr-trunk-Linux/solr/build/solr-core/test-files/solr/'
   [junit4]   2> 164862 T644 oasc.SolrResourceLoader.locateSolrHome JNDI not configured for solr (NoInitialContextEx)
   [junit4]   2> 164863 T644 oasc.SolrResourceLoader.locateSolrHome using system property solr.solr.home: /mnt/ssd/jenkins/workspace/Lucene-Solr-trunk-Linux/solr/build/solr-core/test-files/solr
   [junit4]   2> 164863 T644 oasc.SolrResourceLoader.<init> new SolrResourceLoader for deduced Solr Home: '/mnt/ssd/jenkins/workspace/Lucene-Solr-trunk-Linux/solr/build/solr-core/test-files/solr/'
   [junit4]   2> 164898 T644 oasc.CoreContainer.<init> New CoreContainer -940361583
   [junit4]   2> 164899 T644 oasc.CoreContainer.load Loading cores into CoreContainer [instanceDir=/mnt/ssd/jenkins/workspace/Lucene-Solr-trunk-Linux/solr/build/solr-core/test-files/solr/]
   [junit4]   2> 164900 T644 oashc.HttpShardHandlerFactory.getParameter Setting socketTimeout to: 0
   [junit4]   2> 164900 T644 oashc.HttpShardHandlerFactory.getParameter Setting urlScheme to: http://
   [junit4]   2> 164900 T644 oashc.HttpShardHandlerFactory.getParameter Setting connTimeout to: 0
   [junit4]   2> 164901 T644 oashc.HttpShardHandlerFactory.getParameter Setting maxConnectionsPerHost to: 20
   [junit4]   2> 164901 T644 oashc.HttpShardHandlerFactory.getParameter Setting corePoolSize to: 0
   [junit4]   2> 164901 T644 oashc.HttpShardHandlerFactory.getParameter Setting maximumPoolSize to: 2147483647
   [junit4]   2> 164902 T644 oashc.HttpShardHandlerFactory.getParameter Setting maxThreadIdleTime to: 5
   [junit4]   2> 164902 T644 oashc.HttpShardHandlerFactory.getParameter Setting sizeOfQueue to: -1
   [junit4]   2> 164902 T644 oashc.HttpShardHandlerFactory.getParameter Setting fairnessPolicy to: false
   [junit4]   2> 164906 T644 oasl.LogWatcher.createWatcher SLF4J impl is org.slf4j.impl.Log4jLoggerFactory
   [junit4]   2> 164906 T644 oasl.LogWatcher.newRegisteredLogWatcher Registering Log Listener [Log4j (org.slf4j.impl.Log4jLoggerFactory)]
   [junit4]   2> 164907 T644 oasc.CoreContainer.load Host Name: 
   [junit4]   2> 164910 T645 oasc.CoreContainer.create Creating SolrCore 'collection1' using instanceDir: /mnt/ssd/jenkins/workspace/Lucene-Solr-trunk-Linux/solr/build/solr-core/test-files/solr/collection1
   [junit4]   2> 164911 T645 oasc.SolrResourceLoader.<init> new SolrResourceLoader for directory: '/mnt/ssd/jenkins/workspace/Lucene-Solr-trunk-Linux/solr/build/solr-core/test-files/solr/collection1/'
   [junit4]   2> 164911 T645 oasc.SolrResourceLoader.replaceClassLoader Adding 'file:/mnt/ssd/jenkins/workspace/Lucene-Solr-trunk-Linux/solr/build/solr-core/test-files/solr/collection1/lib/classes/' to classloader
   [junit4]   2> 164912 T645 oasc.SolrResourceLoader.replaceClassLoader Adding 'file:/mnt/ssd/jenkins/workspace/Lucene-Solr-trunk-Linux/solr/build/solr-core/test-files/solr/collection1/lib/README' to classloader
   [junit4]   2> 164946 T645 oasc.SolrConfig.<init> Using Lucene MatchVersion: LUCENE_50
   [junit4]   2> 164988 T645 oasc.SolrConfig.<init> Loaded SolrConfig: solrconfig.xml
   [junit4]   2> 164989 T645 oass.IndexSchema.readSchema Reading Solr Schema from schema.xml
   [junit4]   2> 164995 T645 oass.IndexSchema.readSchema [collection1] Schema name=test
   [junit4]   2> 165297 T645 oass.OpenExchangeRatesOrgProvider.init Initialized with rates=open-exchange-rates.json, refreshInterval=1440.
   [junit4]   2> 165301 T645 oass.IndexSchema.readSchema default search field in schema is text
   [junit4]   2> 165304 T645 oass.IndexSchema.readSchema unique key field: id
   [junit4]   2> 165309 T645 oass.FileExchangeRateProvider.reload Reloading exchange rates from file currency.xml
   [junit4]   2> 165313 T645 oass.FileExchangeRateProvider.reload Reloading exchange rates from file currency.xml
   [junit4]   2> 165316 T645 oass.OpenExchangeRatesOrgProvider.reload Reloading exchange rates from open-exchange-rates.json
   [junit4]   2> 165317 T645 oass.OpenExchangeRatesOrgProvider$OpenExchangeRates.<init> WARN Unknown key IMPORTANT NOTE
   [junit4]   2> 165317 T645 oass.OpenExchangeRatesOrgProvider$OpenExchangeRates.<init> WARN Expected key, got STRING
   [junit4]   2> 165317 T645 oass.OpenExchangeRatesOrgProvider.reload Reloading exchange rates from open-exchange-rates.json
   [junit4]   2> 165318 T645 oass.OpenExchangeRatesOrgProvider$OpenExchangeRates.<init> WARN Unknown key IMPORTANT NOTE
   [junit4]   2> 165318 T645 oass.OpenExchangeRatesOrgProvider$OpenExchangeRates.<init> WARN Expected key, got STRING
   [junit4]   2> 165318 T645 oasc.SolrCore.initDirectoryFactory org.apache.solr.core.MockDirectoryFactory
   [junit4]   2> 165319 T645 oasc.SolrCore.<init> [collection1] Opening new SolrCore at /mnt/ssd/jenkins/workspace/Lucene-Solr-trunk-Linux/solr/build/solr-core/test-files/solr/collection1/, dataDir=/mnt/ssd/jenkins/workspace/Lucene-Solr-trunk-Linux/solr/build/solr-core/test/J0/./solrtest-AutoCommitTest-1385891838233/
   [junit4]   2> 165319 T645 oasc.JmxMonitoredMap.<init> JMX monitoring is enabled. Adding Solr mbeans to JMX Server: com.sun.jmx.mbeanserver.JmxMBeanServer@6024309e
   [junit4]   2> 165320 T645 oasc.CachingDirectoryFactory.get return new directory for /mnt/ssd/jenkins/workspace/Lucene-Solr-trunk-Linux/solr/build/solr-core/test/J0/./solrtest-AutoCommitTest-1385891838233
   [junit4]   2> 165320 T645 oasc.SolrCore.getNewIndexDir New index directory detected: old=null new=/mnt/ssd/jenkins/workspace/Lucene-Solr-trunk-Linux/solr/build/solr-core/test/J0/./solrtest-AutoCommitTest-1385891838233/index/
   [junit4]   2> 165320 T645 oasc.SolrCore.initIndex WARN [collection1] Solr index directory '/mnt/ssd/jenkins/workspace/Lucene-Solr-trunk-Linux/solr/build/solr-core/test/J0/./solrtest-AutoCommitTest-1385891838233/index' doesn't exist. Creating new index...
   [junit4]   2> 165321 T645 oasc.CachingDirectoryFactory.get return new directory for /mnt/ssd/jenkins/workspace/Lucene-Solr-trunk-Linux/solr/build/solr-core/test/J0/./solrtest-AutoCommitTest-1385891838233/index
   [junit4]   2> 165321 T645 oasu.RandomMergePolicy.<init> RandomMergePolicy wrapping class org.apache.lucene.index.LogDocMergePolicy: [LogDocMergePolicy: minMergeSize=1000, mergeFactor=2, maxMergeSize=9223372036854775807, maxMergeSizeForForcedMerge=9223372036854775807, calibrateSizeByDeletes=false, maxMergeDocs=2147483647, maxCFSSegmentSizeMB=8.796093022207999E12, noCFSRatio=0.25584036938982224]
   [junit4]   2> 165322 T645 oasc.SolrDeletionPolicy.onCommit SolrDeletionPolicy.onCommit: commits: num=1
   [junit4]   2> 		commit{dir=RateLimitedDirectoryWrapper(MockDirectoryWrapper(org.apache.lucene.store.RAMDirectory@cf830313 lockFactory=org.apache.lucene.store.SingleInstanceLockFactory@51a234ee)),segFN=segments_1,generation=1}
   [junit4]   2> 165322 T645 oasc.SolrDeletionPolicy.updateCommits newest commit generation = 1
   [junit4]   2> 165323 T645 oasc.SolrCore.initWriters created xml: solr.XMLResponseWriter
   [junit4]   2> 165327 T645 oasup.UpdateRequestProcessorChain.init creating updateRequestProcessorChain "dedupe"
   [junit4]   2> 165328 T645 oasup.UpdateRequestProcessorChain.init inserting DistributedUpdateProcessorFactory into updateRequestProcessorChain "dedupe"
   [junit4]   2> 165328 T645 oasup.UpdateRequestProcessorChain.init creating updateRequestProcessorChain "dedupe-allfields"
   [junit4]   2> 165328 T645 oasup.UpdateRequestProcessorChain.init inserting DistributedUpdateProcessorFactory into updateRequestProcessorChain "dedupe-allfields"
   [junit4]   2> 165328 T645 oasup.UpdateRequestProcessorChain.init creating updateRequestProcessorChain "stored_sig"
   [junit4]   2> 165329 T645 oasup.UpdateRequestProcessorChain.init inserting DistributedUpdateProcessorFactory into updateRequestProcessorChain "stored_sig"
   [junit4]   2> 165329 T645 oasup.UpdateRequestProcessorChain.init creating updateRequestProcessorChain "uniq-fields"
   [junit4]   2> 165329 T645 oasup.UpdateRequestProcessorChain.init inserting DistributedUpdateProcessorFactory into updateRequestProcessorChain "uniq-fields"
   [junit4]   2> 165330 T645 oasup.UpdateRequestProcessorChain.init creating updateRequestProcessorChain "distrib-dup-test-chain-explicit"
   [junit4]   2> 165330 T645 oasup.UpdateRequestProcessorChain.init creating updateRequestProcessorChain "distrib-dup-test-chain-implicit"
   [junit4]   2> 165331 T645 oasup.UpdateRequestProcessorChain.init inserting DistributedUpdateProcessorFactory into updateRequestProcessorChain "distrib-dup-test-chain-implicit"
   [junit4]   2> 165331 T645 oasc.SolrCore.loadUpdateProcessorChains no updateRequestProcessorChain defined as default, creating implicit default
   [junit4]   2> 165331 T645 oasc.RequestHandlers.initHandlersFromConfig adding lazy requestHandler: solr.ReplicationHandler
   [junit4]   2> 165332 T645 oasc.RequestHandlers.initHandlersFromConfig created /replication: solr.ReplicationHandler
   [junit4]   2> 165332 T645 oasc.RequestHandlers.initHandlersFromConfig created standard: solr.StandardRequestHandler
   [junit4]   2> 165333 T645 oasc.RequestHandlers.initHandlersFromConfig created /get: solr.RealTimeGetHandler
   [junit4]   2> 165333 T645 oasc.RequestHandlers.initHandlersFromConfig created dismax: solr.SearchHandler
   [junit4]   2> 165334 T645 oasc.RequestHandlers.initHandlersFromConfig created mock: org.apache.solr.core.MockQuerySenderListenerReqHandler
   [junit4]   2> 165335 T645 oasc.RequestHandlers.initHandlersFromConfig created /admin/: org.apache.solr.handler.admin.AdminHandlers
   [junit4]   2> 165335 T645 oasc.RequestHandlers.initHandlersFromConfig created /admin/file: solr.admin.ShowFileRequestHandler
   [junit4]   2> 165336 T645 oasc.RequestHandlers.initHandlersFromConfig created defaults: solr.StandardRequestHandler
   [junit4]   2> 165336 T645 oasc.RequestHandlers.initHandlersFromConfig adding lazy requestHandler: solr.StandardRequestHandler
   [junit4]   2> 165336 T645 oasc.RequestHandlers.initHandlersFromConfig created lazy: solr.StandardRequestHandler
   [junit4]   2> 165337 T645 oasc.RequestHandlers.initHandlersFromConfig created /update: solr.UpdateRequestHandler
   [junit4]   2> 165338 T645 oasc.RequestHandlers.initHandlersFromConfig created /terms: org.apache.solr.handler.component.SearchHandler
   [junit4]   2> 165338 T645 oasc.RequestHandlers.initHandlersFromConfig created spellCheckCompRH: org.apache.solr.handler.component.SearchHandler
   [junit4]   2> 165339 T645 oasc.RequestHandlers.initHandlersFromConfig created spellCheckCompRH_Direct: org.apache.solr.handler.component.SearchHandler
   [junit4]   2> 165340 T645 oasc.RequestHandlers.initHandlersFromConfig created spellCheckWithWordbreak: org.apache.solr.handler.component.SearchHandler
   [junit4]   2> 165340 T645 oasc.RequestHandlers.initHandlersFromConfig created spellCheckWithWordbreak_Direct: org.apache.solr.handler.component.SearchHandler
   [junit4]   2> 165341 T645 oasc.RequestHandlers.initHandlersFromConfig created spellCheckCompRH1: org.apache.solr.handler.component.SearchHandler
   [junit4]   2> 165341 T645 oasc.RequestHandlers.initHandlersFromConfig created mltrh: org.apache.solr.handler.component.SearchHandler
   [junit4]   2> 165342 T645 oasc.RequestHandlers.initHandlersFromConfig created tvrh: org.apache.solr.handler.component.SearchHandler
   [junit4]   2> 165343 T645 oasc.RequestHandlers.initHandlersFromConfig created /mlt: solr.MoreLikeThisHandler
   [junit4]   2> 165343 T645 oasc.RequestHandlers.initHandlersFromConfig created /debug/dump: solr.DumpRequestHandler
   [junit4]   2> 165344 T645 oashl.XMLLoader.init xsltCacheLifetimeSeconds=60
   [junit4]   2> 165346 T645 oasc.SolrCore.initDeprecatedSupport WARN solrconfig.xml uses deprecated <admin/gettableFiles>, Please update your config to use the ShowFileRequestHandler.
   [junit4]   2> 165348 T645 oasu.CommitTracker.<init> Hard AutoCommit: disabled
   [junit4]   2> 165348 T645 oasu.CommitTracker.<init> Soft AutoCommit: disabled
   [junit4]   2> 165349 T645 oasu.RandomMergePolicy.<init> RandomMergePolicy wrapping class org.apache.lucene.index.LogByteSizeMergePolicy: [LogByteSizeMergePolicy: minMergeSize=1677721, mergeFactor=11, maxMergeSize=2147483648, maxMergeSizeForForcedMerge=9223372036854775807, calibrateSizeByDeletes=false, maxMergeDocs=2147483647, maxCFSSegmentSizeMB=8.796093022207999E12, noCFSRatio=0.2463476056509526]
   [junit4]   2> 165349 T645 oasc.SolrDeletionPolicy.onInit SolrDeletionPolicy.onInit: commits: num=1
   [junit4]   2> 		commit{dir=RateLimitedDirectoryWrapper(MockDirectoryWrapper(org.apache.lucene.store.RAMDirectory@cf830313 lockFactory=org.apache.lucene.store.SingleInstanceLockFactory@51a234ee)),segFN=segments_1,generation=1}
   [junit4]   2> 165350 T645 oasc.SolrDeletionPolicy.updateCommits newest commit generation = 1
   [junit4]   2> 165350 T645 oass.SolrIndexSearcher.<init> Opening Searcher@c367895c main
   [junit4]   2> 165350 T645 oashc.SpellCheckComponent.inform Initializing spell checkers
   [junit4]   2> 165354 T645 oass.DirectSolrSpellChecker.init init: {name=direct,classname=DirectSolrSpellChecker,field=lowerfilt,minQueryLength=3}
   [junit4]   2> 165377 T646 oasc.SolrCore.registerSearcher [collection1] Registered new searcher Searcher@c367895c main{StandardDirectoryReader(segments_1:1:nrt)}
   [junit4]   2> 165394 T645 oasc.CoreContainer.registerCore registering core: collection1
   [junit4]   2> 165395 T644 oas.SolrTestCaseJ4.initCore ####initCore end
   [junit4]   2> 165399 T644 oas.SolrTestCaseJ4.setUp ###Starting testMaxTime
   [junit4]   2> ASYNC  NEW_CORE C446 name=collection1 org.apache.solr.core.SolrCore@a4dc8d20
   [junit4]   2> 165464 T644 C446 oasup.LogUpdateProcessor.finish [collection1] webapp=null path=null params={} {deleteByQuery=*:* (-1453212921179930624)} 0 60
   [junit4]   2> 165467 T644 oasc.CoreContainer.reload Reloading SolrCore 'collection1' using instanceDir: /mnt/ssd/jenkins/workspace/Lucene-Solr-trunk-Linux/solr/build/solr-core/test-files/solr/collection1
   [junit4]   2> 165468 T644 oasc.SolrResourceLoader.<init> new SolrResourceLoader for directory: '/mnt/ssd/jenkins/workspace/Lucene-Solr-trunk-Linux/solr/build/solr-core/test-files/solr/collection1/'
   [junit4]   2> 165468 T644 oasc.SolrResourceLoader.replaceClassLoader Adding 'file:/mnt/ssd/jenkins/workspace/Lucene-Solr-trunk-Linux/solr/build/solr-core/test-files/solr/collection1/lib/classes/' to classloader
   [junit4]   2> 165469 T644 oasc.SolrResourceLoader.replaceClassLoader Adding 'file:/mnt/ssd/jenkins/workspace/Lucene-Solr-trunk-Linux/solr/build/solr-core/test-files/solr/collection1/lib/README' to classloader
   [junit4]   2> 165510 T644 oasc.SolrConfig.<init> Using Lucene MatchVersion: LUCENE_50
   [junit4]   2> 165552 T644 oasc.SolrConfig.<init> Loaded SolrConfig: solrconfig.xml
   [junit4]   2> 165553 T644 oass.IndexSchema.readSchema Reading Solr Schema from schema.xml
   [junit4]   2> 165559 T644 oass.IndexSchema.readSchema [collection1] Schema name=test
   [junit4]   2> 165871 T644 oass.OpenExchangeRatesOrgProvider.init Initialized with rates=open-exchange-rates.json, refreshInterval=1440.
   [junit4]   2> 165876 T644 oass.IndexSchema.readSchema default search field in schema is text
   [junit4]   2> 165879 T644 oass.IndexSchema.readSchema unique key field: id
   [junit4]   2> 165886 T644 oass.FileExchangeRateProvider.reload Reloading exchange rates from file currency.xml
   [junit4]   2> 165890 T644 oass.FileExchangeRateProvider.reload Reloading exchange rates from file currency.xml
   [junit4]   2> 165893 T644 oass.OpenExchangeRatesOrgProvider.reload Reloading exchange rates from open-exchange-rates.json
   [junit4]   2> 165894 T644 oass.OpenExchangeRatesOrgProvider$OpenExchangeRates.<init> WARN Unknown key IMPORTANT NOTE
   [junit4]   2> 165895 T644 oass.OpenExchangeRatesOrgProvider$OpenExchangeRates.<init> WARN Expected key, got STRING
   [junit4]   2> 165895 T644 oass.OpenExchangeRatesOrgProvider.reload Reloading exchange rates from open-exchange-rates.json
   [junit4]   2> 165896 T644 oass.OpenExchangeRatesOrgProvider$OpenExchangeRates.<init> WARN Unknown key IMPORTANT NOTE
   [junit4]   2> 165896 T644 oass.OpenExchangeRatesOrgProvider$OpenExchangeRates.<init> WARN Expected key, got STRING
   [junit4]   2> 165896 T644 oasc.SolrCore.<init> [collection1] Opening new SolrCore at /mnt/ssd/jenkins/workspace/Lucene-Solr-trunk-Linux/solr/build/solr-core/test-files/solr/collection1/, dataDir=/mnt/ssd/jenkins/workspace/Lucene-Solr-trunk-Linux/solr/build/solr-core/test/J0/./solrtest-AutoCommitTest-1385891838233/
   [junit4]   2> 165897 T644 oasc.JmxMonitoredMap.<init> JMX monitoring is enabled. Adding Solr mbeans to JMX Server: com.sun.jmx.mbeanserver.JmxMBeanServer@6024309e
   [junit4]   2> 165898 T644 oasc.SolrCore.getNewIndexDir New index directory detected: old=null new=/mnt/ssd/jenkins/workspace/Lucene-Solr-trunk-Linux/solr/build/solr-core/test/J0/./solrtest-AutoCommitTest-1385891838233/index/
   [junit4]   2> 165898 T644 oasc.SolrCore.initWriters created xml: solr.XMLResponseWriter
   [junit4]   2> 165907 T644 oasup.UpdateRequestProcessorChain.init creating updateRequestProcessorChain "dedupe"
   [junit4]   2> 165907 T644 oasup.UpdateRequestProcessorChain.init inserting DistributedUpdateProcessorFactory into updateRequestProcessorChain "dedupe"
   [junit4]   2> 165908 T644 oasup.UpdateRequestProcessorChain.init creating updateRequestProcessorChain "dedupe-allfields"
   [junit4]   2> 165908 T644 oasup.UpdateRequestProcessorChain.init inserting DistributedUpdateProcessorFactory into updateRequestProcessorChain "dedupe-allfields"
   [junit4]   2> 165909 T644 oasup.UpdateRequestProcessorChain.init creating updateRequestProcessorChain "stored_sig"
   [junit4]   2> 165909 T644 oasup.UpdateRequestProcessorChain.init inserting DistributedUpdateProcessorFactory into updateRequestProcessorChain "stored_sig"
   [junit4]   2> 165910 T644 oasup.UpdateRequestProcessorChain.init creating updateRequestProcessorChain "uniq-fields"
   [junit4]   2> 165910 T644 oasup.UpdateRequestProcessorChain.init inserting DistributedUpdateProcessorFactory into updateRequestProcessorChain "uniq-fields"
   [junit4]   2> 165910 T644 oasup.UpdateRequestProcessorChain.init creating updateRequestProcessorChain "distrib-dup-test-chain-explicit"
   [junit4]   2> 165911 T644 oasup.UpdateRequestProcessorChain.init creating updateRequestProcessorChain "distrib-dup-test-chain-implicit"
   [junit4]   2> 165912 T644 oasup.UpdateRequestProcessorChain.init inserting DistributedUpdateProcessorFactory into updateRequestProcessorChain "distrib-dup-test-chain-implicit"
   [junit4]   2> 165912 T644 oasc.SolrCore.loadUpdateProcessorChains no updateRequestProcessorChain defined as default, creating implicit default
   [junit4]   2> 165912 T644 oasc.RequestHandlers.initHandlersFromConfig adding lazy requestHandler: solr.ReplicationHandler
   [junit4]   2> 165913 T644 oasc.RequestHandlers.initHandlersFromConfig created /replication: solr.ReplicationHandler
   [junit4]   2> 165914 T644 oasc.RequestHandlers.initHandlersFromConfig created standard: solr.StandardRequestHandler
   [junit4]   2> 165915 T644 oasc.RequestHandlers.initHandlersFromConfig created /get: solr.RealTimeGetHandler
   [junit4]   2> 165916 T644 oasc.RequestHandlers.initHandlersFromConfig created dismax: solr.SearchHandler
   [junit4]   2> 165917 T644 oasc.RequestHandlers.initHandlersFromConfig created mock: org.apache.solr.core.MockQuerySenderListenerReqHandler
   [junit4]   2> 165917 T644 oasc.RequestHandlers.initHandlersFromConfig created /admin/: org.apache.solr.handler.admin.AdminHandlers
   [junit4]   2> 165918 T644 oasc.RequestHandlers.initHandlersFromConfig created /admin/file: solr.admin.ShowFileRequestHandler
   [junit4]   2> 165919 T644 oasc.RequestHandlers.initHandlersFromConfig created defaults: solr.StandardRequestHandler
   [junit4]   2> 165920 T644 oasc.RequestHandlers.initHandlersFromConfig adding lazy requestHandler: solr.StandardRequestHandler
   [junit4]   2> 165920 T644 oasc.RequestHandlers.initHandlersFromConfig created lazy: solr.StandardRequestHandler
   [junit4]   2> 165921 T644 oasc.RequestHandlers.initHandlersFromConfig created /update: solr.UpdateRequestHandler
   [junit4]   2> 165922 T644 oasc.RequestHandlers.initHandlersFromConfig created /terms: org.apache.solr.handler.component.SearchHandler
   [junit4]   2> 165923 T644 oasc.RequestHandlers.initHandlersFromConfig created spellCheckCompRH: org.apache.solr.handler.component.SearchHandler
   [junit4]   2> 165924 T644 oasc.RequestHandlers.initHandlersFromConfig created spellCheckCompRH_Direct: org.apache.solr.handler.component.SearchHandler
   [junit4]   2> 165925 T644 oasc.RequestHandlers.initHandlersFromConfig created spellCheckWithWordbreak: org.apache.solr.handler.component.SearchHandler
   [junit4]   2> 165926 T644 oasc.RequestHandlers.initHandlersFromConfig created spellCheckWithWordbreak_Direct: org.apache.solr.handler.component.SearchHandler
   [junit4]   2> 165927 T644 oasc.RequestHandlers.initHandlersFromConfig created spellCheckCompRH1: org.apache.solr.handler.component.SearchHandler
   [junit4]   2> 165928 T644 oasc.RequestHandlers.initHandlersFromConfig created mltrh: org.apache.solr.handler.component.SearchHandler
   [junit4]   2> 165929 T644 oasc.RequestHandlers.initHandlersFromConfig created tvrh: org.apache.solr.handler.component.SearchHandler
   [junit4]   2> 165929 T644 oasc.RequestHandlers.initHandlersFromConfig created /mlt: solr.MoreLikeThisHandler
   [junit4]   2> 165930 T644 oasc.RequestHandlers.initHandlersFromConfig created /debug/dump: solr.DumpRequestHandler
   [junit4]   2> 165932 T644 oashl.XMLLoader.init xsltCacheLifetimeSeconds=60
   [junit4]   2> 165933 T644 oasc.SolrCore.initDeprecatedSupport WARN solrconfig.xml uses deprecated <admin/gettableFiles>, Please update your config to use the ShowFileRequestHandler.
   [junit4]   2> 165935 T644 oasu.CommitTracker.<init> Hard AutoCommit: disabled
   [junit4]   2> 165935 T644 oasu.CommitTracker.<init> Soft AutoCommit: disabled
   [junit4]   2> 165936 T644 oass.SolrIndexSearcher.<init> Opening Searcher@d5df1bf9 main
   [junit4]   2> 165937 T644 oashc.SpellCheckComponent.inform Initializing spell checkers
   [junit4]   2> 165938 T644 oass.DirectSolrSpellChecker.init init: {name=direct,classname=DirectSolrSpellChecker,field=lowerfilt,minQueryLength=3}
   [junit4]   2> 165951 T648 oasc.SolrCore.registerSearcher [collection1] Registered new searcher Searcher@d5df1bf9 main{StandardDirectoryReader(segments_1:1:nrt)}
   [junit4]   2> 165965 T644 oasu.DefaultSolrCoreState.newIndexWriter Creating new IndexWriter...
   [junit4]   2> 165966 T644 oasu.DefaultSolrCoreState.newIndexWriter Waiting until IndexWriter is unused... core=collection1
   [junit4]   2> 165967 T644 oasu.DefaultSolrCoreState.newIndexWriter Closing old IndexWriter... core=collection1
   [junit4]   2> 165968 T644 oasu.RandomMergePolicy.<init> RandomMergePolicy wrapping class org.apache.lucene.index.TieredMergePolicy: [TieredMergePolicy: maxMergeAtOnce=7, maxMergeAtOnceExplicit=4, maxMergedSegmentMB=77.2294921875, floorSegmentMB=1.970703125, forceMergeDeletesPctAllowed=6.624161665915418, segmentsPerTier=38.0, maxCFSSegmentSizeMB=8.796093022207999E12, noCFSRatio=0.5217096931791851
   [junit4]   2> 165969 T644 oasc.SolrDeletionPolicy.onInit SolrDeletionPolicy.onInit: commits: num=1
   [junit4]   2> 		commit{dir=RateLimitedDirectoryWrapper(MockDirectoryWrapper(org.apache.lucene.store.RAMDirectory@cf830313 lockFactory=org.apache.lucene.store.SingleInstanceLockFactory@51a234ee)),segFN=segments_1,generation=1}
   [junit4]   2> 165969 T644 oasc.SolrDeletionPolicy.updateCommits newest commit generation = 1
   [junit4]   2> 165970 T644 oasu.DefaultSolrCoreState.newIndexWriter New IndexWriter is ready to be used.
   [junit4]   2> 165971 T644 oass.SolrIndexSearcher.<init> Opening Searcher@158c46cc main
   [junit4]   2> 165971 T644 oasc.CoreContainer.registerCore replacing core: collection1
   [junit4]   2> 165972 T644 oasc.SolrCore.close [collection1]  CLOSING SolrCore org.apache.solr.core.SolrCore@a4dc8d20
   [junit4]   2> 165975 T648 oasc.SolrCore.registerSearcher [collection1] Registered new searcher Searcher@158c46cc main{StandardDirectoryReader(segments_1:1:nrt)}
   [junit4]   2> 165989 T644 oasu.DirectUpdateHandler2.close closing DirectUpdateHandler2{commits=0,autocommits=0,soft autocommits=0,optimizes=0,rollbacks=0,expungeDeletes=0,docsPending=0,adds=0,deletesById=0,deletesByQuery=1,errors=0,cumulative_adds=0,cumulative_deletesById=0,cumulative_deletesByQuery=1,cumulative_errors=0,transaction_logs_total_size=0,transaction_logs_total_number=0}
   [junit4]   2> 165989 T644 oasc.SolrCore.closeSearcher [collection1] Closing main searcher on request.
   [junit4]   2> 166422 T644 oasup.LogUpdateProcessor.finish [collection1] {add=[529 (1453212922246332416)]} 0 430
   [junit4]   2> 167422 T649 oasu.DirectUpdateHandler2.commit start commit{,optimize=false,openSearcher=true,waitSearcher=true,expungeDeletes=false,softCommit=true,prepareCommit=false}
   [junit4]   2> 167429 T649 oass.SolrIndexSearcher.<init> Opening Searcher@90fc990f main
   [junit4]   2> 167431 T649 oasu.DirectUpdateHandler2.commit end_commit_flush
   [junit4]   2> 167434 T648 oasc.SolrCore.registerSearcher [collection1] Registered new searcher Searcher@90fc990f main{StandardDirectoryReader(segments_1:3:nrt _0(5.0):C1)}
   [junit4]   2> ASYNC  NEW_CORE C447 name=collection1 org.apache.solr.core.SolrCore@a49ef4e5
   [junit4]   2> 168738 T644 C447 oasc.SolrCore.execute [collection1] webapp=null path=null params={version=2.2&q=id:529&start=0&rows=20&qt=standard} hits=1 status=0 QTime=2316 
   [junit4]   2> 168757 T644 oas.SolrTestCaseJ4.assertQ ERROR REQUEST FAILED: xpath=//result[@numFound=0]
   [junit4]   2> 		xml response was: <?xml version="1.0" encoding="UTF-8"?>
   [junit4]   2> 	<response>
   [junit4]   2> 	<lst name="responseHeader"><int name="status">0</int><int name="QTime">2316</int></lst><result name="response" numFound="1" start="0"><doc><int name="id">529</int><int name="range_facet_si">529</int><arr name="range_facet_l"><long>529</long></arr><arr name="range_facet_sl"><long>529</long></arr><arr name="field_t"><str>what's inside?</str></arr><arr name="subject"><str>info</str></arr><long name="_version_">1453212922246332416</long><int name="intDefault">42</int><date name="timestamp">2013-12-01T09:57:20.216Z</date><arr name="multiDefault"><str>muLti-Default</str></arr></doc></result>
   [junit4]   2> 	</response>
   [junit4]   2> 	
   [junit4]   2> 		request was:version=2.2&q=id:529&start=0&rows=20&qt=standard
   [junit4]   2> 168758 T644 oasc.SolrException.log ERROR REQUEST FAILED: version=2.2&q=id:529&start=0&rows=20&qt=standard:java.lang.RuntimeException: REQUEST FAILED: xpath=//result[@numFound=0]
   [junit4]   2> 		xml response was: <?xml version="1.0" encoding="UTF-8"?>
   [junit4]   2> 	<response>
   [junit4]   2> 	<lst name="responseHeader"><int name="status">0</int><int name="QTime">2316</int></lst><result name="response" numFound="1" start="0"><doc><int name="id">529</int><int name="range_facet_si">529</int><arr name="range_facet_l"><long>529</long></arr><arr name="range_facet_sl"><long>529</long></arr><arr name="field_t"><str>what's inside?</str></arr><arr name="subject"><str>info</str></arr><long name="_version_">1453212922246332416</long><int name="intDefault">42</int><date name="timestamp">2013-12-01T09:57:20.216Z</date><arr name="multiDefault"><str>muLti-Default</str></arr></doc></result>
   [junit4]   2> 	</response>
   [junit4]   2> 	
   [junit4]   2> 		request was:version=2.2&q=id:529&start=0&rows=20&qt=standard
   [junit4]   2> 		at org.apache.solr.SolrTestCaseJ4.assertQ(SolrTestCaseJ4.java:634)
   [junit4]   2> 		at org.apache.solr.update.AutoCommitTest.testMaxTime(AutoCommitTest.java:227)
   [junit4]   2> 		at sun.reflect.NativeMethodAccessorImpl.invoke0(Native Method)
   [junit4]   2> 		at sun.reflect.NativeMethodAccessorImpl.invoke(NativeMethodAccessorImpl.java:88)
   [junit4]   2> 		at sun.reflect.DelegatingMethodAccessorImpl.invoke(DelegatingMethodAccessorImpl.java:55)
   [junit4]   2> 		at java.lang.reflect.Method.invoke(Method.java:613)
   [junit4]   2> 		at com.carrotsearch.randomizedtesting.RandomizedRunner.invoke(RandomizedRunner.java:1559)
   [junit4]   2> 		at com.carrotsearch.randomizedtesting.RandomizedRunner.access$600(RandomizedRunner.java:79)
   [junit4]   2> 		at com.carrotsearch.randomizedtesting.RandomizedRunner$6.evaluate(RandomizedRunner.java:737)
   [junit4]   2> 		at com.carrotsearch.randomizedtesting.RandomizedRunner$7.evaluate(RandomizedRunner.java:773)
   [junit4]   2> 		at com.carrotsearch.randomizedtesting.RandomizedRunner$8.evaluate(RandomizedRunner.java:787)
   [junit4]   2> 		at com.carrotsearch.randomizedtesting.rules.SystemPropertiesRestoreRule$1.evaluate(SystemPropertiesRestoreRule.java:53)
   [junit4]   2> 		at org.apache.lucene.util.TestRuleSetupTeardownChained$1.evaluate(TestRuleSetupTeardownChained.java:50)
   [junit4]   2> 		at org.apache.lucene.util.TestRuleFieldCacheSanity$1.evaluate(TestRuleFieldCacheSanity.java:51)
   [junit4]   2> 		at org.apache.lucene.util.AbstractBeforeAfterRule$1.evaluate(AbstractBeforeAfterRule.java:46)
   [junit4]   2> 		at com.carrotsearch.randomizedtesting.rules.SystemPropertiesInvariantRule$1.evaluate(SystemPropertiesInvariantRule.java:55)
   [junit4]   2> 		at org.apache.lucene.util.TestRuleThreadAndTestName$1.evaluate(TestRuleThreadAndTestName.java:49)
   [junit4]   2> 		at org.apache.lucene.util.TestRuleIgnoreAfterMaxFailures$1.evaluate(TestRuleIgnoreAfterMaxFailures.java:70)
   [junit4]   2> 		at org.apache.lucene.util.TestRuleMarkFailure$1.evaluate(TestRuleMarkFailure.java:48)
   [junit4]   2> 		at com.carrotsearch.randomizedtesting.rules.StatementAdapter.evaluate(StatementAdapter.java:36)
   [junit4]   2> 		at com.carrotsearch.randomizedtesting.ThreadLeakControl$StatementRunner.run(ThreadLeakControl.java:358)
   [junit4]   2> 		at com.carrotsearch.randomizedtesting.ThreadLeakControl.forkTimeoutingTask(ThreadLeakControl.java:782)
   [junit4]   2> 		at com.carrotsearch.randomizedtesting.ThreadLeakControl$3.evaluate(ThreadLeakControl.java:442)
   [junit4]   2> 		at com.carrotsearch.randomizedtesting.RandomizedRunner.runSingleTest(RandomizedRunner.java:746)
   [junit4]   2> 		at com.carrotsearch.randomizedtesting.RandomizedRunner$3.evaluate(RandomizedRunner.java:648)
   [junit4]   2> 		at com.carrotsearch.randomizedtesting.RandomizedRunner$4.evaluate(RandomizedRunner.java:682)
   [junit4]   2> 		at com.carrotsearch.randomizedtesting.RandomizedRunner$5.evaluate(RandomizedRunner.java:693)
   [junit4]   2> 		at com.carrotsearch.randomizedtesting.rules.StatementAdapter.evaluate(StatementAdapter.java:36)
   [junit4]   2> 		at com.carrotsearch.randomizedtesting.rules.SystemPropertiesRestoreRule$1.evaluate(SystemPropertiesRestoreRule.java:53)
   [junit4]   2> 		at org.apache.lucene.util.AbstractBeforeAfterRule$1.evaluate(AbstractBeforeAfterRule.java:46)
   [junit4]   2> 		at org.apache.lucene.util.TestRuleStoreClassName$1.evaluate(TestRuleStoreClassName.java:42)
   [junit4]   2> 		at com.carrotsearch.randomizedtesting.rules.SystemPropertiesInvariantRule$1.evaluate(SystemPropertiesInvariantRule.java:55)
   [junit4]   2> 		at com.carrotsearch.randomizedtesting.rules.NoShadowingOrOverridesOnMethodsRule$1.evaluate(NoShadowingOrOverridesOnMethodsRule.java:39)
   [junit4]   2> 		at com.carrotsearch.randomizedtesting.rules.NoShadowingOrOverridesOnMethodsRule$1.evaluate(NoShadowingOrOverridesOnMethodsRule.java:39)
   [junit4]   2> 		at com.carrotsearch.randomizedtesting.rules.StatementAdapter.evaluate(StatementAdapter.java:36)
   [junit4]   2> 		at org.apache.lucene.util.TestRuleAssertionsRequired$1.evaluate(TestRuleAssertionsRequired.java:43)
   [junit4]   2> 		at org.apache.lucene.util.TestRuleMarkFailure$1.evaluate(TestRuleMarkFailure.java:48)
   [junit4]   2> 		at org.apache.lucene.util.TestRuleIgnoreAfterMaxFailures$1.evaluate(TestRuleIgnoreAfterMaxFailures.java:70)
   [junit4]   2> 		at org.apache.lucene.util.TestRuleIgnoreTestSuites$1.evaluate(TestRuleIgnoreTestSuites.java:55)
   [junit4]   2> 		at com.carrotsearch.randomizedtesting.rules.StatementAdapter.evaluate(StatementAdapter.java:36)
   [junit4]   2> 		at com.carrotsearch.randomizedtesting.ThreadLeakControl$StatementRunner.run(ThreadLeakControl.java:358)
   [junit4]   2> 		at java.lang.Thread.run(Thread.java:780)
   [junit4]   2> 	
   [junit4]   2> 168759 T644 oas.SolrTestCaseJ4.tearDown ###Ending testMaxTime
   [junit4]   2> NOTE: reproduce with: ant test  -Dtestcase=AutoCommitTest -Dtests.method=testMaxTime -Dtests.seed=C3682787BC26C23C -Dtests.multiplier=3 -Dtests.slow=true -Dtests.locale=en_ZA -Dtests.timezone=Australia/Tasmania -Dtests.file.encoding=ISO-8859-1
   [junit4] ERROR   3.37s J0 | AutoCommitTest.testMaxTime <<<
   [junit4]    > Throwable #1: java.lang.RuntimeException: Exception during query
   [junit4]    > 	at __randomizedtesting.SeedInfo.seed([C3682787BC26C23C:599C5A6522BC5E00]:0)
   [junit4]    > 	at org.apache.solr.SolrTestCaseJ4.assertQ(SolrTestCaseJ4.java:641)
   [junit4]    > 	at org.apache.solr.update.AutoCommitTest.testMaxTime(AutoCommitTest.java:227)
   [junit4]    > 	at java.lang.Thread.run(Thread.java:780)
   [junit4]    > Caused by: java.lang.RuntimeException: REQUEST FAILED: xpath=//result[@numFound=0]
   [junit4]    > 	xml response was: <?xml version="1.0" encoding="UTF-8"?>
   [junit4]    > <response>
   [junit4]    > <lst name="responseHeader"><int name="status">0</int><int name="QTime">2316</int></lst><result name="response" numFound="1" start="0"><doc><int name="id">529</int><int name="range_facet_si">529</int><arr name="range_facet_l"><long>529</long></arr><arr name="range_facet_sl"><long>529</long></arr><arr name="field_t"><str>what's inside?</str></arr><arr name="subject"><str>info</str></arr><long name="_version_">1453212922246332416</long><int name="intDefault">42</int><date name="timestamp">2013-12-01T09:57:20.216Z</date><arr name="multiDefault"><str>muLti-Default</str></arr></doc></result>
   [junit4]    > </response>
   [junit4]    > 	request was:version=2.2&q=id:529&start=0&rows=20&qt=standard
   [junit4]    > 	at org.apache.solr.SolrTestCaseJ4.assertQ(SolrTestCaseJ4.java:634)
   [junit4]    > 	... 41 more
   [junit4]   2> 168770 T644 oas.SolrTestCaseJ4.setUp ###Starting testCommitWithin
   [junit4]   2> 168823 T644 C447 oass.SolrIndexSearcher.<init> Opening Searcher@a1ec7cb4 realtime
   [junit4]   2> 168824 T644 C447 oasup.LogUpdateProcessor.finish [collection1] webapp=null path=null params={} {deleteByQuery=*:* (-1453212924746137600)} 0 48
   [junit4]   2> 168841 T644 oasc.CoreContainer.reload Reloading SolrCore 'collection1' using instanceDir: /mnt/ssd/jenkins/workspace/Lucene-Solr-trunk-Linux/solr/build/solr-core/test-files/solr/collection1
   [junit4]   2> 168842 T644 oasc.SolrResourceLoader.<init> new SolrResourceLoader for directory: '/mnt/ssd/jenkins/workspace/Lucene-Solr-trunk-Linux/solr/build/solr-core/test-files/solr/collection1/'
   [junit4]   2> 168843 T644 oasc.SolrResourceLoader.replaceClassLoader Adding 'file:/mnt/ssd/jenkins/workspace/Lucene-Solr-trunk-Linux/solr/build/solr-core/test-files/solr/collection1/lib/classes/' to classloader
   [junit4]   2> 168843 T644 oasc.SolrResourceLoader.replaceClassLoader Adding 'file:/mnt/ssd/jenkins/workspace/Lucene-Solr-trunk-Linux/solr/build/solr-core/test-files/solr/collection1/lib/README' to classloader
   [junit4]   2> 168880 T644 oasc.SolrConfig.<init> Using Lucene MatchVersion: LUCENE_50
   [junit4]   2> 168937 T644 oasc.SolrConfig.<init> Loaded SolrConfig: solrconfig.xml
   [junit4]   2> 168938 T644 oass.IndexSchema.readSchema Reading Solr Schema from schema.xml
   [junit4]   2> 168944 T644 oass.IndexSchema.readSchema [collection1] Schema name=test
   [junit4]   2> 169253 T644 oass.OpenExchangeRatesOrgProvider.init Initialized with rates=open-exchange-rates.json, refreshInterval=1440.
   [junit4]   2> 169258 T644 oass.IndexSchema.readSchema default search field in schema is text
   [junit4]   2> 169261 T644 oass.IndexSchema.readSchema unique key field: id
   [junit4]   2> 169268 T644 oass.FileExchangeRateProvider.reload Reloading exchange rates from file currency.xml
   [junit4]   2> 169272 T644 oass.FileExchangeRateProvider.reload Reloading exchange rates from file currency.xml
   [junit4]   2> 169276 T644 oass.OpenExchangeRatesOrgProvider.reload Reloading exchange rates from open-exchange-rates.json
   [junit4]   2> 169277 T644 oass.OpenExchangeRatesOrgProvider$OpenExchangeRates.<init> WARN Unknown key IMPORTANT NOTE
   [junit4]   2> 169277 T644 oass.OpenExchangeRatesOrgProvider$OpenExchangeRates.<init> WARN Expected key, got STRING
   [junit4]   2> 169278 T644 oass.OpenExchangeRatesOrgProvider.reload Reloading exchange rates from open-exchange-rates.json
   [junit4]   2> 169278 T644 oass.OpenExchangeRatesOrgProvider$OpenExchangeRates.<init> WARN Unknown key IMPORTANT NOTE
   [junit4]   2> 169279 T644 oass.OpenExchangeRatesOrgProvider$OpenExchangeRates.<init> WARN Expected key, got STRING
   [junit4]   2> 169279 T644 oasc.SolrCore.<init> [collection1] Opening new SolrCore at /mnt/ssd/jenkins/workspace/Lucene-Solr-trunk-Linux/solr/build/solr-core/test-files/solr/collection1/, dataDir=/mnt/ssd/jenkins/workspace/Lucene-Solr-trunk-Linux/solr/build/solr-core/test/J0/./solrtest-AutoCommitTest-1385891838233/
   [junit4]   2> 169280 T644 oasc.JmxMonitoredMap.<init> JMX monitoring is enabled. Adding Solr mbeans to JMX Server: com.sun.jmx.mbeanserver.JmxMBeanServer@6024309e
   [junit4]   2> 169281 T644 oasc.SolrCore.getNewIndexDir New index directory detected: old=null new=/mnt/ssd/jenkins/workspace/Lucene-Solr-trunk-Linux/solr/build/solr-core/test/J0/./solrtest-AutoCommitTest-1385891838233/index/
   [junit4]   2> 169281 T644 oasc.SolrCore.initWriters created xml: solr.XMLResponseWriter
   [junit4]   2> 169290 T644 oasup.UpdateRequestProcessorChain.init creating updateRequestProcessorChain "dedupe"
   [junit4]   2> 169290 T644 oasup.UpdateRequestProcessorChain.init inserting DistributedUpdateProcessorFactory into updateRequestProcessorChain "dedupe"
   [junit4]   2> 169291 T644 oasup.UpdateRequestProcessorChain.init creating updateRequestProcessorChain "dedupe-allfields"
   [junit4]   2> 169291 T644 oasup.UpdateRequestProcessorChain.init inserting DistributedUpdateProcessorFactory into updateRequestProcessorChain "dedupe-allfields"
   [junit4]   2> 169292 T644 oasup.UpdateRequestProcessorChain.init creating updateRequestProcessorChain "stored_sig"
   [junit4]   2> 169292 T644 oasup.UpdateRequestProcessorChain.init inserting DistributedUpdateProcessorFactory into updateRequestProcessorChain "stored_sig"
   [junit4]   2> 169292 T644 oasup.UpdateRequestProcessorChain.init creating updateRequestProcessorChain "uniq-fields"
   [junit4]   2> 169293 T644 oasup.UpdateRequestProcessorChain.init inserting DistributedUpdateProcessorFactory into updateRequestProcessorChain "uniq-fields"
   [junit4]   2> 169293 T644 oasup.UpdateRequestProcessorChain.init creating updateRequestProcessorChain "distrib-dup-test-chain-explicit"
   [junit4]   2> 169294 T644 oasup.UpdateRequestProcessorChain.init creating updateRequestProcessorChain "distrib-dup-test-chain-implicit"
   [junit4]   2> 169295 T644 oasup.UpdateRequestProcessorChain.init inserting DistributedUpdateProcessorFactory into updateRequestProcessorChain "distrib-dup-test-chain-implicit"
   [junit4]   2> 169295 T644 oasc.SolrCore.loadUpdateProcessorChains no updateRequestProcessorChain defined as default, creating implicit default
   [junit4]   2> 169295 T644 oasc.RequestHandlers.initHandlersFromConfig adding lazy requestHandler: solr.ReplicationHandler
   [junit4]   2> 169296 T644 oasc.RequestHandlers.initHandlersFromConfig created /replication: solr.ReplicationHandler
   [junit4]   2> 169297 T644 oasc.RequestHandlers.initHandlersFromConfig created standard: solr.StandardRequestHandler
   [junit4]   2> 169298 T644 oasc.RequestHandlers.initHandlersFromConfig created /get: solr.RealTimeGetHandler
   [junit4]   2> 169299 T644 oasc.RequestHandlers.initHandlersFromConfig created dismax: solr.SearchHandler
   [junit4]   2> 169300 T644 oasc.RequestHandlers.initHandlersFromConfig created mock: org.apache.solr.core.MockQuerySenderListenerReqHandler
   [junit4]   2> 169300 T644 oasc.RequestHandlers.initHandlersFromConfig created /admin/: org.apache.solr.handler.admin.AdminHandlers
   [junit4]   2> 169301 T644 oasc.RequestHandlers.initHandlersFromConfig created /admin/file: solr.admin.ShowFileRequestHandler
   [junit4]   2> 169302 T644 oasc.RequestHandlers.initHandlersFromConfig created defaults: solr.StandardRequestHandler
   [junit4]   2> 169302 T644 oasc.RequestHandlers.initHandlersFromConfig adding lazy requestHandler: solr.StandardRequestHandler
   [junit4]   2> 169303 T644 oasc.RequestHandlers.initHandlersFromConfig created lazy: solr.StandardRequestHandler
   [junit4]   2> 169304 T644 oasc.RequestHandlers.initHandlersFromConfig created /update: solr.UpdateRequestHandler
   [junit4]   2> 169305 T644 oasc.RequestHandlers.initHandlersFromConfig created /terms: org.apache.solr.handler.component.SearchHandler
   [junit4]   2> 169306 T644 oasc.RequestHandlers.initHandlersFromConfig created spellCheckCompRH: org.apache.solr.handler.component.SearchHandler
   [junit4]   2> 169307 T644 oasc.RequestHandlers.initHandlersFromConfig created spellCheckCompRH_Direct: org.apache.solr.handler.component.SearchHandler
   [junit4]   2> 1693

[...truncated too long message...]

tore.SingleInstanceLockFactory@be5655b6)),segFN=segments_x,generation=33}
   [junit4]   2> 		commit{dir=RateLimitedDirectoryWrapper(MockDirectoryWrapper(org.apache.lucene.store.RAMDirectory@bf0844a9 lockFactory=org.apache.lucene.store.SingleInstanceLockFactory@be5655b6)),segFN=segments_y,generation=34}
   [junit4]   2> 590216 T2791 oasc.SolrDeletionPolicy.updateCommits newest commit generation = 34
   [junit4]   2> 590217 T2791 oass.SolrIndexSearcher.<init> Opening Searcher@91801373 main
   [junit4]   2> 590217 T2791 oasu.DirectUpdateHandler2.commit end_commit_flush
   [junit4]   2> 590219 T2793 oasc.SolrCore.registerSearcher [collection1] Registered new searcher Searcher@91801373 main{StandardDirectoryReader(segments_y:152:nrt _18(5.0):C2)}
   [junit4]   2> 590221 T2791 oasu.DirectUpdateHandler2.commit start commit{,optimize=false,openSearcher=true,waitSearcher=true,expungeDeletes=false,softCommit=false,prepareCommit=false}
   [junit4]   2> 590274 T2791 oasc.SolrDeletionPolicy.onCommit SolrDeletionPolicy.onCommit: commits: num=2
   [junit4]   2> 		commit{dir=RateLimitedDirectoryWrapper(MockDirectoryWrapper(org.apache.lucene.store.RAMDirectory@bf0844a9 lockFactory=org.apache.lucene.store.SingleInstanceLockFactory@be5655b6)),segFN=segments_y,generation=34}
   [junit4]   2> 		commit{dir=RateLimitedDirectoryWrapper(MockDirectoryWrapper(org.apache.lucene.store.RAMDirectory@bf0844a9 lockFactory=org.apache.lucene.store.SingleInstanceLockFactory@be5655b6)),segFN=segments_z,generation=35}
   [junit4]   2> 590274 T2791 oasc.SolrDeletionPolicy.updateCommits newest commit generation = 35
   [junit4]   2> 590275 T2791 oass.SolrIndexSearcher.<init> Opening Searcher@8bc31726 main
   [junit4]   2> 590276 T2791 oasu.DirectUpdateHandler2.commit end_commit_flush
   [junit4]   2> 590277 T2793 oasc.SolrCore.registerSearcher [collection1] Registered new searcher Searcher@8bc31726 main{StandardDirectoryReader(segments_z:155:nrt _18(5.0):C2/1:delGen=1 _19(5.0):C1)}
   [junit4]   2> 590279 T2791 oas.SolrTestCaseJ4.tearDown ###Ending testDupeDetection
   [junit4]   2> NOTE: reproduce with: ant test  -Dtestcase=SignatureUpdateProcessorFactoryTest -Dtests.method=testDupeDetection -Dtests.seed=C3682787BC26C23C -Dtests.multiplier=3 -Dtests.slow=true -Dtests.locale=pt_PT_PREEURO -Dtests.timezone=Asia/Kamchatka -Dtests.file.encoding=ISO-8859-1
   [junit4] FAILURE 0.09s J0 | SignatureUpdateProcessorFactoryTest.testDupeDetection <<<
   [junit4]    > Throwable #1: java.lang.AssertionError: expected:<1> but was:<2>
   [junit4]    > 	at __randomizedtesting.SeedInfo.seed([C3682787BC26C23C:9858DC4FBF616140]:0)
   [junit4]    > 	at org.apache.solr.update.processor.SignatureUpdateProcessorFactoryTest.checkNumDocs(SignatureUpdateProcessorFactoryTest.java:71)
   [junit4]    > 	at org.apache.solr.update.processor.SignatureUpdateProcessorFactoryTest.testDupeDetection(SignatureUpdateProcessorFactoryTest.java:119)
   [junit4]    > 	at java.lang.Thread.run(Thread.java:780)
   [junit4]   2> 590285 T2791 oas.SolrTestCaseJ4.deleteCore ###deleteCore
   [junit4]   2> 590285 T2791 oasc.CoreContainer.shutdown Shutting down CoreContainer instance=-13804215
   [junit4]   2> 590286 T2791 oasc.SolrCore.close [collection1]  CLOSING SolrCore org.apache.solr.core.SolrCore@38f99804
   [junit4]   2> 590296 T2791 oasu.DirectUpdateHandler2.close closing DirectUpdateHandler2{commits=42,autocommits=0,soft autocommits=0,optimizes=0,rollbacks=0,expungeDeletes=0,docsPending=0,adds=0,deletesById=0,deletesByQuery=0,errors=0,cumulative_adds=253,cumulative_deletesById=0,cumulative_deletesByQuery=6,cumulative_errors=0}
   [junit4]   2> 590296 T2791 oasu.SolrCoreState.decrefSolrCoreState Closing SolrCoreState
   [junit4]   2> 590296 T2791 oasu.DefaultSolrCoreState.closeIndexWriter SolrCoreState ref count has reached 0 - closing IndexWriter
   [junit4]   2> 590297 T2791 oasu.DefaultSolrCoreState.closeIndexWriter closing IndexWriter with IndexWriterCloser
   [junit4]   2> 590297 T2791 oasc.SolrCore.closeSearcher [collection1] Closing main searcher on request.
   [junit4]   2> 590298 T2791 oasc.CachingDirectoryFactory.close Closing MockDirectoryFactory - 2 directories currently being tracked
   [junit4]   2> 590298 T2791 oasc.CachingDirectoryFactory.closeCacheValue looking to close /mnt/ssd/jenkins/workspace/Lucene-Solr-trunk-Linux/solr/build/solr-core/test/J0/./solrtest-SignatureUpdateProcessorFactoryTest-1385892262529 [CachedDir<<refCount=0;path=/mnt/ssd/jenkins/workspace/Lucene-Solr-trunk-Linux/solr/build/solr-core/test/J0/./solrtest-SignatureUpdateProcessorFactoryTest-1385892262529;done=false>>]
   [junit4]   2> 590298 T2791 oasc.CachingDirectoryFactory.close Closing directory: /mnt/ssd/jenkins/workspace/Lucene-Solr-trunk-Linux/solr/build/solr-core/test/J0/./solrtest-SignatureUpdateProcessorFactoryTest-1385892262529
   [junit4]   2> 590299 T2791 oasc.CachingDirectoryFactory.closeCacheValue looking to close /mnt/ssd/jenkins/workspace/Lucene-Solr-trunk-Linux/solr/build/solr-core/test/J0/./solrtest-SignatureUpdateProcessorFactoryTest-1385892262529/index [CachedDir<<refCount=0;path=/mnt/ssd/jenkins/workspace/Lucene-Solr-trunk-Linux/solr/build/solr-core/test/J0/./solrtest-SignatureUpdateProcessorFactoryTest-1385892262529/index;done=false>>]
   [junit4]   2> 590299 T2791 oasc.CachingDirectoryFactory.close Closing directory: /mnt/ssd/jenkins/workspace/Lucene-Solr-trunk-Linux/solr/build/solr-core/test/J0/./solrtest-SignatureUpdateProcessorFactoryTest-1385892262529/index
   [junit4]   2> NOTE: test params are: codec=Lucene45, sim=RandomSimilarityProvider(queryNorm=true,coord=crazy): {}, locale=pt_PT_PREEURO, timezone=Asia/Kamchatka
   [junit4]   2> NOTE: Linux 3.8.0-33-generic amd64/IBM Corporation 1.7.0 (64-bit)/cpus=8,threads=1,free=90946608,total=288882688
   [junit4]   2> NOTE: All tests run in this JVM: [SearchHandlerTest, TestLMDirichletSimilarityFactory, MBeansHandlerTest, DeleteShardTest, TestSolrIndexConfig, TestQueryUtils, TestClassNameShortening, ResponseLogComponentTest, EchoParamsTest, TestExtendedDismaxParser, MoreLikeThisHandlerTest, TestCharFilters, TestMergePolicyConfig, DeleteInactiveReplicaTest, DistributedSpellCheckComponentTest, CacheHeaderTest, TestSolrDeletionPolicy1, RecoveryZkTest, TestWriterPerf, QueryParsingTest, ShowFileRequestHandlerTest, TestCollapseQParserPlugin, ClusterStateTest, TestAddFieldRealTimeGet, SliceStateTest, TermVectorComponentTest, TestRandomDVFaceting, SoftAutoCommitTest, SampleTest, URLClassifyProcessorTest, DateMathParserTest, TestMaxScoreQueryParser, CircularListTest, TestBM25SimilarityFactory, BasicDistributedZkTest, TestSolrXMLSerializer, TestRemoteStreaming, DocValuesTest, TestLFUCache, TestCoreContainer, TestCopyFieldCollectionResource, BinaryUpdateRequestHandlerTest, FastVectorHighlighterTest, CSVRequestHandlerTest, ZkControllerTest, SuggesterTest, TestSurroundQueryParser, OverseerCollectionProcessorTest, LeaderElectionTest, AutoCommitTest, TestLuceneMatchVersion, TestReplicationHandler, SpatialFilterTest, QueryResultKeyTest, WordBreakSolrSpellCheckerTest, AddBlockUpdateTest, TestLMJelinekMercerSimilarityFactory, TestDefaultSearchFieldResource, DistributedQueryElevationComponentTest, BlockDirectoryTest, StressHdfsTest, TestPostingsSolrHighlighter, InfoHandlerTest, CoreAdminHandlerTest, DocumentBuilderTest, TestNRTOpen, UnloadDistributedZkTest, TestNonNRTOpen, SystemInfoHandlerTest, TestStressUserVersions, FieldMutatingUpdateProcessorTest, DistributedDebugComponentTest, ExpressionTest, ClusterStateUpdateTest, ShardRoutingTest, TestJmxMonitoredMap, SchemaVersionSpecificBehaviorTest, TestSuggestSpellingConverter, TestSerializedLuceneMatchVersion, TestModifyConfFiles, TestFileDictionaryLookup, SpellPossibilityIteratorTest, TestDocumentBuilder, PrimitiveFieldTypeTest, TestCloudManagedSchemaAddField, TestSystemIdResolver, BasicDistributedZk2Test, CollectionsAPIDistributedZkTest, SyncSliceTest, OpenCloseCoreStressTest, OverseerTest, LeaderElectionIntegrationTest, FullSolrCloudDistribCmdsTest, TestZkChroot, TestDistributedSearch, TestFaceting, TestStressReorder, TestMultiCoreConfBootstrap, TestReload, TestStressVersions, HardAutoCommitTest, DistributedTermsComponentTest, SimpleFacetsTest, TestSolr4Spatial, SolrCoreTest, StatsComponentTest, TestGroupingSearch, TestFunctionQuery, BasicFunctionalityTest, TestBadConfig, TestIndexSearcher, CurrencyFieldXmlFileTest, SolrIndexSplitterTest, TestCoreDiscovery, AnalysisAfterCoreReloadTest, SignatureUpdateProcessorFactoryTest]
   [junit4] Completed on J0 in 1.59s, 6 tests, 2 failures <<< FAILURES!

[...truncated 431 lines...]
BUILD FAILED
/mnt/ssd/jenkins/workspace/Lucene-Solr-trunk-Linux/build.xml:420: The following error occurred while executing this line:
/mnt/ssd/jenkins/workspace/Lucene-Solr-trunk-Linux/build.xml:413: The following error occurred while executing this line:
/mnt/ssd/jenkins/workspace/Lucene-Solr-trunk-Linux/build.xml:39: The following error occurred while executing this line:
/mnt/ssd/jenkins/workspace/Lucene-Solr-trunk-Linux/extra-targets.xml:37: The following error occurred while executing this line:
/mnt/ssd/jenkins/workspace/Lucene-Solr-trunk-Linux/solr/build.xml:189: The following error occurred while executing this line:
/mnt/ssd/jenkins/workspace/Lucene-Solr-trunk-Linux/solr/common-build.xml:491: The following error occurred while executing this line:
/mnt/ssd/jenkins/workspace/Lucene-Solr-trunk-Linux/lucene/common-build.xml:1275: The following error occurred while executing this line:
/mnt/ssd/jenkins/workspace/Lucene-Solr-trunk-Linux/lucene/common-build.xml:908: There were test failures: 357 suites, 1570 tests, 1 error, 5 failures, 68 ignored (6 assumptions)

Total time: 34 minutes 34 seconds
Build step 'Invoke Ant' marked build as failure
Description set: Java: 64bit/ibm-j9-jdk7 -Xjit:exclude={org/apache/lucene/util/fst/FST.pack(IIF)Lorg/apache/lucene/util/fst/FST;}
Archiving artifacts
Recording test results
Email was triggered for: Failure
Sending email for trigger: Failure



Mime
View raw message