lucene-dev mailing list archives

Site index · List index
Message view « Date » · « Thread »
Top « Date » · « Thread »
From Policeman Jenkins Server <jenk...@thetaphi.de>
Subject [JENKINS] Lucene-Solr-trunk-Linux (32bit/jdk1.8.0-ea-b117) - Build # 8554 - Still Failing!
Date Tue, 03 Dec 2013 10:01:05 GMT
Build: http://jenkins.thetaphi.de/job/Lucene-Solr-trunk-Linux/8554/
Java: 32bit/jdk1.8.0-ea-b117 -client -XX:+UseConcMarkSweepGC

3 tests failed.
FAILED:  junit.framework.TestSuite.org.apache.solr.hadoop.MorphlineReducerTest

Error Message:
1 thread leaked from SUITE scope at org.apache.solr.hadoop.MorphlineReducerTest:     1) Thread[id=15,
name=Thread-4, state=TIMED_WAITING, group=TGRP-MorphlineReducerTest]         at sun.misc.Unsafe.park(Native
Method)         at java.util.concurrent.locks.LockSupport.parkNanos(LockSupport.java:215)
        at java.util.concurrent.locks.AbstractQueuedSynchronizer.doAcquireSharedNanos(AbstractQueuedSynchronizer.java:1037)
        at java.util.concurrent.locks.AbstractQueuedSynchronizer.tryAcquireSharedNanos(AbstractQueuedSynchronizer.java:1328)
        at java.util.concurrent.CountDownLatch.await(CountDownLatch.java:277)         at org.apache.solr.hadoop.HeartBeater.run(HeartBeater.java:108)

Stack Trace:
com.carrotsearch.randomizedtesting.ThreadLeakError: 1 thread leaked from SUITE scope at org.apache.solr.hadoop.MorphlineReducerTest:

   1) Thread[id=15, name=Thread-4, state=TIMED_WAITING, group=TGRP-MorphlineReducerTest]
        at sun.misc.Unsafe.park(Native Method)
        at java.util.concurrent.locks.LockSupport.parkNanos(LockSupport.java:215)
        at java.util.concurrent.locks.AbstractQueuedSynchronizer.doAcquireSharedNanos(AbstractQueuedSynchronizer.java:1037)
        at java.util.concurrent.locks.AbstractQueuedSynchronizer.tryAcquireSharedNanos(AbstractQueuedSynchronizer.java:1328)
        at java.util.concurrent.CountDownLatch.await(CountDownLatch.java:277)
        at org.apache.solr.hadoop.HeartBeater.run(HeartBeater.java:108)
	at __randomizedtesting.SeedInfo.seed([5D2AA377A3358688]:0)


FAILED:  junit.framework.TestSuite.org.apache.solr.hadoop.MorphlineReducerTest

Error Message:
There are still zombie threads that couldn't be terminated:    1) Thread[id=15, name=Thread-4,
state=TIMED_WAITING, group=TGRP-MorphlineReducerTest]         at sun.misc.Unsafe.park(Native
Method)         at java.util.concurrent.locks.LockSupport.parkNanos(LockSupport.java:215)
        at java.util.concurrent.locks.AbstractQueuedSynchronizer.doAcquireSharedNanos(AbstractQueuedSynchronizer.java:1037)
        at java.util.concurrent.locks.AbstractQueuedSynchronizer.tryAcquireSharedNanos(AbstractQueuedSynchronizer.java:1328)
        at java.util.concurrent.CountDownLatch.await(CountDownLatch.java:277)         at org.apache.solr.hadoop.HeartBeater.run(HeartBeater.java:108)

Stack Trace:
com.carrotsearch.randomizedtesting.ThreadLeakError: There are still zombie threads that couldn't
be terminated:
   1) Thread[id=15, name=Thread-4, state=TIMED_WAITING, group=TGRP-MorphlineReducerTest]
        at sun.misc.Unsafe.park(Native Method)
        at java.util.concurrent.locks.LockSupport.parkNanos(LockSupport.java:215)
        at java.util.concurrent.locks.AbstractQueuedSynchronizer.doAcquireSharedNanos(AbstractQueuedSynchronizer.java:1037)
        at java.util.concurrent.locks.AbstractQueuedSynchronizer.tryAcquireSharedNanos(AbstractQueuedSynchronizer.java:1328)
        at java.util.concurrent.CountDownLatch.await(CountDownLatch.java:277)
        at org.apache.solr.hadoop.HeartBeater.run(HeartBeater.java:108)
	at __randomizedtesting.SeedInfo.seed([5D2AA377A3358688]:0)


FAILED:  org.apache.solr.hadoop.MorphlineReducerTest.testReducer

Error Message:


Stack Trace:
java.lang.ExceptionInInitializerError
	at __randomizedtesting.SeedInfo.seed([5D2AA377A3358688:298EC4B5096387C8]:0)
	at org.apache.solr.core.ConfigSolr.fromInputStream(ConfigSolr.java:85)
	at org.apache.solr.core.ConfigSolr.fromFile(ConfigSolr.java:64)
	at org.apache.solr.core.ConfigSolr.fromSolrHome(ConfigSolr.java:94)
	at org.apache.solr.core.CoreContainer.<init>(CoreContainer.java:132)
	at org.apache.solr.hadoop.SolrRecordWriter.createEmbeddedSolrServer(SolrRecordWriter.java:162)
	at org.apache.solr.hadoop.SolrRecordWriter.<init>(SolrRecordWriter.java:118)
	at org.apache.solr.hadoop.SolrOutputFormat.getRecordWriter(SolrOutputFormat.java:161)
	at org.apache.hadoop.mrunit.internal.mapreduce.MockMapreduceOutputFormat.collect(MockMapreduceOutputFormat.java:100)
	at org.apache.hadoop.mrunit.internal.mapreduce.AbstractMockContextWrapper$4.answer(AbstractMockContextWrapper.java:90)
	at org.mockito.internal.stubbing.StubbedInvocationMatcher.answer(StubbedInvocationMatcher.java:34)
	at org.mockito.internal.handler.MockHandlerImpl.handle(MockHandlerImpl.java:91)
	at org.mockito.internal.handler.NullResultGuardian.handle(NullResultGuardian.java:29)
	at org.mockito.internal.handler.InvocationNotifierHandler.handle(InvocationNotifierHandler.java:38)
	at org.mockito.internal.creation.MethodInterceptorFilter.intercept(MethodInterceptorFilter.java:51)
	at org.apache.hadoop.mapreduce.Reducer$Context$$EnhancerByMockitoWithCGLIB$$baf2f468.write(<generated>)
	at org.apache.hadoop.mapreduce.Reducer.reduce(Reducer.java:150)
	at org.apache.solr.hadoop.SolrReducer.reduce(SolrReducer.java:80)
	at org.apache.solr.hadoop.SolrReducer.reduce(SolrReducer.java:45)
	at org.apache.hadoop.mapreduce.Reducer.run(Reducer.java:171)
	at org.apache.hadoop.mrunit.mapreduce.ReduceDriver.run(ReduceDriver.java:143)
	at org.apache.solr.hadoop.MorphlineReducerTest.testReducer(MorphlineReducerTest.java:112)
	at sun.reflect.NativeMethodAccessorImpl.invoke0(Native Method)
	at sun.reflect.NativeMethodAccessorImpl.invoke(NativeMethodAccessorImpl.java:62)
	at sun.reflect.DelegatingMethodAccessorImpl.invoke(DelegatingMethodAccessorImpl.java:43)
	at java.lang.reflect.Method.invoke(Method.java:483)
	at com.carrotsearch.randomizedtesting.RandomizedRunner.invoke(RandomizedRunner.java:1559)
	at com.carrotsearch.randomizedtesting.RandomizedRunner.access$600(RandomizedRunner.java:79)
	at com.carrotsearch.randomizedtesting.RandomizedRunner$6.evaluate(RandomizedRunner.java:737)
	at com.carrotsearch.randomizedtesting.RandomizedRunner$7.evaluate(RandomizedRunner.java:773)
	at com.carrotsearch.randomizedtesting.RandomizedRunner$8.evaluate(RandomizedRunner.java:787)
	at com.carrotsearch.randomizedtesting.rules.SystemPropertiesRestoreRule$1.evaluate(SystemPropertiesRestoreRule.java:53)
	at org.apache.lucene.util.TestRuleSetupTeardownChained$1.evaluate(TestRuleSetupTeardownChained.java:50)
	at org.apache.lucene.util.TestRuleFieldCacheSanity$1.evaluate(TestRuleFieldCacheSanity.java:51)
	at org.apache.lucene.util.AbstractBeforeAfterRule$1.evaluate(AbstractBeforeAfterRule.java:46)
	at com.carrotsearch.randomizedtesting.rules.SystemPropertiesInvariantRule$1.evaluate(SystemPropertiesInvariantRule.java:55)
	at org.apache.lucene.util.TestRuleThreadAndTestName$1.evaluate(TestRuleThreadAndTestName.java:49)
	at org.apache.lucene.util.TestRuleIgnoreAfterMaxFailures$1.evaluate(TestRuleIgnoreAfterMaxFailures.java:70)
	at org.apache.lucene.util.TestRuleMarkFailure$1.evaluate(TestRuleMarkFailure.java:48)
	at com.carrotsearch.randomizedtesting.rules.StatementAdapter.evaluate(StatementAdapter.java:36)
	at com.carrotsearch.randomizedtesting.ThreadLeakControl$StatementRunner.run(ThreadLeakControl.java:358)
	at com.carrotsearch.randomizedtesting.ThreadLeakControl.forkTimeoutingTask(ThreadLeakControl.java:782)
	at com.carrotsearch.randomizedtesting.ThreadLeakControl$3.evaluate(ThreadLeakControl.java:442)
	at com.carrotsearch.randomizedtesting.RandomizedRunner.runSingleTest(RandomizedRunner.java:746)
	at com.carrotsearch.randomizedtesting.RandomizedRunner$3.evaluate(RandomizedRunner.java:648)
	at com.carrotsearch.randomizedtesting.RandomizedRunner$4.evaluate(RandomizedRunner.java:682)
	at com.carrotsearch.randomizedtesting.RandomizedRunner$5.evaluate(RandomizedRunner.java:693)
	at com.carrotsearch.randomizedtesting.rules.StatementAdapter.evaluate(StatementAdapter.java:36)
	at com.carrotsearch.randomizedtesting.rules.SystemPropertiesRestoreRule$1.evaluate(SystemPropertiesRestoreRule.java:53)
	at org.apache.lucene.util.AbstractBeforeAfterRule$1.evaluate(AbstractBeforeAfterRule.java:46)
	at org.apache.lucene.util.TestRuleStoreClassName$1.evaluate(TestRuleStoreClassName.java:42)
	at com.carrotsearch.randomizedtesting.rules.SystemPropertiesInvariantRule$1.evaluate(SystemPropertiesInvariantRule.java:55)
	at com.carrotsearch.randomizedtesting.rules.NoShadowingOrOverridesOnMethodsRule$1.evaluate(NoShadowingOrOverridesOnMethodsRule.java:39)
	at com.carrotsearch.randomizedtesting.rules.NoShadowingOrOverridesOnMethodsRule$1.evaluate(NoShadowingOrOverridesOnMethodsRule.java:39)
	at com.carrotsearch.randomizedtesting.rules.StatementAdapter.evaluate(StatementAdapter.java:36)
	at org.apache.lucene.util.TestRuleAssertionsRequired$1.evaluate(TestRuleAssertionsRequired.java:43)
	at org.apache.lucene.util.TestRuleMarkFailure$1.evaluate(TestRuleMarkFailure.java:48)
	at org.apache.lucene.util.TestRuleIgnoreAfterMaxFailures$1.evaluate(TestRuleIgnoreAfterMaxFailures.java:70)
	at org.apache.lucene.util.TestRuleIgnoreTestSuites$1.evaluate(TestRuleIgnoreTestSuites.java:55)
	at com.carrotsearch.randomizedtesting.rules.StatementAdapter.evaluate(StatementAdapter.java:36)
	at com.carrotsearch.randomizedtesting.ThreadLeakControl$StatementRunner.run(ThreadLeakControl.java:358)
	at java.lang.Thread.run(Thread.java:744)
Caused by: java.lang.RuntimeException: XPathFactory#newInstance() failed to create an XPathFactory
for the default object model: http://java.sun.com/jaxp/xpath/dom with the XPathFactoryConfigurationException:
javax.xml.xpath.XPathFactoryConfigurationException: java.util.ServiceConfigurationError: javax.xml.xpath.XPathFactory:
jar:file:/mnt/ssd/jenkins/workspace/Lucene-Solr-trunk-Linux/solr/contrib/solr-mr/lib/Saxon-HE-9.5.1-2.jar!/META-INF/services/javax.xml.xpath.XPathFactory:2:
Illegal configuration-file syntax
	at javax.xml.xpath.XPathFactory.newInstance(XPathFactory.java:102)
	at org.apache.solr.core.Config.<clinit>(Config.java:68)
	... 61 more




Build Log:
[...truncated 18888 lines...]
   [junit4] Suite: org.apache.solr.hadoop.MorphlineReducerTest
   [junit4]   1> 0    [TEST-MorphlineReducerTest.testReducer-seed#[5D2AA377A3358688]] INFO
 org.apache.solr.SolrTestCaseJ4  - ###Starting testReducer
   [junit4]   1> 1468 [TEST-MorphlineReducerTest.testReducer-seed#[5D2AA377A3358688]] INFO
 org.apache.solr.hadoop.HeartBeater  - Heart beat reporting class is org.apache.hadoop.mapreduce.Reducer$Context$$EnhancerByMockitoWithCGLIB$$baf2f468
   [junit4]   1> 1468 [Thread-2] INFO  org.apache.solr.hadoop.HeartBeater  - HeartBeat
thread running
   [junit4]   1> 1469 [Thread-2] INFO  org.apache.solr.hadoop.HeartBeater  - heartbeat
skipped count 0
   [junit4]   1> 1675 [TEST-MorphlineReducerTest.testReducer-seed#[5D2AA377A3358688]] WARN
 org.apache.hadoop.util.NativeCodeLoader  - Unable to load native-hadoop library for your
platform... using builtin-java classes where applicable
   [junit4]   1> 1817 [TEST-MorphlineReducerTest.testReducer-seed#[5D2AA377A3358688]] INFO
 org.apache.solr.hadoop.HeartBeater  - Heart beat reporting class is org.apache.hadoop.mapreduce.Reducer$Context$$EnhancerByMockitoWithCGLIB$$baf2f468
   [junit4]   1> 1817 [Thread-4] INFO  org.apache.solr.hadoop.HeartBeater  - HeartBeat
thread running
   [junit4]   1> 1820 [Thread-4] INFO  org.apache.solr.hadoop.HeartBeater  - Issuing heart
beat for 1 threads
   [junit4]   1> 1822 [TEST-MorphlineReducerTest.testReducer-seed#[5D2AA377A3358688]] INFO
 org.apache.solr.hadoop.SolrRecordWriter  - Using this unpacked directory as solr home: mrunit-84446d4f-c2da-4b06-9ebf-0ef2f371a377/solr3476767349603258228.zip
   [junit4]   1> 1822 [TEST-MorphlineReducerTest.testReducer-seed#[5D2AA377A3358688]] INFO
 org.apache.solr.hadoop.SolrRecordWriter  - Creating embedded Solr server with solrHomeDir:
mrunit-84446d4f-c2da-4b06-9ebf-0ef2f371a377/solr3476767349603258228.zip, fs: org.apache.hadoop.fs.LocalFileSystem@3c36d,
outputShardDir: mrunit-0.20587972916833197/_temporary/0/_temporary/attempt_000000000000_0000_m_000000_0/part-m-00000
   [junit4]   1> 1846 [TEST-MorphlineReducerTest.testReducer-seed#[5D2AA377A3358688]] INFO
 org.apache.solr.core.SolrResourceLoader  - new SolrResourceLoader for directory: 'mrunit-84446d4f-c2da-4b06-9ebf-0ef2f371a377/solr3476767349603258228.zip/'
   [junit4]   1> 1973 [TEST-MorphlineReducerTest.testReducer-seed#[5D2AA377A3358688]] INFO
 org.apache.solr.hadoop.SolrRecordWriter  - Constructed instance information solr.home mrunit-84446d4f-c2da-4b06-9ebf-0ef2f371a377/solr3476767349603258228.zip
(mrunit-84446d4f-c2da-4b06-9ebf-0ef2f371a377/solr3476767349603258228.zip), instance dir mrunit-84446d4f-c2da-4b06-9ebf-0ef2f371a377/solr3476767349603258228.zip/,
conf dir mrunit-84446d4f-c2da-4b06-9ebf-0ef2f371a377/solr3476767349603258228.zip/conf/, writing
index to solr.data.dir mrunit-0.20587972916833197/_temporary/0/_temporary/attempt_000000000000_0000_m_000000_0/part-m-00000/data,
with permdir mrunit-0.20587972916833197/_temporary/0/_temporary/attempt_000000000000_0000_m_000000_0/part-m-00000
   [junit4]   1> 1979 [TEST-MorphlineReducerTest.testReducer-seed#[5D2AA377A3358688]] INFO
 org.apache.solr.core.ConfigSolr  - Loading container configuration from /mnt/ssd/jenkins/workspace/Lucene-Solr-trunk-Linux/solr/build/contrib/solr-mr/test/J1/mrunit-84446d4f-c2da-4b06-9ebf-0ef2f371a377/solr3476767349603258228.zip/solr.xml
   [junit4]   1> 2097 [TEST-MorphlineReducerTest.testReducer-seed#[5D2AA377A3358688]] INFO
 org.apache.solr.SolrTestCaseJ4  - ###Ending testReducer
   [junit4]   2> NOTE: reproduce with: ant test  -Dtestcase=MorphlineReducerTest -Dtests.method=testReducer
-Dtests.seed=5D2AA377A3358688 -Dtests.multiplier=3 -Dtests.slow=true -Dtests.locale=sr_CS
-Dtests.timezone=Pacific/Chuuk -Dtests.file.encoding=UTF-8
   [junit4] ERROR   2.16s J1 | MorphlineReducerTest.testReducer <<<
   [junit4]    > Throwable #1: java.lang.ExceptionInInitializerError
   [junit4]    > 	at __randomizedtesting.SeedInfo.seed([5D2AA377A3358688:298EC4B5096387C8]:0)
   [junit4]    > 	at org.apache.solr.core.ConfigSolr.fromInputStream(ConfigSolr.java:85)
   [junit4]    > 	at org.apache.solr.core.ConfigSolr.fromFile(ConfigSolr.java:64)
   [junit4]    > 	at org.apache.solr.core.ConfigSolr.fromSolrHome(ConfigSolr.java:94)
   [junit4]    > 	at org.apache.solr.core.CoreContainer.<init>(CoreContainer.java:132)
   [junit4]    > 	at org.apache.solr.hadoop.SolrRecordWriter.createEmbeddedSolrServer(SolrRecordWriter.java:162)
   [junit4]    > 	at org.apache.solr.hadoop.SolrRecordWriter.<init>(SolrRecordWriter.java:118)
   [junit4]    > 	at org.apache.solr.hadoop.SolrOutputFormat.getRecordWriter(SolrOutputFormat.java:161)
   [junit4]    > 	at org.apache.hadoop.mrunit.internal.mapreduce.MockMapreduceOutputFormat.collect(MockMapreduceOutputFormat.java:100)
   [junit4]    > 	at org.apache.hadoop.mrunit.internal.mapreduce.AbstractMockContextWrapper$4.answer(AbstractMockContextWrapper.java:90)
   [junit4]    > 	at org.mockito.internal.stubbing.StubbedInvocationMatcher.answer(StubbedInvocationMatcher.java:34)
   [junit4]    > 	at org.mockito.internal.handler.MockHandlerImpl.handle(MockHandlerImpl.java:91)
   [junit4]    > 	at org.mockito.internal.handler.NullResultGuardian.handle(NullResultGuardian.java:29)
   [junit4]    > 	at org.mockito.internal.handler.InvocationNotifierHandler.handle(InvocationNotifierHandler.java:38)
   [junit4]    > 	at org.mockito.internal.creation.MethodInterceptorFilter.intercept(MethodInterceptorFilter.java:51)
   [junit4]    > 	at org.apache.hadoop.mapreduce.Reducer$Context$$EnhancerByMockitoWithCGLIB$$baf2f468.write(<generated>)
   [junit4]    > 	at org.apache.hadoop.mapreduce.Reducer.reduce(Reducer.java:150)
   [junit4]    > 	at org.apache.solr.hadoop.SolrReducer.reduce(SolrReducer.java:80)
   [junit4]    > 	at org.apache.solr.hadoop.SolrReducer.reduce(SolrReducer.java:45)
   [junit4]    > 	at org.apache.hadoop.mapreduce.Reducer.run(Reducer.java:171)
   [junit4]    > 	at org.apache.hadoop.mrunit.mapreduce.ReduceDriver.run(ReduceDriver.java:143)
   [junit4]    > 	at org.apache.solr.hadoop.MorphlineReducerTest.testReducer(MorphlineReducerTest.java:112)
   [junit4]    > 	at java.lang.Thread.run(Thread.java:744)
   [junit4]    > Caused by: java.lang.RuntimeException: XPathFactory#newInstance() failed
to create an XPathFactory for the default object model: http://java.sun.com/jaxp/xpath/dom
with the XPathFactoryConfigurationException: javax.xml.xpath.XPathFactoryConfigurationException:
java.util.ServiceConfigurationError: javax.xml.xpath.XPathFactory: jar:file:/mnt/ssd/jenkins/workspace/Lucene-Solr-trunk-Linux/solr/contrib/solr-mr/lib/Saxon-HE-9.5.1-2.jar!/META-INF/services/javax.xml.xpath.XPathFactory:2:
Illegal configuration-file syntax
   [junit4]    > 	at javax.xml.xpath.XPathFactory.newInstance(XPathFactory.java:102)
   [junit4]    > 	at org.apache.solr.core.Config.<clinit>(Config.java:68)
   [junit4]    > 	... 61 more
   [junit4]   1> 2143 [SUITE-MorphlineReducerTest-seed#[5D2AA377A3358688]-worker] INFO
 org.apache.solr.SolrTestCaseJ4  - ###deleteCore
   [junit4]   2> 2488 T9 ccr.ThreadLeakControl.checkThreadLeaks WARNING Will linger awaiting
termination of 1 leaked thread(s).
   [junit4]   2> 22551 T9 ccr.ThreadLeakControl.checkThreadLeaks SEVERE 1 thread leaked
from SUITE scope at org.apache.solr.hadoop.MorphlineReducerTest: 
   [junit4]   2> 	   1) Thread[id=15, name=Thread-4, state=TIMED_WAITING, group=TGRP-MorphlineReducerTest]
   [junit4]   2> 	        at sun.misc.Unsafe.park(Native Method)
   [junit4]   2> 	        at java.util.concurrent.locks.LockSupport.parkNanos(LockSupport.java:215)
   [junit4]   2> 	        at java.util.concurrent.locks.AbstractQueuedSynchronizer.doAcquireSharedNanos(AbstractQueuedSynchronizer.java:1037)
   [junit4]   2> 	        at java.util.concurrent.locks.AbstractQueuedSynchronizer.tryAcquireSharedNanos(AbstractQueuedSynchronizer.java:1328)
   [junit4]   2> 	        at java.util.concurrent.CountDownLatch.await(CountDownLatch.java:277)
   [junit4]   2> 	        at org.apache.solr.hadoop.HeartBeater.run(HeartBeater.java:108)
   [junit4]   2> 22552 T9 ccr.ThreadLeakControl.tryToInterruptAll Starting to interrupt
leaked threads:
   [junit4]   2> 	   1) Thread[id=15, name=Thread-4, state=TIMED_WAITING, group=TGRP-MorphlineReducerTest]
   [junit4]   1> 22239 [Thread-4] ERROR org.apache.solr.hadoop.HeartBeater  - HeartBeat
throwable
   [junit4]   1> java.lang.InterruptedException
   [junit4]   1> 	at java.util.concurrent.locks.AbstractQueuedSynchronizer.doAcquireSharedNanos(AbstractQueuedSynchronizer.java:1039)
   [junit4]   1> 	at java.util.concurrent.locks.AbstractQueuedSynchronizer.tryAcquireSharedNanos(AbstractQueuedSynchronizer.java:1328)
   [junit4]   1> 	at java.util.concurrent.CountDownLatch.await(CountDownLatch.java:277)
   [junit4]   1> 	at org.apache.solr.hadoop.HeartBeater.run(HeartBeater.java:108)
   [junit4]   1> 22242 [Thread-4] INFO  org.apache.solr.hadoop.HeartBeater  - heartbeat
skipped count 0
   [junit4]   1> 22731 [Thread-4] ERROR org.apache.solr.hadoop.HeartBeater  - HeartBeat
throwable
   [junit4]   1> java.lang.InterruptedException
   [junit4]   1> 	at java.util.concurrent.locks.AbstractQueuedSynchronizer.doAcquireSharedNanos(AbstractQueuedSynchronizer.java:1039)
   [junit4]   1> 	at java.util.concurrent.locks.AbstractQueuedSynchronizer.tryAcquireSharedNanos(AbstractQueuedSynchronizer.java:1328)
   [junit4]   1> 	at java.util.concurrent.CountDownLatch.await(CountDownLatch.java:277)
   [junit4]   1> 	at org.apache.solr.hadoop.HeartBeater.run(HeartBeater.java:108)
   [junit4]   1> 22732 [Thread-4] INFO  org.apache.solr.hadoop.HeartBeater  - heartbeat
skipped count 0
   [junit4]   1> 23231 [Thread-4] ERROR org.apache.solr.hadoop.HeartBeater  - HeartBeat
throwable
   [junit4]   1> java.lang.InterruptedException
   [junit4]   1> 	at java.util.concurrent.locks.AbstractQueuedSynchronizer.doAcquireSharedNanos(AbstractQueuedSynchronizer.java:1039)
   [junit4]   1> 	at java.util.concurrent.locks.AbstractQueuedSynchronizer.tryAcquireSharedNanos(AbstractQueuedSynchronizer.java:1328)
   [junit4]   1> 	at java.util.concurrent.CountDownLatch.await(CountDownLatch.java:277)
   [junit4]   1> 	at org.apache.solr.hadoop.HeartBeater.run(HeartBeater.java:108)
   [junit4]   1> 23232 [Thread-4] INFO  org.apache.solr.hadoop.HeartBeater  - heartbeat
skipped count 0
   [junit4]   1> 23732 [Thread-4] ERROR org.apache.solr.hadoop.HeartBeater  - HeartBeat
throwable
   [junit4]   1> java.lang.InterruptedException
   [junit4]   1> 	at java.util.concurrent.locks.AbstractQueuedSynchronizer.doAcquireSharedNanos(AbstractQueuedSynchronizer.java:1039)
   [junit4]   1> 	at java.util.concurrent.locks.AbstractQueuedSynchronizer.tryAcquireSharedNanos(AbstractQueuedSynchronizer.java:1328)
   [junit4]   1> 	at java.util.concurrent.CountDownLatch.await(CountDownLatch.java:277)
   [junit4]   1> 	at org.apache.solr.hadoop.HeartBeater.run(HeartBeater.java:108)
   [junit4]   1> 23732 [Thread-4] INFO  org.apache.solr.hadoop.HeartBeater  - heartbeat
skipped count 0
   [junit4]   1> 24232 [Thread-4] ERROR org.apache.solr.hadoop.HeartBeater  - HeartBeat
throwable
   [junit4]   1> java.lang.InterruptedException
   [junit4]   1> 	at java.util.concurrent.locks.AbstractQueuedSynchronizer.doAcquireSharedNanos(AbstractQueuedSynchronizer.java:1039)
   [junit4]   1> 	at java.util.concurrent.locks.AbstractQueuedSynchronizer.tryAcquireSharedNanos(AbstractQueuedSynchronizer.java:1328)
   [junit4]   1> 	at java.util.concurrent.CountDownLatch.await(CountDownLatch.java:277)
   [junit4]   1> 	at org.apache.solr.hadoop.HeartBeater.run(HeartBeater.java:108)
   [junit4]   1> 24232 [Thread-4] INFO  org.apache.solr.hadoop.HeartBeater  - heartbeat
skipped count 0
   [junit4]   1> 24732 [Thread-4] ERROR org.apache.solr.hadoop.HeartBeater  - HeartBeat
throwable
   [junit4]   1> java.lang.InterruptedException
   [junit4]   1> 	at java.util.concurrent.locks.AbstractQueuedSynchronizer.doAcquireSharedNanos(AbstractQueuedSynchronizer.java:1039)
   [junit4]   1> 	at java.util.concurrent.locks.AbstractQueuedSynchronizer.tryAcquireSharedNanos(AbstractQueuedSynchronizer.java:1328)
   [junit4]   1> 	at java.util.concurrent.CountDownLatch.await(CountDownLatch.java:277)
   [junit4]   1> 	at org.apache.solr.hadoop.HeartBeater.run(HeartBeater.java:108)
   [junit4]   1> 24733 [Thread-4] INFO  org.apache.solr.hadoop.HeartBeater  - heartbeat
skipped count 0
   [junit4]   2> 25554 T9 ccr.ThreadLeakControl.tryToInterruptAll SEVERE There are still
zombie threads that couldn't be terminated:
   [junit4]   2> 	   1) Thread[id=15, name=Thread-4, state=TIMED_WAITING, group=TGRP-MorphlineReducerTest]
   [junit4]   2> 	        at sun.misc.Unsafe.park(Native Method)
   [junit4]   2> 	        at java.util.concurrent.locks.LockSupport.parkNanos(LockSupport.java:215)
   [junit4]   2> 	        at java.util.concurrent.locks.AbstractQueuedSynchronizer.doAcquireSharedNanos(AbstractQueuedSynchronizer.java:1037)
   [junit4]   2> 	        at java.util.concurrent.locks.AbstractQueuedSynchronizer.tryAcquireSharedNanos(AbstractQueuedSynchronizer.java:1328)
   [junit4]   2> 	        at java.util.concurrent.CountDownLatch.await(CountDownLatch.java:277)
   [junit4]   2> 	        at org.apache.solr.hadoop.HeartBeater.run(HeartBeater.java:108)
   [junit4]   2> NOTE: test params are: codec=Lucene46: {}, docValues:{}, sim=RandomSimilarityProvider(queryNorm=true,coord=no):
{}, locale=sr_CS, timezone=Pacific/Chuuk
   [junit4]   2> NOTE: Linux 3.8.0-33-generic i386/Oracle Corporation 1.8.0-ea (32-bit)/cpus=8,threads=2,free=4448912,total=19501056
   [junit4]   2> NOTE: All tests run in this JVM: [MorphlineReducerTest]
   [junit4]   2> NOTE: reproduce with: ant test  -Dtestcase=MorphlineReducerTest -Dtests.seed=5D2AA377A3358688
-Dtests.multiplier=3 -Dtests.slow=true -Dtests.locale=sr_CS -Dtests.timezone=Pacific/Chuuk
-Dtests.file.encoding=UTF-8
   [junit4] ERROR   0.00s J1 | MorphlineReducerTest (suite) <<<
   [junit4]    > Throwable #1: com.carrotsearch.randomizedtesting.ThreadLeakError: 1 thread
leaked from SUITE scope at org.apache.solr.hadoop.MorphlineReducerTest: 
   [junit4]    >    1) Thread[id=15, name=Thread-4, state=TIMED_WAITING, group=TGRP-MorphlineReducerTest]
   [junit4]    >         at sun.misc.Unsafe.park(Native Method)
   [junit4]    >         at java.util.concurrent.locks.LockSupport.parkNanos(LockSupport.java:215)
   [junit4]    >         at java.util.concurrent.locks.AbstractQueuedSynchronizer.doAcquireSharedNanos(AbstractQueuedSynchronizer.java:1037)
   [junit4]    >         at java.util.concurrent.locks.AbstractQueuedSynchronizer.tryAcquireSharedNanos(AbstractQueuedSynchronizer.java:1328)
   [junit4]    >         at java.util.concurrent.CountDownLatch.await(CountDownLatch.java:277)
   [junit4]    >         at org.apache.solr.hadoop.HeartBeater.run(HeartBeater.java:108)
   [junit4]    > 	at __randomizedtesting.SeedInfo.seed([5D2AA377A3358688]:0)Throwable #2:
com.carrotsearch.randomizedtesting.ThreadLeakError: There are still zombie threads that couldn't
be terminated:
   [junit4]    >    1) Thread[id=15, name=Thread-4, state=TIMED_WAITING, group=TGRP-MorphlineReducerTest]
   [junit4]    >         at sun.misc.Unsafe.park(Native Method)
   [junit4]    >         at java.util.concurrent.locks.LockSupport.parkNanos(LockSupport.java:215)
   [junit4]    >         at java.util.concurrent.locks.AbstractQueuedSynchronizer.doAcquireSharedNanos(AbstractQueuedSynchronizer.java:1037)
   [junit4]    >         at java.util.concurrent.locks.AbstractQueuedSynchronizer.tryAcquireSharedNanos(AbstractQueuedSynchronizer.java:1328)
   [junit4]    >         at java.util.concurrent.CountDownLatch.await(CountDownLatch.java:277)
   [junit4]    >         at org.apache.solr.hadoop.HeartBeater.run(HeartBeater.java:108)
   [junit4]    > 	at __randomizedtesting.SeedInfo.seed([5D2AA377A3358688]:0)
   [junit4] Completed on J1 in 26.24s, 1 test, 3 errors <<< FAILURES!

[...truncated 14 lines...]
BUILD FAILED
/mnt/ssd/jenkins/workspace/Lucene-Solr-trunk-Linux/build.xml:420: The following error occurred
while executing this line:
/mnt/ssd/jenkins/workspace/Lucene-Solr-trunk-Linux/build.xml:400: The following error occurred
while executing this line:
/mnt/ssd/jenkins/workspace/Lucene-Solr-trunk-Linux/build.xml:39: The following error occurred
while executing this line:
/mnt/ssd/jenkins/workspace/Lucene-Solr-trunk-Linux/extra-targets.xml:37: The following error
occurred while executing this line:
/mnt/ssd/jenkins/workspace/Lucene-Solr-trunk-Linux/solr/build.xml:209: The following error
occurred while executing this line:
/mnt/ssd/jenkins/workspace/Lucene-Solr-trunk-Linux/solr/common-build.xml:441: The following
error occurred while executing this line:
/mnt/ssd/jenkins/workspace/Lucene-Solr-trunk-Linux/solr/common-build.xml:491: The following
error occurred while executing this line:
/mnt/ssd/jenkins/workspace/Lucene-Solr-trunk-Linux/lucene/common-build.xml:1276: The following
error occurred while executing this line:
/mnt/ssd/jenkins/workspace/Lucene-Solr-trunk-Linux/lucene/common-build.xml:909: There were
test failures: 6 suites, 34 tests, 2 suite-level errors, 1 error, 5 ignored

Total time: 57 minutes 57 seconds
Build step 'Invoke Ant' marked build as failure
Description set: Java: 32bit/jdk1.8.0-ea-b117 -client -XX:+UseConcMarkSweepGC
Archiving artifacts
Recording test results
Email was triggered for: Failure
Sending email for trigger: Failure



Mime
View raw message