lucene-dev mailing list archives

Site index · List index
Message view « Date » · « Thread »
Top « Date » · « Thread »
From Policeman Jenkins Server <jenk...@thetaphi.de>
Subject [JENKINS] Lucene-Solr-trunk-MacOSX (64bit/jdk1.7.0) - Build # 1077 - Still Failing!
Date Sun, 01 Dec 2013 01:21:20 GMT
Build: http://jenkins.thetaphi.de/job/Lucene-Solr-trunk-MacOSX/1077/
Java: 64bit/jdk1.7.0 -XX:+UseCompressedOops -XX:+UseG1GC

6 tests failed.
FAILED:  org.apache.solr.analytics.expression.ExpressionTest.negateTest

Error Message:
Caught exception in getStatResult, xPath = /response/lst[@name='stats']/lst[@name='nr']/double[@name='sum']  raw data: <?xml version="1.0" encoding="UTF-8"?> <response>  <lst name="responseHeader">   <int name="status">0</int>   <int name="QTime">11</int> </lst> <result name="response" numFound="100" start="0"> </result> <lst name="stats">   <lst name="stats_fields"/> </lst> <lst name="stats">   <lst name="cnr">     <double name="c10">10.0</double>     <double name="c8">8.0</double>   </lst>   <lst name="dmr">     <str name="cma">+2MONTHS</str>     <str name="cme">+2YEARS</str>     <date name="dmma">1812-02-29T23:59:59Z</date>     <date name="dmme">1807-12-31T23:59:59Z</date>     <date name="max">1811-12-31T23:59:59Z</date>     <date name="median">1805-12-31T23:59:59Z</date>   </lst>   <lst name="csr">     <str name="cs1">this is the first</str>     <str name="cs2">this is the second</str>     <str name="cs3">this is the third</str>   </lst>   <lst name="cr">     <str name="ccmax">this is the secondstr9</str>     <str name="ccmin">this is the firststr0</str>     <str name="csmax">this is the second</str>     <str name="csmin">this is the first</str>     <str name="max">str9</str>     <str name="min">str0</str>   </lst>   <lst name="pr">     <long name="count">100</long>     <null name="mc"/>     <null name="mean"/>     <null name="su"/>     <null name="sum"/>     <null name="unique"/>   </lst>   <lst name="nr">     <double name="c">-100.0</double>     <long name="count">100</long>     <null name="s"/>     <null name="sum"/>   </lst>   <lst name="mr">     <long name="count">100</long>     <null name="mcm"/>     <null name="mean"/>     <null name="median"/>     <null name="su"/>     <null name="sum"/>     <null name="unique"/>   </lst>   <lst name="dr">     <long name="count">100</long>     <null name="mc"/>     <null name="mean"/>     <null name="su"/>     <null name="sum"/>     <null name="unique"/>   </lst>   <lst name="ar">     <long name="count">100</long>     <null name="mcm"/>     <null name="mean"/>     <null name="median"/>     <null name="su"/>     <null name="sum"/>     <null name="unique"/>   </lst>   <lst name="rr">     <str name="max">str9</str>     <str name="min">str0</str>     <str name="rmax">9rts</str>     <str name="rmin">0rts</str>   </lst>   <lst name="avr">     <double name="c">100.0</double>     <long name="count">100</long>     <null name="s"/>     <null name="sum"/>   </lst>   <lst name="cdr">     <date name="cd1">1800-12-31T23:59:59Z</date>     <date name="cd2">1804-06-30T23:59:59Z</date>     <str name="cs1">1800-12-31T23:59:59Z</str>     <str name="cs2">1804-06-30T23:59:59Z</str>   </lst> </lst> </response> 

Stack Trace:
java.lang.AssertionError: Caught exception in getStatResult, xPath = /response/lst[@name='stats']/lst[@name='nr']/double[@name='sum'] 
raw data: <?xml version="1.0" encoding="UTF-8"?>
<response>

<lst name="responseHeader">
  <int name="status">0</int>
  <int name="QTime">11</int>
</lst>
<result name="response" numFound="100" start="0">
</result>
<lst name="stats">
  <lst name="stats_fields"/>
</lst>
<lst name="stats">
  <lst name="cnr">
    <double name="c10">10.0</double>
    <double name="c8">8.0</double>
  </lst>
  <lst name="dmr">
    <str name="cma">+2MONTHS</str>
    <str name="cme">+2YEARS</str>
    <date name="dmma">1812-02-29T23:59:59Z</date>
    <date name="dmme">1807-12-31T23:59:59Z</date>
    <date name="max">1811-12-31T23:59:59Z</date>
    <date name="median">1805-12-31T23:59:59Z</date>
  </lst>
  <lst name="csr">
    <str name="cs1">this is the first</str>
    <str name="cs2">this is the second</str>
    <str name="cs3">this is the third</str>
  </lst>
  <lst name="cr">
    <str name="ccmax">this is the secondstr9</str>
    <str name="ccmin">this is the firststr0</str>
    <str name="csmax">this is the second</str>
    <str name="csmin">this is the first</str>
    <str name="max">str9</str>
    <str name="min">str0</str>
  </lst>
  <lst name="pr">
    <long name="count">100</long>
    <null name="mc"/>
    <null name="mean"/>
    <null name="su"/>
    <null name="sum"/>
    <null name="unique"/>
  </lst>
  <lst name="nr">
    <double name="c">-100.0</double>
    <long name="count">100</long>
    <null name="s"/>
    <null name="sum"/>
  </lst>
  <lst name="mr">
    <long name="count">100</long>
    <null name="mcm"/>
    <null name="mean"/>
    <null name="median"/>
    <null name="su"/>
    <null name="sum"/>
    <null name="unique"/>
  </lst>
  <lst name="dr">
    <long name="count">100</long>
    <null name="mc"/>
    <null name="mean"/>
    <null name="su"/>
    <null name="sum"/>
    <null name="unique"/>
  </lst>
  <lst name="ar">
    <long name="count">100</long>
    <null name="mcm"/>
    <null name="mean"/>
    <null name="median"/>
    <null name="su"/>
    <null name="sum"/>
    <null name="unique"/>
  </lst>
  <lst name="rr">
    <str name="max">str9</str>
    <str name="min">str0</str>
    <str name="rmax">9rts</str>
    <str name="rmin">0rts</str>
  </lst>
  <lst name="avr">
    <double name="c">100.0</double>
    <long name="count">100</long>
    <null name="s"/>
    <null name="sum"/>
  </lst>
  <lst name="cdr">
    <date name="cd1">1800-12-31T23:59:59Z</date>
    <date name="cd2">1804-06-30T23:59:59Z</date>
    <str name="cs1">1800-12-31T23:59:59Z</str>
    <str name="cs2">1804-06-30T23:59:59Z</str>
  </lst>
</lst>
</response>

	at __randomizedtesting.SeedInfo.seed([62228E17E07C23F8:6A2AE6B244517348]:0)
	at org.junit.Assert.fail(Assert.java:93)
	at org.apache.solr.analytics.AbstractAnalyticsStatsTest.getStatResult(AbstractAnalyticsStatsTest.java:113)
	at org.apache.solr.analytics.expression.ExpressionTest.negateTest(ExpressionTest.java:132)
	at sun.reflect.NativeMethodAccessorImpl.invoke0(Native Method)
	at sun.reflect.NativeMethodAccessorImpl.invoke(NativeMethodAccessorImpl.java:57)
	at sun.reflect.DelegatingMethodAccessorImpl.invoke(DelegatingMethodAccessorImpl.java:43)
	at java.lang.reflect.Method.invoke(Method.java:606)
	at com.carrotsearch.randomizedtesting.RandomizedRunner.invoke(RandomizedRunner.java:1559)
	at com.carrotsearch.randomizedtesting.RandomizedRunner.access$600(RandomizedRunner.java:79)
	at com.carrotsearch.randomizedtesting.RandomizedRunner$6.evaluate(RandomizedRunner.java:737)
	at com.carrotsearch.randomizedtesting.RandomizedRunner$7.evaluate(RandomizedRunner.java:773)
	at com.carrotsearch.randomizedtesting.RandomizedRunner$8.evaluate(RandomizedRunner.java:787)
	at com.carrotsearch.randomizedtesting.rules.SystemPropertiesRestoreRule$1.evaluate(SystemPropertiesRestoreRule.java:53)
	at org.apache.lucene.util.TestRuleSetupTeardownChained$1.evaluate(TestRuleSetupTeardownChained.java:50)
	at org.apache.lucene.util.TestRuleFieldCacheSanity$1.evaluate(TestRuleFieldCacheSanity.java:51)
	at org.apache.lucene.util.AbstractBeforeAfterRule$1.evaluate(AbstractBeforeAfterRule.java:46)
	at com.carrotsearch.randomizedtesting.rules.SystemPropertiesInvariantRule$1.evaluate(SystemPropertiesInvariantRule.java:55)
	at org.apache.lucene.util.TestRuleThreadAndTestName$1.evaluate(TestRuleThreadAndTestName.java:49)
	at org.apache.lucene.util.TestRuleIgnoreAfterMaxFailures$1.evaluate(TestRuleIgnoreAfterMaxFailures.java:70)
	at org.apache.lucene.util.TestRuleMarkFailure$1.evaluate(TestRuleMarkFailure.java:48)
	at com.carrotsearch.randomizedtesting.rules.StatementAdapter.evaluate(StatementAdapter.java:36)
	at com.carrotsearch.randomizedtesting.ThreadLeakControl$StatementRunner.run(ThreadLeakControl.java:358)
	at com.carrotsearch.randomizedtesting.ThreadLeakControl.forkTimeoutingTask(ThreadLeakControl.java:782)
	at com.carrotsearch.randomizedtesting.ThreadLeakControl$3.evaluate(ThreadLeakControl.java:442)
	at com.carrotsearch.randomizedtesting.RandomizedRunner.runSingleTest(RandomizedRunner.java:746)
	at com.carrotsearch.randomizedtesting.RandomizedRunner$3.evaluate(RandomizedRunner.java:648)
	at com.carrotsearch.randomizedtesting.RandomizedRunner$4.evaluate(RandomizedRunner.java:682)
	at com.carrotsearch.randomizedtesting.RandomizedRunner$5.evaluate(RandomizedRunner.java:693)
	at com.carrotsearch.randomizedtesting.rules.StatementAdapter.evaluate(StatementAdapter.java:36)
	at com.carrotsearch.randomizedtesting.rules.SystemPropertiesRestoreRule$1.evaluate(SystemPropertiesRestoreRule.java:53)
	at org.apache.lucene.util.AbstractBeforeAfterRule$1.evaluate(AbstractBeforeAfterRule.java:46)
	at org.apache.lucene.util.TestRuleStoreClassName$1.evaluate(TestRuleStoreClassName.java:42)
	at com.carrotsearch.randomizedtesting.rules.SystemPropertiesInvariantRule$1.evaluate(SystemPropertiesInvariantRule.java:55)
	at com.carrotsearch.randomizedtesting.rules.NoShadowingOrOverridesOnMethodsRule$1.evaluate(NoShadowingOrOverridesOnMethodsRule.java:39)
	at com.carrotsearch.randomizedtesting.rules.NoShadowingOrOverridesOnMethodsRule$1.evaluate(NoShadowingOrOverridesOnMethodsRule.java:39)
	at com.carrotsearch.randomizedtesting.rules.StatementAdapter.evaluate(StatementAdapter.java:36)
	at org.apache.lucene.util.TestRuleAssertionsRequired$1.evaluate(TestRuleAssertionsRequired.java:43)
	at org.apache.lucene.util.TestRuleMarkFailure$1.evaluate(TestRuleMarkFailure.java:48)
	at org.apache.lucene.util.TestRuleIgnoreAfterMaxFailures$1.evaluate(TestRuleIgnoreAfterMaxFailures.java:70)
	at org.apache.lucene.util.TestRuleIgnoreTestSuites$1.evaluate(TestRuleIgnoreTestSuites.java:55)
	at com.carrotsearch.randomizedtesting.rules.StatementAdapter.evaluate(StatementAdapter.java:36)
	at com.carrotsearch.randomizedtesting.ThreadLeakControl$StatementRunner.run(ThreadLeakControl.java:358)
	at java.lang.Thread.run(Thread.java:744)


FAILED:  org.apache.solr.analytics.expression.ExpressionTest.multiplyTest

Error Message:
Caught exception in getStatResult, xPath = /response/lst[@name='stats']/lst[@name='mr']/double[@name='sum']  raw data: <?xml version="1.0" encoding="UTF-8"?> <response>  <lst name="responseHeader">   <int name="status">0</int>   <int name="QTime">11</int> </lst> <result name="response" numFound="100" start="0"> </result> <lst name="stats">   <lst name="stats_fields"/> </lst> <lst name="stats">   <lst name="cnr">     <double name="c10">10.0</double>     <double name="c8">8.0</double>   </lst>   <lst name="dmr">     <str name="cma">+2MONTHS</str>     <str name="cme">+2YEARS</str>     <date name="dmma">1812-02-29T23:59:59Z</date>     <date name="dmme">1807-12-31T23:59:59Z</date>     <date name="max">1811-12-31T23:59:59Z</date>     <date name="median">1805-12-31T23:59:59Z</date>   </lst>   <lst name="csr">     <str name="cs1">this is the first</str>     <str name="cs2">this is the second</str>     <str name="cs3">this is the third</str>   </lst>   <lst name="cr">     <str name="ccmax">this is the secondstr9</str>     <str name="ccmin">this is the firststr0</str>     <str name="csmax">this is the second</str>     <str name="csmin">this is the first</str>     <str name="max">str9</str>     <str name="min">str0</str>   </lst>   <lst name="pr">     <long name="count">100</long>     <null name="mc"/>     <null name="mean"/>     <null name="su"/>     <null name="sum"/>     <null name="unique"/>   </lst>   <lst name="nr">     <double name="c">-100.0</double>     <long name="count">100</long>     <null name="s"/>     <null name="sum"/>   </lst>   <lst name="mr">     <long name="count">100</long>     <null name="mcm"/>     <null name="mean"/>     <null name="median"/>     <null name="su"/>     <null name="sum"/>     <null name="unique"/>   </lst>   <lst name="dr">     <long name="count">100</long>     <null name="mc"/>     <null name="mean"/>     <null name="su"/>     <null name="sum"/>     <null name="unique"/>   </lst>   <lst name="ar">     <long name="count">100</long>     <null name="mcm"/>     <null name="mean"/>     <null name="median"/>     <null name="su"/>     <null name="sum"/>     <null name="unique"/>   </lst>   <lst name="rr">     <str name="max">str9</str>     <str name="min">str0</str>     <str name="rmax">9rts</str>     <str name="rmin">0rts</str>   </lst>   <lst name="avr">     <double name="c">100.0</double>     <long name="count">100</long>     <null name="s"/>     <null name="sum"/>   </lst>   <lst name="cdr">     <date name="cd1">1800-12-31T23:59:59Z</date>     <date name="cd2">1804-06-30T23:59:59Z</date>     <str name="cs1">1800-12-31T23:59:59Z</str>     <str name="cs2">1804-06-30T23:59:59Z</str>   </lst> </lst> </response> 

Stack Trace:
java.lang.AssertionError: Caught exception in getStatResult, xPath = /response/lst[@name='stats']/lst[@name='mr']/double[@name='sum'] 
raw data: <?xml version="1.0" encoding="UTF-8"?>
<response>

<lst name="responseHeader">
  <int name="status">0</int>
  <int name="QTime">11</int>
</lst>
<result name="response" numFound="100" start="0">
</result>
<lst name="stats">
  <lst name="stats_fields"/>
</lst>
<lst name="stats">
  <lst name="cnr">
    <double name="c10">10.0</double>
    <double name="c8">8.0</double>
  </lst>
  <lst name="dmr">
    <str name="cma">+2MONTHS</str>
    <str name="cme">+2YEARS</str>
    <date name="dmma">1812-02-29T23:59:59Z</date>
    <date name="dmme">1807-12-31T23:59:59Z</date>
    <date name="max">1811-12-31T23:59:59Z</date>
    <date name="median">1805-12-31T23:59:59Z</date>
  </lst>
  <lst name="csr">
    <str name="cs1">this is the first</str>
    <str name="cs2">this is the second</str>
    <str name="cs3">this is the third</str>
  </lst>
  <lst name="cr">
    <str name="ccmax">this is the secondstr9</str>
    <str name="ccmin">this is the firststr0</str>
    <str name="csmax">this is the second</str>
    <str name="csmin">this is the first</str>
    <str name="max">str9</str>
    <str name="min">str0</str>
  </lst>
  <lst name="pr">
    <long name="count">100</long>
    <null name="mc"/>
    <null name="mean"/>
    <null name="su"/>
    <null name="sum"/>
    <null name="unique"/>
  </lst>
  <lst name="nr">
    <double name="c">-100.0</double>
    <long name="count">100</long>
    <null name="s"/>
    <null name="sum"/>
  </lst>
  <lst name="mr">
    <long name="count">100</long>
    <null name="mcm"/>
    <null name="mean"/>
    <null name="median"/>
    <null name="su"/>
    <null name="sum"/>
    <null name="unique"/>
  </lst>
  <lst name="dr">
    <long name="count">100</long>
    <null name="mc"/>
    <null name="mean"/>
    <null name="su"/>
    <null name="sum"/>
    <null name="unique"/>
  </lst>
  <lst name="ar">
    <long name="count">100</long>
    <null name="mcm"/>
    <null name="mean"/>
    <null name="median"/>
    <null name="su"/>
    <null name="sum"/>
    <null name="unique"/>
  </lst>
  <lst name="rr">
    <str name="max">str9</str>
    <str name="min">str0</str>
    <str name="rmax">9rts</str>
    <str name="rmin">0rts</str>
  </lst>
  <lst name="avr">
    <double name="c">100.0</double>
    <long name="count">100</long>
    <null name="s"/>
    <null name="sum"/>
  </lst>
  <lst name="cdr">
    <date name="cd1">1800-12-31T23:59:59Z</date>
    <date name="cd2">1804-06-30T23:59:59Z</date>
    <str name="cs1">1800-12-31T23:59:59Z</str>
    <str name="cs2">1804-06-30T23:59:59Z</str>
  </lst>
</lst>
</response>

	at __randomizedtesting.SeedInfo.seed([62228E17E07C23F8:9A39069D5721596]:0)
	at org.junit.Assert.fail(Assert.java:93)
	at org.apache.solr.analytics.AbstractAnalyticsStatsTest.getStatResult(AbstractAnalyticsStatsTest.java:113)
	at org.apache.solr.analytics.expression.ExpressionTest.multiplyTest(ExpressionTest.java:92)
	at sun.reflect.NativeMethodAccessorImpl.invoke0(Native Method)
	at sun.reflect.NativeMethodAccessorImpl.invoke(NativeMethodAccessorImpl.java:57)
	at sun.reflect.DelegatingMethodAccessorImpl.invoke(DelegatingMethodAccessorImpl.java:43)
	at java.lang.reflect.Method.invoke(Method.java:606)
	at com.carrotsearch.randomizedtesting.RandomizedRunner.invoke(RandomizedRunner.java:1559)
	at com.carrotsearch.randomizedtesting.RandomizedRunner.access$600(RandomizedRunner.java:79)
	at com.carrotsearch.randomizedtesting.RandomizedRunner$6.evaluate(RandomizedRunner.java:737)
	at com.carrotsearch.randomizedtesting.RandomizedRunner$7.evaluate(RandomizedRunner.java:773)
	at com.carrotsearch.randomizedtesting.RandomizedRunner$8.evaluate(RandomizedRunner.java:787)
	at com.carrotsearch.randomizedtesting.rules.SystemPropertiesRestoreRule$1.evaluate(SystemPropertiesRestoreRule.java:53)
	at org.apache.lucene.util.TestRuleSetupTeardownChained$1.evaluate(TestRuleSetupTeardownChained.java:50)
	at org.apache.lucene.util.TestRuleFieldCacheSanity$1.evaluate(TestRuleFieldCacheSanity.java:51)
	at org.apache.lucene.util.AbstractBeforeAfterRule$1.evaluate(AbstractBeforeAfterRule.java:46)
	at com.carrotsearch.randomizedtesting.rules.SystemPropertiesInvariantRule$1.evaluate(SystemPropertiesInvariantRule.java:55)
	at org.apache.lucene.util.TestRuleThreadAndTestName$1.evaluate(TestRuleThreadAndTestName.java:49)
	at org.apache.lucene.util.TestRuleIgnoreAfterMaxFailures$1.evaluate(TestRuleIgnoreAfterMaxFailures.java:70)
	at org.apache.lucene.util.TestRuleMarkFailure$1.evaluate(TestRuleMarkFailure.java:48)
	at com.carrotsearch.randomizedtesting.rules.StatementAdapter.evaluate(StatementAdapter.java:36)
	at com.carrotsearch.randomizedtesting.ThreadLeakControl$StatementRunner.run(ThreadLeakControl.java:358)
	at com.carrotsearch.randomizedtesting.ThreadLeakControl.forkTimeoutingTask(ThreadLeakControl.java:782)
	at com.carrotsearch.randomizedtesting.ThreadLeakControl$3.evaluate(ThreadLeakControl.java:442)
	at com.carrotsearch.randomizedtesting.RandomizedRunner.runSingleTest(RandomizedRunner.java:746)
	at com.carrotsearch.randomizedtesting.RandomizedRunner$3.evaluate(RandomizedRunner.java:648)
	at com.carrotsearch.randomizedtesting.RandomizedRunner$4.evaluate(RandomizedRunner.java:682)
	at com.carrotsearch.randomizedtesting.RandomizedRunner$5.evaluate(RandomizedRunner.java:693)
	at com.carrotsearch.randomizedtesting.rules.StatementAdapter.evaluate(StatementAdapter.java:36)
	at com.carrotsearch.randomizedtesting.rules.SystemPropertiesRestoreRule$1.evaluate(SystemPropertiesRestoreRule.java:53)
	at org.apache.lucene.util.AbstractBeforeAfterRule$1.evaluate(AbstractBeforeAfterRule.java:46)
	at org.apache.lucene.util.TestRuleStoreClassName$1.evaluate(TestRuleStoreClassName.java:42)
	at com.carrotsearch.randomizedtesting.rules.SystemPropertiesInvariantRule$1.evaluate(SystemPropertiesInvariantRule.java:55)
	at com.carrotsearch.randomizedtesting.rules.NoShadowingOrOverridesOnMethodsRule$1.evaluate(NoShadowingOrOverridesOnMethodsRule.java:39)
	at com.carrotsearch.randomizedtesting.rules.NoShadowingOrOverridesOnMethodsRule$1.evaluate(NoShadowingOrOverridesOnMethodsRule.java:39)
	at com.carrotsearch.randomizedtesting.rules.StatementAdapter.evaluate(StatementAdapter.java:36)
	at org.apache.lucene.util.TestRuleAssertionsRequired$1.evaluate(TestRuleAssertionsRequired.java:43)
	at org.apache.lucene.util.TestRuleMarkFailure$1.evaluate(TestRuleMarkFailure.java:48)
	at org.apache.lucene.util.TestRuleIgnoreAfterMaxFailures$1.evaluate(TestRuleIgnoreAfterMaxFailures.java:70)
	at org.apache.lucene.util.TestRuleIgnoreTestSuites$1.evaluate(TestRuleIgnoreTestSuites.java:55)
	at com.carrotsearch.randomizedtesting.rules.StatementAdapter.evaluate(StatementAdapter.java:36)
	at com.carrotsearch.randomizedtesting.ThreadLeakControl$StatementRunner.run(ThreadLeakControl.java:358)
	at java.lang.Thread.run(Thread.java:744)


FAILED:  org.apache.solr.analytics.expression.ExpressionTest.divideTest

Error Message:
Caught exception in getStatResult, xPath = /response/lst[@name='stats']/lst[@name='dr']/double[@name='sum']  raw data: <?xml version="1.0" encoding="UTF-8"?> <response>  <lst name="responseHeader">   <int name="status">0</int>   <int name="QTime">11</int> </lst> <result name="response" numFound="100" start="0"> </result> <lst name="stats">   <lst name="stats_fields"/> </lst> <lst name="stats">   <lst name="cnr">     <double name="c10">10.0</double>     <double name="c8">8.0</double>   </lst>   <lst name="dmr">     <str name="cma">+2MONTHS</str>     <str name="cme">+2YEARS</str>     <date name="dmma">1812-02-29T23:59:59Z</date>     <date name="dmme">1807-12-31T23:59:59Z</date>     <date name="max">1811-12-31T23:59:59Z</date>     <date name="median">1805-12-31T23:59:59Z</date>   </lst>   <lst name="csr">     <str name="cs1">this is the first</str>     <str name="cs2">this is the second</str>     <str name="cs3">this is the third</str>   </lst>   <lst name="cr">     <str name="ccmax">this is the secondstr9</str>     <str name="ccmin">this is the firststr0</str>     <str name="csmax">this is the second</str>     <str name="csmin">this is the first</str>     <str name="max">str9</str>     <str name="min">str0</str>   </lst>   <lst name="pr">     <long name="count">100</long>     <null name="mc"/>     <null name="mean"/>     <null name="su"/>     <null name="sum"/>     <null name="unique"/>   </lst>   <lst name="nr">     <double name="c">-100.0</double>     <long name="count">100</long>     <null name="s"/>     <null name="sum"/>   </lst>   <lst name="mr">     <long name="count">100</long>     <null name="mcm"/>     <null name="mean"/>     <null name="median"/>     <null name="su"/>     <null name="sum"/>     <null name="unique"/>   </lst>   <lst name="dr">     <long name="count">100</long>     <null name="mc"/>     <null name="mean"/>     <null name="su"/>     <null name="sum"/>     <null name="unique"/>   </lst>   <lst name="ar">     <long name="count">100</long>     <null name="mcm"/>     <null name="mean"/>     <null name="median"/>     <null name="su"/>     <null name="sum"/>     <null name="unique"/>   </lst>   <lst name="rr">     <str name="max">str9</str>     <str name="min">str0</str>     <str name="rmax">9rts</str>     <str name="rmin">0rts</str>   </lst>   <lst name="avr">     <double name="c">100.0</double>     <long name="count">100</long>     <null name="s"/>     <null name="sum"/>   </lst>   <lst name="cdr">     <date name="cd1">1800-12-31T23:59:59Z</date>     <date name="cd2">1804-06-30T23:59:59Z</date>     <str name="cs1">1800-12-31T23:59:59Z</str>     <str name="cs2">1804-06-30T23:59:59Z</str>   </lst> </lst> </response> 

Stack Trace:
java.lang.AssertionError: Caught exception in getStatResult, xPath = /response/lst[@name='stats']/lst[@name='dr']/double[@name='sum'] 
raw data: <?xml version="1.0" encoding="UTF-8"?>
<response>

<lst name="responseHeader">
  <int name="status">0</int>
  <int name="QTime">11</int>
</lst>
<result name="response" numFound="100" start="0">
</result>
<lst name="stats">
  <lst name="stats_fields"/>
</lst>
<lst name="stats">
  <lst name="cnr">
    <double name="c10">10.0</double>
    <double name="c8">8.0</double>
  </lst>
  <lst name="dmr">
    <str name="cma">+2MONTHS</str>
    <str name="cme">+2YEARS</str>
    <date name="dmma">1812-02-29T23:59:59Z</date>
    <date name="dmme">1807-12-31T23:59:59Z</date>
    <date name="max">1811-12-31T23:59:59Z</date>
    <date name="median">1805-12-31T23:59:59Z</date>
  </lst>
  <lst name="csr">
    <str name="cs1">this is the first</str>
    <str name="cs2">this is the second</str>
    <str name="cs3">this is the third</str>
  </lst>
  <lst name="cr">
    <str name="ccmax">this is the secondstr9</str>
    <str name="ccmin">this is the firststr0</str>
    <str name="csmax">this is the second</str>
    <str name="csmin">this is the first</str>
    <str name="max">str9</str>
    <str name="min">str0</str>
  </lst>
  <lst name="pr">
    <long name="count">100</long>
    <null name="mc"/>
    <null name="mean"/>
    <null name="su"/>
    <null name="sum"/>
    <null name="unique"/>
  </lst>
  <lst name="nr">
    <double name="c">-100.0</double>
    <long name="count">100</long>
    <null name="s"/>
    <null name="sum"/>
  </lst>
  <lst name="mr">
    <long name="count">100</long>
    <null name="mcm"/>
    <null name="mean"/>
    <null name="median"/>
    <null name="su"/>
    <null name="sum"/>
    <null name="unique"/>
  </lst>
  <lst name="dr">
    <long name="count">100</long>
    <null name="mc"/>
    <null name="mean"/>
    <null name="su"/>
    <null name="sum"/>
    <null name="unique"/>
  </lst>
  <lst name="ar">
    <long name="count">100</long>
    <null name="mcm"/>
    <null name="mean"/>
    <null name="median"/>
    <null name="su"/>
    <null name="sum"/>
    <null name="unique"/>
  </lst>
  <lst name="rr">
    <str name="max">str9</str>
    <str name="min">str0</str>
    <str name="rmax">9rts</str>
    <str name="rmin">0rts</str>
  </lst>
  <lst name="avr">
    <double name="c">100.0</double>
    <long name="count">100</long>
    <null name="s"/>
    <null name="sum"/>
  </lst>
  <lst name="cdr">
    <date name="cd1">1800-12-31T23:59:59Z</date>
    <date name="cd2">1804-06-30T23:59:59Z</date>
    <str name="cs1">1800-12-31T23:59:59Z</str>
    <str name="cs2">1804-06-30T23:59:59Z</str>
  </lst>
</lst>
</response>

	at __randomizedtesting.SeedInfo.seed([62228E17E07C23F8:3A2F65E1C4BE412E]:0)
	at org.junit.Assert.fail(Assert.java:93)
	at org.apache.solr.analytics.AbstractAnalyticsStatsTest.getStatResult(AbstractAnalyticsStatsTest.java:113)
	at org.apache.solr.analytics.expression.ExpressionTest.divideTest(ExpressionTest.java:106)
	at sun.reflect.NativeMethodAccessorImpl.invoke0(Native Method)
	at sun.reflect.NativeMethodAccessorImpl.invoke(NativeMethodAccessorImpl.java:57)
	at sun.reflect.DelegatingMethodAccessorImpl.invoke(DelegatingMethodAccessorImpl.java:43)
	at java.lang.reflect.Method.invoke(Method.java:606)
	at com.carrotsearch.randomizedtesting.RandomizedRunner.invoke(RandomizedRunner.java:1559)
	at com.carrotsearch.randomizedtesting.RandomizedRunner.access$600(RandomizedRunner.java:79)
	at com.carrotsearch.randomizedtesting.RandomizedRunner$6.evaluate(RandomizedRunner.java:737)
	at com.carrotsearch.randomizedtesting.RandomizedRunner$7.evaluate(RandomizedRunner.java:773)
	at com.carrotsearch.randomizedtesting.RandomizedRunner$8.evaluate(RandomizedRunner.java:787)
	at com.carrotsearch.randomizedtesting.rules.SystemPropertiesRestoreRule$1.evaluate(SystemPropertiesRestoreRule.java:53)
	at org.apache.lucene.util.TestRuleSetupTeardownChained$1.evaluate(TestRuleSetupTeardownChained.java:50)
	at org.apache.lucene.util.TestRuleFieldCacheSanity$1.evaluate(TestRuleFieldCacheSanity.java:51)
	at org.apache.lucene.util.AbstractBeforeAfterRule$1.evaluate(AbstractBeforeAfterRule.java:46)
	at com.carrotsearch.randomizedtesting.rules.SystemPropertiesInvariantRule$1.evaluate(SystemPropertiesInvariantRule.java:55)
	at org.apache.lucene.util.TestRuleThreadAndTestName$1.evaluate(TestRuleThreadAndTestName.java:49)
	at org.apache.lucene.util.TestRuleIgnoreAfterMaxFailures$1.evaluate(TestRuleIgnoreAfterMaxFailures.java:70)
	at org.apache.lucene.util.TestRuleMarkFailure$1.evaluate(TestRuleMarkFailure.java:48)
	at com.carrotsearch.randomizedtesting.rules.StatementAdapter.evaluate(StatementAdapter.java:36)
	at com.carrotsearch.randomizedtesting.ThreadLeakControl$StatementRunner.run(ThreadLeakControl.java:358)
	at com.carrotsearch.randomizedtesting.ThreadLeakControl.forkTimeoutingTask(ThreadLeakControl.java:782)
	at com.carrotsearch.randomizedtesting.ThreadLeakControl$3.evaluate(ThreadLeakControl.java:442)
	at com.carrotsearch.randomizedtesting.RandomizedRunner.runSingleTest(RandomizedRunner.java:746)
	at com.carrotsearch.randomizedtesting.RandomizedRunner$3.evaluate(RandomizedRunner.java:648)
	at com.carrotsearch.randomizedtesting.RandomizedRunner$4.evaluate(RandomizedRunner.java:682)
	at com.carrotsearch.randomizedtesting.RandomizedRunner$5.evaluate(RandomizedRunner.java:693)
	at com.carrotsearch.randomizedtesting.rules.StatementAdapter.evaluate(StatementAdapter.java:36)
	at com.carrotsearch.randomizedtesting.rules.SystemPropertiesRestoreRule$1.evaluate(SystemPropertiesRestoreRule.java:53)
	at org.apache.lucene.util.AbstractBeforeAfterRule$1.evaluate(AbstractBeforeAfterRule.java:46)
	at org.apache.lucene.util.TestRuleStoreClassName$1.evaluate(TestRuleStoreClassName.java:42)
	at com.carrotsearch.randomizedtesting.rules.SystemPropertiesInvariantRule$1.evaluate(SystemPropertiesInvariantRule.java:55)
	at com.carrotsearch.randomizedtesting.rules.NoShadowingOrOverridesOnMethodsRule$1.evaluate(NoShadowingOrOverridesOnMethodsRule.java:39)
	at com.carrotsearch.randomizedtesting.rules.NoShadowingOrOverridesOnMethodsRule$1.evaluate(NoShadowingOrOverridesOnMethodsRule.java:39)
	at com.carrotsearch.randomizedtesting.rules.StatementAdapter.evaluate(StatementAdapter.java:36)
	at org.apache.lucene.util.TestRuleAssertionsRequired$1.evaluate(TestRuleAssertionsRequired.java:43)
	at org.apache.lucene.util.TestRuleMarkFailure$1.evaluate(TestRuleMarkFailure.java:48)
	at org.apache.lucene.util.TestRuleIgnoreAfterMaxFailures$1.evaluate(TestRuleIgnoreAfterMaxFailures.java:70)
	at org.apache.lucene.util.TestRuleIgnoreTestSuites$1.evaluate(TestRuleIgnoreTestSuites.java:55)
	at com.carrotsearch.randomizedtesting.rules.StatementAdapter.evaluate(StatementAdapter.java:36)
	at com.carrotsearch.randomizedtesting.ThreadLeakControl$StatementRunner.run(ThreadLeakControl.java:358)
	at java.lang.Thread.run(Thread.java:744)


FAILED:  org.apache.solr.analytics.expression.ExpressionTest.absoluteValueTest

Error Message:
Caught exception in getStatResult, xPath = /response/lst[@name='stats']/lst[@name='avr']/double[@name='sum']  raw data: <?xml version="1.0" encoding="UTF-8"?> <response>  <lst name="responseHeader">   <int name="status">0</int>   <int name="QTime">11</int> </lst> <result name="response" numFound="100" start="0"> </result> <lst name="stats">   <lst name="stats_fields"/> </lst> <lst name="stats">   <lst name="cnr">     <double name="c10">10.0</double>     <double name="c8">8.0</double>   </lst>   <lst name="dmr">     <str name="cma">+2MONTHS</str>     <str name="cme">+2YEARS</str>     <date name="dmma">1812-02-29T23:59:59Z</date>     <date name="dmme">1807-12-31T23:59:59Z</date>     <date name="max">1811-12-31T23:59:59Z</date>     <date name="median">1805-12-31T23:59:59Z</date>   </lst>   <lst name="csr">     <str name="cs1">this is the first</str>     <str name="cs2">this is the second</str>     <str name="cs3">this is the third</str>   </lst>   <lst name="cr">     <str name="ccmax">this is the secondstr9</str>     <str name="ccmin">this is the firststr0</str>     <str name="csmax">this is the second</str>     <str name="csmin">this is the first</str>     <str name="max">str9</str>     <str name="min">str0</str>   </lst>   <lst name="pr">     <long name="count">100</long>     <null name="mc"/>     <null name="mean"/>     <null name="su"/>     <null name="sum"/>     <null name="unique"/>   </lst>   <lst name="nr">     <double name="c">-100.0</double>     <long name="count">100</long>     <null name="s"/>     <null name="sum"/>   </lst>   <lst name="mr">     <long name="count">100</long>     <null name="mcm"/>     <null name="mean"/>     <null name="median"/>     <null name="su"/>     <null name="sum"/>     <null name="unique"/>   </lst>   <lst name="dr">     <long name="count">100</long>     <null name="mc"/>     <null name="mean"/>     <null name="su"/>     <null name="sum"/>     <null name="unique"/>   </lst>   <lst name="ar">     <long name="count">100</long>     <null name="mcm"/>     <null name="mean"/>     <null name="median"/>     <null name="su"/>     <null name="sum"/>     <null name="unique"/>   </lst>   <lst name="rr">     <str name="max">str9</str>     <str name="min">str0</str>     <str name="rmax">9rts</str>     <str name="rmin">0rts</str>   </lst>   <lst name="avr">     <double name="c">100.0</double>     <long name="count">100</long>     <null name="s"/>     <null name="sum"/>   </lst>   <lst name="cdr">     <date name="cd1">1800-12-31T23:59:59Z</date>     <date name="cd2">1804-06-30T23:59:59Z</date>     <str name="cs1">1800-12-31T23:59:59Z</str>     <str name="cs2">1804-06-30T23:59:59Z</str>   </lst> </lst> </response> 

Stack Trace:
java.lang.AssertionError: Caught exception in getStatResult, xPath = /response/lst[@name='stats']/lst[@name='avr']/double[@name='sum'] 
raw data: <?xml version="1.0" encoding="UTF-8"?>
<response>

<lst name="responseHeader">
  <int name="status">0</int>
  <int name="QTime">11</int>
</lst>
<result name="response" numFound="100" start="0">
</result>
<lst name="stats">
  <lst name="stats_fields"/>
</lst>
<lst name="stats">
  <lst name="cnr">
    <double name="c10">10.0</double>
    <double name="c8">8.0</double>
  </lst>
  <lst name="dmr">
    <str name="cma">+2MONTHS</str>
    <str name="cme">+2YEARS</str>
    <date name="dmma">1812-02-29T23:59:59Z</date>
    <date name="dmme">1807-12-31T23:59:59Z</date>
    <date name="max">1811-12-31T23:59:59Z</date>
    <date name="median">1805-12-31T23:59:59Z</date>
  </lst>
  <lst name="csr">
    <str name="cs1">this is the first</str>
    <str name="cs2">this is the second</str>
    <str name="cs3">this is the third</str>
  </lst>
  <lst name="cr">
    <str name="ccmax">this is the secondstr9</str>
    <str name="ccmin">this is the firststr0</str>
    <str name="csmax">this is the second</str>
    <str name="csmin">this is the first</str>
    <str name="max">str9</str>
    <str name="min">str0</str>
  </lst>
  <lst name="pr">
    <long name="count">100</long>
    <null name="mc"/>
    <null name="mean"/>
    <null name="su"/>
    <null name="sum"/>
    <null name="unique"/>
  </lst>
  <lst name="nr">
    <double name="c">-100.0</double>
    <long name="count">100</long>
    <null name="s"/>
    <null name="sum"/>
  </lst>
  <lst name="mr">
    <long name="count">100</long>
    <null name="mcm"/>
    <null name="mean"/>
    <null name="median"/>
    <null name="su"/>
    <null name="sum"/>
    <null name="unique"/>
  </lst>
  <lst name="dr">
    <long name="count">100</long>
    <null name="mc"/>
    <null name="mean"/>
    <null name="su"/>
    <null name="sum"/>
    <null name="unique"/>
  </lst>
  <lst name="ar">
    <long name="count">100</long>
    <null name="mcm"/>
    <null name="mean"/>
    <null name="median"/>
    <null name="su"/>
    <null name="sum"/>
    <null name="unique"/>
  </lst>
  <lst name="rr">
    <str name="max">str9</str>
    <str name="min">str0</str>
    <str name="rmax">9rts</str>
    <str name="rmin">0rts</str>
  </lst>
  <lst name="avr">
    <double name="c">100.0</double>
    <long name="count">100</long>
    <null name="s"/>
    <null name="sum"/>
  </lst>
  <lst name="cdr">
    <date name="cd1">1800-12-31T23:59:59Z</date>
    <date name="cd2">1804-06-30T23:59:59Z</date>
    <str name="cs1">1800-12-31T23:59:59Z</str>
    <str name="cs2">1804-06-30T23:59:59Z</str>
  </lst>
</lst>
</response>

	at __randomizedtesting.SeedInfo.seed([62228E17E07C23F8:438EAE022DE17B9E]:0)
	at org.junit.Assert.fail(Assert.java:93)
	at org.apache.solr.analytics.AbstractAnalyticsStatsTest.getStatResult(AbstractAnalyticsStatsTest.java:113)
	at org.apache.solr.analytics.expression.ExpressionTest.absoluteValueTest(ExpressionTest.java:143)
	at sun.reflect.NativeMethodAccessorImpl.invoke0(Native Method)
	at sun.reflect.NativeMethodAccessorImpl.invoke(NativeMethodAccessorImpl.java:57)
	at sun.reflect.DelegatingMethodAccessorImpl.invoke(DelegatingMethodAccessorImpl.java:43)
	at java.lang.reflect.Method.invoke(Method.java:606)
	at com.carrotsearch.randomizedtesting.RandomizedRunner.invoke(RandomizedRunner.java:1559)
	at com.carrotsearch.randomizedtesting.RandomizedRunner.access$600(RandomizedRunner.java:79)
	at com.carrotsearch.randomizedtesting.RandomizedRunner$6.evaluate(RandomizedRunner.java:737)
	at com.carrotsearch.randomizedtesting.RandomizedRunner$7.evaluate(RandomizedRunner.java:773)
	at com.carrotsearch.randomizedtesting.RandomizedRunner$8.evaluate(RandomizedRunner.java:787)
	at com.carrotsearch.randomizedtesting.rules.SystemPropertiesRestoreRule$1.evaluate(SystemPropertiesRestoreRule.java:53)
	at org.apache.lucene.util.TestRuleSetupTeardownChained$1.evaluate(TestRuleSetupTeardownChained.java:50)
	at org.apache.lucene.util.TestRuleFieldCacheSanity$1.evaluate(TestRuleFieldCacheSanity.java:51)
	at org.apache.lucene.util.AbstractBeforeAfterRule$1.evaluate(AbstractBeforeAfterRule.java:46)
	at com.carrotsearch.randomizedtesting.rules.SystemPropertiesInvariantRule$1.evaluate(SystemPropertiesInvariantRule.java:55)
	at org.apache.lucene.util.TestRuleThreadAndTestName$1.evaluate(TestRuleThreadAndTestName.java:49)
	at org.apache.lucene.util.TestRuleIgnoreAfterMaxFailures$1.evaluate(TestRuleIgnoreAfterMaxFailures.java:70)
	at org.apache.lucene.util.TestRuleMarkFailure$1.evaluate(TestRuleMarkFailure.java:48)
	at com.carrotsearch.randomizedtesting.rules.StatementAdapter.evaluate(StatementAdapter.java:36)
	at com.carrotsearch.randomizedtesting.ThreadLeakControl$StatementRunner.run(ThreadLeakControl.java:358)
	at com.carrotsearch.randomizedtesting.ThreadLeakControl.forkTimeoutingTask(ThreadLeakControl.java:782)
	at com.carrotsearch.randomizedtesting.ThreadLeakControl$3.evaluate(ThreadLeakControl.java:442)
	at com.carrotsearch.randomizedtesting.RandomizedRunner.runSingleTest(RandomizedRunner.java:746)
	at com.carrotsearch.randomizedtesting.RandomizedRunner$3.evaluate(RandomizedRunner.java:648)
	at com.carrotsearch.randomizedtesting.RandomizedRunner$4.evaluate(RandomizedRunner.java:682)
	at com.carrotsearch.randomizedtesting.RandomizedRunner$5.evaluate(RandomizedRunner.java:693)
	at com.carrotsearch.randomizedtesting.rules.StatementAdapter.evaluate(StatementAdapter.java:36)
	at com.carrotsearch.randomizedtesting.rules.SystemPropertiesRestoreRule$1.evaluate(SystemPropertiesRestoreRule.java:53)
	at org.apache.lucene.util.AbstractBeforeAfterRule$1.evaluate(AbstractBeforeAfterRule.java:46)
	at org.apache.lucene.util.TestRuleStoreClassName$1.evaluate(TestRuleStoreClassName.java:42)
	at com.carrotsearch.randomizedtesting.rules.SystemPropertiesInvariantRule$1.evaluate(SystemPropertiesInvariantRule.java:55)
	at com.carrotsearch.randomizedtesting.rules.NoShadowingOrOverridesOnMethodsRule$1.evaluate(NoShadowingOrOverridesOnMethodsRule.java:39)
	at com.carrotsearch.randomizedtesting.rules.NoShadowingOrOverridesOnMethodsRule$1.evaluate(NoShadowingOrOverridesOnMethodsRule.java:39)
	at com.carrotsearch.randomizedtesting.rules.StatementAdapter.evaluate(StatementAdapter.java:36)
	at org.apache.lucene.util.TestRuleAssertionsRequired$1.evaluate(TestRuleAssertionsRequired.java:43)
	at org.apache.lucene.util.TestRuleMarkFailure$1.evaluate(TestRuleMarkFailure.java:48)
	at org.apache.lucene.util.TestRuleIgnoreAfterMaxFailures$1.evaluate(TestRuleIgnoreAfterMaxFailures.java:70)
	at org.apache.lucene.util.TestRuleIgnoreTestSuites$1.evaluate(TestRuleIgnoreTestSuites.java:55)
	at com.carrotsearch.randomizedtesting.rules.StatementAdapter.evaluate(StatementAdapter.java:36)
	at com.carrotsearch.randomizedtesting.ThreadLeakControl$StatementRunner.run(ThreadLeakControl.java:358)
	at java.lang.Thread.run(Thread.java:744)


FAILED:  org.apache.solr.analytics.expression.ExpressionTest.powerTest

Error Message:
Caught exception in getStatResult, xPath = /response/lst[@name='stats']/lst[@name='pr']/double[@name='sum']  raw data: <?xml version="1.0" encoding="UTF-8"?> <response>  <lst name="responseHeader">   <int name="status">0</int>   <int name="QTime">11</int> </lst> <result name="response" numFound="100" start="0"> </result> <lst name="stats">   <lst name="stats_fields"/> </lst> <lst name="stats">   <lst name="cnr">     <double name="c10">10.0</double>     <double name="c8">8.0</double>   </lst>   <lst name="dmr">     <str name="cma">+2MONTHS</str>     <str name="cme">+2YEARS</str>     <date name="dmma">1812-02-29T23:59:59Z</date>     <date name="dmme">1807-12-31T23:59:59Z</date>     <date name="max">1811-12-31T23:59:59Z</date>     <date name="median">1805-12-31T23:59:59Z</date>   </lst>   <lst name="csr">     <str name="cs1">this is the first</str>     <str name="cs2">this is the second</str>     <str name="cs3">this is the third</str>   </lst>   <lst name="cr">     <str name="ccmax">this is the secondstr9</str>     <str name="ccmin">this is the firststr0</str>     <str name="csmax">this is the second</str>     <str name="csmin">this is the first</str>     <str name="max">str9</str>     <str name="min">str0</str>   </lst>   <lst name="pr">     <long name="count">100</long>     <null name="mc"/>     <null name="mean"/>     <null name="su"/>     <null name="sum"/>     <null name="unique"/>   </lst>   <lst name="nr">     <double name="c">-100.0</double>     <long name="count">100</long>     <null name="s"/>     <null name="sum"/>   </lst>   <lst name="mr">     <long name="count">100</long>     <null name="mcm"/>     <null name="mean"/>     <null name="median"/>     <null name="su"/>     <null name="sum"/>     <null name="unique"/>   </lst>   <lst name="dr">     <long name="count">100</long>     <null name="mc"/>     <null name="mean"/>     <null name="su"/>     <null name="sum"/>     <null name="unique"/>   </lst>   <lst name="ar">     <long name="count">100</long>     <null name="mcm"/>     <null name="mean"/>     <null name="median"/>     <null name="su"/>     <null name="sum"/>     <null name="unique"/>   </lst>   <lst name="rr">     <str name="max">str9</str>     <str name="min">str0</str>     <str name="rmax">9rts</str>     <str name="rmin">0rts</str>   </lst>   <lst name="avr">     <double name="c">100.0</double>     <long name="count">100</long>     <null name="s"/>     <null name="sum"/>   </lst>   <lst name="cdr">     <date name="cd1">1800-12-31T23:59:59Z</date>     <date name="cd2">1804-06-30T23:59:59Z</date>     <str name="cs1">1800-12-31T23:59:59Z</str>     <str name="cs2">1804-06-30T23:59:59Z</str>   </lst> </lst> </response> 

Stack Trace:
java.lang.AssertionError: Caught exception in getStatResult, xPath = /response/lst[@name='stats']/lst[@name='pr']/double[@name='sum'] 
raw data: <?xml version="1.0" encoding="UTF-8"?>
<response>

<lst name="responseHeader">
  <int name="status">0</int>
  <int name="QTime">11</int>
</lst>
<result name="response" numFound="100" start="0">
</result>
<lst name="stats">
  <lst name="stats_fields"/>
</lst>
<lst name="stats">
  <lst name="cnr">
    <double name="c10">10.0</double>
    <double name="c8">8.0</double>
  </lst>
  <lst name="dmr">
    <str name="cma">+2MONTHS</str>
    <str name="cme">+2YEARS</str>
    <date name="dmma">1812-02-29T23:59:59Z</date>
    <date name="dmme">1807-12-31T23:59:59Z</date>
    <date name="max">1811-12-31T23:59:59Z</date>
    <date name="median">1805-12-31T23:59:59Z</date>
  </lst>
  <lst name="csr">
    <str name="cs1">this is the first</str>
    <str name="cs2">this is the second</str>
    <str name="cs3">this is the third</str>
  </lst>
  <lst name="cr">
    <str name="ccmax">this is the secondstr9</str>
    <str name="ccmin">this is the firststr0</str>
    <str name="csmax">this is the second</str>
    <str name="csmin">this is the first</str>
    <str name="max">str9</str>
    <str name="min">str0</str>
  </lst>
  <lst name="pr">
    <long name="count">100</long>
    <null name="mc"/>
    <null name="mean"/>
    <null name="su"/>
    <null name="sum"/>
    <null name="unique"/>
  </lst>
  <lst name="nr">
    <double name="c">-100.0</double>
    <long name="count">100</long>
    <null name="s"/>
    <null name="sum"/>
  </lst>
  <lst name="mr">
    <long name="count">100</long>
    <null name="mcm"/>
    <null name="mean"/>
    <null name="median"/>
    <null name="su"/>
    <null name="sum"/>
    <null name="unique"/>
  </lst>
  <lst name="dr">
    <long name="count">100</long>
    <null name="mc"/>
    <null name="mean"/>
    <null name="su"/>
    <null name="sum"/>
    <null name="unique"/>
  </lst>
  <lst name="ar">
    <long name="count">100</long>
    <null name="mcm"/>
    <null name="mean"/>
    <null name="median"/>
    <null name="su"/>
    <null name="sum"/>
    <null name="unique"/>
  </lst>
  <lst name="rr">
    <str name="max">str9</str>
    <str name="min">str0</str>
    <str name="rmax">9rts</str>
    <str name="rmin">0rts</str>
  </lst>
  <lst name="avr">
    <double name="c">100.0</double>
    <long name="count">100</long>
    <null name="s"/>
    <null name="sum"/>
  </lst>
  <lst name="cdr">
    <date name="cd1">1800-12-31T23:59:59Z</date>
    <date name="cd2">1804-06-30T23:59:59Z</date>
    <str name="cs1">1800-12-31T23:59:59Z</str>
    <str name="cs2">1804-06-30T23:59:59Z</str>
  </lst>
</lst>
</response>

	at __randomizedtesting.SeedInfo.seed([62228E17E07C23F8:C903914086B7D29]:0)
	at org.junit.Assert.fail(Assert.java:93)
	at org.apache.solr.analytics.AbstractAnalyticsStatsTest.getStatResult(AbstractAnalyticsStatsTest.java:113)
	at org.apache.solr.analytics.expression.ExpressionTest.powerTest(ExpressionTest.java:119)
	at sun.reflect.NativeMethodAccessorImpl.invoke0(Native Method)
	at sun.reflect.NativeMethodAccessorImpl.invoke(NativeMethodAccessorImpl.java:57)
	at sun.reflect.DelegatingMethodAccessorImpl.invoke(DelegatingMethodAccessorImpl.java:43)
	at java.lang.reflect.Method.invoke(Method.java:606)
	at com.carrotsearch.randomizedtesting.RandomizedRunner.invoke(RandomizedRunner.java:1559)
	at com.carrotsearch.randomizedtesting.RandomizedRunner.access$600(RandomizedRunner.java:79)
	at com.carrotsearch.randomizedtesting.RandomizedRunner$6.evaluate(RandomizedRunner.java:737)
	at com.carrotsearch.randomizedtesting.RandomizedRunner$7.evaluate(RandomizedRunner.java:773)
	at com.carrotsearch.randomizedtesting.RandomizedRunner$8.evaluate(RandomizedRunner.java:787)
	at com.carrotsearch.randomizedtesting.rules.SystemPropertiesRestoreRule$1.evaluate(SystemPropertiesRestoreRule.java:53)
	at org.apache.lucene.util.TestRuleSetupTeardownChained$1.evaluate(TestRuleSetupTeardownChained.java:50)
	at org.apache.lucene.util.TestRuleFieldCacheSanity$1.evaluate(TestRuleFieldCacheSanity.java:51)
	at org.apache.lucene.util.AbstractBeforeAfterRule$1.evaluate(AbstractBeforeAfterRule.java:46)
	at com.carrotsearch.randomizedtesting.rules.SystemPropertiesInvariantRule$1.evaluate(SystemPropertiesInvariantRule.java:55)
	at org.apache.lucene.util.TestRuleThreadAndTestName$1.evaluate(TestRuleThreadAndTestName.java:49)
	at org.apache.lucene.util.TestRuleIgnoreAfterMaxFailures$1.evaluate(TestRuleIgnoreAfterMaxFailures.java:70)
	at org.apache.lucene.util.TestRuleMarkFailure$1.evaluate(TestRuleMarkFailure.java:48)
	at com.carrotsearch.randomizedtesting.rules.StatementAdapter.evaluate(StatementAdapter.java:36)
	at com.carrotsearch.randomizedtesting.ThreadLeakControl$StatementRunner.run(ThreadLeakControl.java:358)
	at com.carrotsearch.randomizedtesting.ThreadLeakControl.forkTimeoutingTask(ThreadLeakControl.java:782)
	at com.carrotsearch.randomizedtesting.ThreadLeakControl$3.evaluate(ThreadLeakControl.java:442)
	at com.carrotsearch.randomizedtesting.RandomizedRunner.runSingleTest(RandomizedRunner.java:746)
	at com.carrotsearch.randomizedtesting.RandomizedRunner$3.evaluate(RandomizedRunner.java:648)
	at com.carrotsearch.randomizedtesting.RandomizedRunner$4.evaluate(RandomizedRunner.java:682)
	at com.carrotsearch.randomizedtesting.RandomizedRunner$5.evaluate(RandomizedRunner.java:693)
	at com.carrotsearch.randomizedtesting.rules.StatementAdapter.evaluate(StatementAdapter.java:36)
	at com.carrotsearch.randomizedtesting.rules.SystemPropertiesRestoreRule$1.evaluate(SystemPropertiesRestoreRule.java:53)
	at org.apache.lucene.util.AbstractBeforeAfterRule$1.evaluate(AbstractBeforeAfterRule.java:46)
	at org.apache.lucene.util.TestRuleStoreClassName$1.evaluate(TestRuleStoreClassName.java:42)
	at com.carrotsearch.randomizedtesting.rules.SystemPropertiesInvariantRule$1.evaluate(SystemPropertiesInvariantRule.java:55)
	at com.carrotsearch.randomizedtesting.rules.NoShadowingOrOverridesOnMethodsRule$1.evaluate(NoShadowingOrOverridesOnMethodsRule.java:39)
	at com.carrotsearch.randomizedtesting.rules.NoShadowingOrOverridesOnMethodsRule$1.evaluate(NoShadowingOrOverridesOnMethodsRule.java:39)
	at com.carrotsearch.randomizedtesting.rules.StatementAdapter.evaluate(StatementAdapter.java:36)
	at org.apache.lucene.util.TestRuleAssertionsRequired$1.evaluate(TestRuleAssertionsRequired.java:43)
	at org.apache.lucene.util.TestRuleMarkFailure$1.evaluate(TestRuleMarkFailure.java:48)
	at org.apache.lucene.util.TestRuleIgnoreAfterMaxFailures$1.evaluate(TestRuleIgnoreAfterMaxFailures.java:70)
	at org.apache.lucene.util.TestRuleIgnoreTestSuites$1.evaluate(TestRuleIgnoreTestSuites.java:55)
	at com.carrotsearch.randomizedtesting.rules.StatementAdapter.evaluate(StatementAdapter.java:36)
	at com.carrotsearch.randomizedtesting.ThreadLeakControl$StatementRunner.run(ThreadLeakControl.java:358)
	at java.lang.Thread.run(Thread.java:744)


FAILED:  org.apache.solr.analytics.expression.ExpressionTest.addTest

Error Message:
Caught exception in getStatResult, xPath = /response/lst[@name='stats']/lst[@name='ar']/double[@name='sum']  raw data: <?xml version="1.0" encoding="UTF-8"?> <response>  <lst name="responseHeader">   <int name="status">0</int>   <int name="QTime">11</int> </lst> <result name="response" numFound="100" start="0"> </result> <lst name="stats">   <lst name="stats_fields"/> </lst> <lst name="stats">   <lst name="cnr">     <double name="c10">10.0</double>     <double name="c8">8.0</double>   </lst>   <lst name="dmr">     <str name="cma">+2MONTHS</str>     <str name="cme">+2YEARS</str>     <date name="dmma">1812-02-29T23:59:59Z</date>     <date name="dmme">1807-12-31T23:59:59Z</date>     <date name="max">1811-12-31T23:59:59Z</date>     <date name="median">1805-12-31T23:59:59Z</date>   </lst>   <lst name="csr">     <str name="cs1">this is the first</str>     <str name="cs2">this is the second</str>     <str name="cs3">this is the third</str>   </lst>   <lst name="cr">     <str name="ccmax">this is the secondstr9</str>     <str name="ccmin">this is the firststr0</str>     <str name="csmax">this is the second</str>     <str name="csmin">this is the first</str>     <str name="max">str9</str>     <str name="min">str0</str>   </lst>   <lst name="pr">     <long name="count">100</long>     <null name="mc"/>     <null name="mean"/>     <null name="su"/>     <null name="sum"/>     <null name="unique"/>   </lst>   <lst name="nr">     <double name="c">-100.0</double>     <long name="count">100</long>     <null name="s"/>     <null name="sum"/>   </lst>   <lst name="mr">     <long name="count">100</long>     <null name="mcm"/>     <null name="mean"/>     <null name="median"/>     <null name="su"/>     <null name="sum"/>     <null name="unique"/>   </lst>   <lst name="dr">     <long name="count">100</long>     <null name="mc"/>     <null name="mean"/>     <null name="su"/>     <null name="sum"/>     <null name="unique"/>   </lst>   <lst name="ar">     <long name="count">100</long>     <null name="mcm"/>     <null name="mean"/>     <null name="median"/>     <null name="su"/>     <null name="sum"/>     <null name="unique"/>   </lst>   <lst name="rr">     <str name="max">str9</str>     <str name="min">str0</str>     <str name="rmax">9rts</str>     <str name="rmin">0rts</str>   </lst>   <lst name="avr">     <double name="c">100.0</double>     <long name="count">100</long>     <null name="s"/>     <null name="sum"/>   </lst>   <lst name="cdr">     <date name="cd1">1800-12-31T23:59:59Z</date>     <date name="cd2">1804-06-30T23:59:59Z</date>     <str name="cs1">1800-12-31T23:59:59Z</str>     <str name="cs2">1804-06-30T23:59:59Z</str>   </lst> </lst> </response> 

Stack Trace:
java.lang.AssertionError: Caught exception in getStatResult, xPath = /response/lst[@name='stats']/lst[@name='ar']/double[@name='sum'] 
raw data: <?xml version="1.0" encoding="UTF-8"?>
<response>

<lst name="responseHeader">
  <int name="status">0</int>
  <int name="QTime">11</int>
</lst>
<result name="response" numFound="100" start="0">
</result>
<lst name="stats">
  <lst name="stats_fields"/>
</lst>
<lst name="stats">
  <lst name="cnr">
    <double name="c10">10.0</double>
    <double name="c8">8.0</double>
  </lst>
  <lst name="dmr">
    <str name="cma">+2MONTHS</str>
    <str name="cme">+2YEARS</str>
    <date name="dmma">1812-02-29T23:59:59Z</date>
    <date name="dmme">1807-12-31T23:59:59Z</date>
    <date name="max">1811-12-31T23:59:59Z</date>
    <date name="median">1805-12-31T23:59:59Z</date>
  </lst>
  <lst name="csr">
    <str name="cs1">this is the first</str>
    <str name="cs2">this is the second</str>
    <str name="cs3">this is the third</str>
  </lst>
  <lst name="cr">
    <str name="ccmax">this is the secondstr9</str>
    <str name="ccmin">this is the firststr0</str>
    <str name="csmax">this is the second</str>
    <str name="csmin">this is the first</str>
    <str name="max">str9</str>
    <str name="min">str0</str>
  </lst>
  <lst name="pr">
    <long name="count">100</long>
    <null name="mc"/>
    <null name="mean"/>
    <null name="su"/>
    <null name="sum"/>
    <null name="unique"/>
  </lst>
  <lst name="nr">
    <double name="c">-100.0</double>
    <long name="count">100</long>
    <null name="s"/>
    <null name="sum"/>
  </lst>
  <lst name="mr">
    <long name="count">100</long>
    <null name="mcm"/>
    <null name="mean"/>
    <null name="median"/>
    <null name="su"/>
    <null name="sum"/>
    <null name="unique"/>
  </lst>
  <lst name="dr">
    <long name="count">100</long>
    <null name="mc"/>
    <null name="mean"/>
    <null name="su"/>
    <null name="sum"/>
    <null name="unique"/>
  </lst>
  <lst name="ar">
    <long name="count">100</long>
    <null name="mcm"/>
    <null name="mean"/>
    <null name="median"/>
    <null name="su"/>
    <null name="sum"/>
    <null name="unique"/>
  </lst>
  <lst name="rr">
    <str name="max">str9</str>
    <str name="min">str0</str>
    <str name="rmax">9rts</str>
    <str name="rmin">0rts</str>
  </lst>
  <lst name="avr">
    <double name="c">100.0</double>
    <long name="count">100</long>
    <null name="s"/>
    <null name="sum"/>
  </lst>
  <lst name="cdr">
    <date name="cd1">1800-12-31T23:59:59Z</date>
    <date name="cd2">1804-06-30T23:59:59Z</date>
    <str name="cs1">1800-12-31T23:59:59Z</str>
    <str name="cs2">1804-06-30T23:59:59Z</str>
  </lst>
</lst>
</response>

	at __randomizedtesting.SeedInfo.seed([62228E17E07C23F8:940E23C9A1B324BF]:0)
	at org.junit.Assert.fail(Assert.java:93)
	at org.apache.solr.analytics.AbstractAnalyticsStatsTest.getStatResult(AbstractAnalyticsStatsTest.java:113)
	at org.apache.solr.analytics.expression.ExpressionTest.addTest(ExpressionTest.java:78)
	at sun.reflect.NativeMethodAccessorImpl.invoke0(Native Method)
	at sun.reflect.NativeMethodAccessorImpl.invoke(NativeMethodAccessorImpl.java:57)
	at sun.reflect.DelegatingMethodAccessorImpl.invoke(DelegatingMethodAccessorImpl.java:43)
	at java.lang.reflect.Method.invoke(Method.java:606)
	at com.carrotsearch.randomizedtesting.RandomizedRunner.invoke(RandomizedRunner.java:1559)
	at com.carrotsearch.randomizedtesting.RandomizedRunner.access$600(RandomizedRunner.java:79)
	at com.carrotsearch.randomizedtesting.RandomizedRunner$6.evaluate(RandomizedRunner.java:737)
	at com.carrotsearch.randomizedtesting.RandomizedRunner$7.evaluate(RandomizedRunner.java:773)
	at com.carrotsearch.randomizedtesting.RandomizedRunner$8.evaluate(RandomizedRunner.java:787)
	at com.carrotsearch.randomizedtesting.rules.SystemPropertiesRestoreRule$1.evaluate(SystemPropertiesRestoreRule.java:53)
	at org.apache.lucene.util.TestRuleSetupTeardownChained$1.evaluate(TestRuleSetupTeardownChained.java:50)
	at org.apache.lucene.util.TestRuleFieldCacheSanity$1.evaluate(TestRuleFieldCacheSanity.java:51)
	at org.apache.lucene.util.AbstractBeforeAfterRule$1.evaluate(AbstractBeforeAfterRule.java:46)
	at com.carrotsearch.randomizedtesting.rules.SystemPropertiesInvariantRule$1.evaluate(SystemPropertiesInvariantRule.java:55)
	at org.apache.lucene.util.TestRuleThreadAndTestName$1.evaluate(TestRuleThreadAndTestName.java:49)
	at org.apache.lucene.util.TestRuleIgnoreAfterMaxFailures$1.evaluate(TestRuleIgnoreAfterMaxFailures.java:70)
	at org.apache.lucene.util.TestRuleMarkFailure$1.evaluate(TestRuleMarkFailure.java:48)
	at com.carrotsearch.randomizedtesting.rules.StatementAdapter.evaluate(StatementAdapter.java:36)
	at com.carrotsearch.randomizedtesting.ThreadLeakControl$StatementRunner.run(ThreadLeakControl.java:358)
	at com.carrotsearch.randomizedtesting.ThreadLeakControl.forkTimeoutingTask(ThreadLeakControl.java:782)
	at com.carrotsearch.randomizedtesting.ThreadLeakControl$3.evaluate(ThreadLeakControl.java:442)
	at com.carrotsearch.randomizedtesting.RandomizedRunner.runSingleTest(RandomizedRunner.java:746)
	at com.carrotsearch.randomizedtesting.RandomizedRunner$3.evaluate(RandomizedRunner.java:648)
	at com.carrotsearch.randomizedtesting.RandomizedRunner$4.evaluate(RandomizedRunner.java:682)
	at com.carrotsearch.randomizedtesting.RandomizedRunner$5.evaluate(RandomizedRunner.java:693)
	at com.carrotsearch.randomizedtesting.rules.StatementAdapter.evaluate(StatementAdapter.java:36)
	at com.carrotsearch.randomizedtesting.rules.SystemPropertiesRestoreRule$1.evaluate(SystemPropertiesRestoreRule.java:53)
	at org.apache.lucene.util.AbstractBeforeAfterRule$1.evaluate(AbstractBeforeAfterRule.java:46)
	at org.apache.lucene.util.TestRuleStoreClassName$1.evaluate(TestRuleStoreClassName.java:42)
	at com.carrotsearch.randomizedtesting.rules.SystemPropertiesInvariantRule$1.evaluate(SystemPropertiesInvariantRule.java:55)
	at com.carrotsearch.randomizedtesting.rules.NoShadowingOrOverridesOnMethodsRule$1.evaluate(NoShadowingOrOverridesOnMethodsRule.java:39)
	at com.carrotsearch.randomizedtesting.rules.NoShadowingOrOverridesOnMethodsRule$1.evaluate(NoShadowingOrOverridesOnMethodsRule.java:39)
	at com.carrotsearch.randomizedtesting.rules.StatementAdapter.evaluate(StatementAdapter.java:36)
	at org.apache.lucene.util.TestRuleAssertionsRequired$1.evaluate(TestRuleAssertionsRequired.java:43)
	at org.apache.lucene.util.TestRuleMarkFailure$1.evaluate(TestRuleMarkFailure.java:48)
	at org.apache.lucene.util.TestRuleIgnoreAfterMaxFailures$1.evaluate(TestRuleIgnoreAfterMaxFailures.java:70)
	at org.apache.lucene.util.TestRuleIgnoreTestSuites$1.evaluate(TestRuleIgnoreTestSuites.java:55)
	at com.carrotsearch.randomizedtesting.rules.StatementAdapter.evaluate(StatementAdapter.java:36)
	at com.carrotsearch.randomizedtesting.ThreadLeakControl$StatementRunner.run(ThreadLeakControl.java:358)
	at java.lang.Thread.run(Thread.java:744)




Build Log:
[...truncated 19431 lines...]
   [junit4] Suite: org.apache.solr.analytics.expression.ExpressionTest
   [junit4]   2> 3187820 T8034 oas.SolrTestCaseJ4.initCore ####initCore
   [junit4]   2> Creating dataDir: /Users/jenkins/workspace/Lucene-Solr-trunk-MacOSX/solr/build/solr-core/test/J0/./solrtest-ExpressionTest-1385860350043
   [junit4]   2> 3187822 T8034 oasc.SolrResourceLoader.<init> new SolrResourceLoader for directory: '/Users/jenkins/workspace/Lucene-Solr-trunk-MacOSX/solr/build/solr-core/test-files/solr/collection1/'
   [junit4]   2> 3187823 T8034 oasc.SolrResourceLoader.replaceClassLoader Adding 'file:/Users/jenkins/workspace/Lucene-Solr-trunk-MacOSX/solr/build/solr-core/test-files/solr/collection1/lib/classes/' to classloader
   [junit4]   2> 3187824 T8034 oasc.SolrResourceLoader.replaceClassLoader Adding 'file:/Users/jenkins/workspace/Lucene-Solr-trunk-MacOSX/solr/build/solr-core/test-files/solr/collection1/lib/README' to classloader
   [junit4]   2> 3187906 T8034 oasc.SolrConfig.<init> Using Lucene MatchVersion: LUCENE_50
   [junit4]   2> 3187952 T8034 oasc.SolrConfig.<init> Loaded SolrConfig: solrconfig-basic.xml
   [junit4]   2> 3187953 T8034 oass.IndexSchema.readSchema Reading Solr Schema from schema-analytics.xml
   [junit4]   2> 3187961 T8034 oass.IndexSchema.readSchema [null] Schema name=schema-docValues
   [junit4]   2> 3188034 T8034 oass.IndexSchema.readSchema unique key field: id
   [junit4]   2> 3188037 T8034 oasc.SolrResourceLoader.locateSolrHome JNDI not configured for solr (NoInitialContextEx)
   [junit4]   2> 3188038 T8034 oasc.SolrResourceLoader.locateSolrHome using system property solr.solr.home: /Users/jenkins/workspace/Lucene-Solr-trunk-MacOSX/solr/build/solr-core/test-files/solr
   [junit4]   2> 3188038 T8034 oasc.SolrResourceLoader.<init> new SolrResourceLoader for directory: '/Users/jenkins/workspace/Lucene-Solr-trunk-MacOSX/solr/build/solr-core/test-files/solr/'
   [junit4]   2> 3188055 T8034 oasc.SolrResourceLoader.locateSolrHome JNDI not configured for solr (NoInitialContextEx)
   [junit4]   2> 3188056 T8034 oasc.SolrResourceLoader.locateSolrHome using system property solr.solr.home: /Users/jenkins/workspace/Lucene-Solr-trunk-MacOSX/solr/build/solr-core/test-files/solr
   [junit4]   2> 3188056 T8034 oasc.SolrResourceLoader.<init> new SolrResourceLoader for deduced Solr Home: '/Users/jenkins/workspace/Lucene-Solr-trunk-MacOSX/solr/build/solr-core/test-files/solr/'
   [junit4]   2> 3188124 T8034 oasc.CoreContainer.<init> New CoreContainer 1866277221
   [junit4]   2> 3188125 T8034 oasc.CoreContainer.load Loading cores into CoreContainer [instanceDir=/Users/jenkins/workspace/Lucene-Solr-trunk-MacOSX/solr/build/solr-core/test-files/solr/]
   [junit4]   2> 3188126 T8034 oashc.HttpShardHandlerFactory.getParameter Setting socketTimeout to: 0
   [junit4]   2> 3188126 T8034 oashc.HttpShardHandlerFactory.getParameter Setting urlScheme to: http://
   [junit4]   2> 3188126 T8034 oashc.HttpShardHandlerFactory.getParameter Setting connTimeout to: 0
   [junit4]   2> 3188127 T8034 oashc.HttpShardHandlerFactory.getParameter Setting maxConnectionsPerHost to: 20
   [junit4]   2> 3188127 T8034 oashc.HttpShardHandlerFactory.getParameter Setting corePoolSize to: 0
   [junit4]   2> 3188127 T8034 oashc.HttpShardHandlerFactory.getParameter Setting maximumPoolSize to: 2147483647
   [junit4]   2> 3188127 T8034 oashc.HttpShardHandlerFactory.getParameter Setting maxThreadIdleTime to: 5
   [junit4]   2> 3188128 T8034 oashc.HttpShardHandlerFactory.getParameter Setting sizeOfQueue to: -1
   [junit4]   2> 3188128 T8034 oashc.HttpShardHandlerFactory.getParameter Setting fairnessPolicy to: false
   [junit4]   2> 3188143 T8034 oasl.LogWatcher.createWatcher SLF4J impl is org.slf4j.impl.Log4jLoggerFactory
   [junit4]   2> 3188143 T8034 oasl.LogWatcher.newRegisteredLogWatcher Registering Log Listener [Log4j (org.slf4j.impl.Log4jLoggerFactory)]
   [junit4]   2> 3188143 T8034 oasc.CoreContainer.load Host Name: 
   [junit4]   2> 3188153 T8035 oasc.CoreContainer.create Creating SolrCore 'collection1' using instanceDir: /Users/jenkins/workspace/Lucene-Solr-trunk-MacOSX/solr/build/solr-core/test-files/solr/collection1
   [junit4]   2> 3188155 T8035 oasc.SolrResourceLoader.<init> new SolrResourceLoader for directory: '/Users/jenkins/workspace/Lucene-Solr-trunk-MacOSX/solr/build/solr-core/test-files/solr/collection1/'
   [junit4]   2> 3188156 T8035 oasc.SolrResourceLoader.replaceClassLoader Adding 'file:/Users/jenkins/workspace/Lucene-Solr-trunk-MacOSX/solr/build/solr-core/test-files/solr/collection1/lib/classes/' to classloader
   [junit4]   2> 3188157 T8035 oasc.SolrResourceLoader.replaceClassLoader Adding 'file:/Users/jenkins/workspace/Lucene-Solr-trunk-MacOSX/solr/build/solr-core/test-files/solr/collection1/lib/README' to classloader
   [junit4]   2> 3188239 T8035 oasc.SolrConfig.<init> Using Lucene MatchVersion: LUCENE_50
   [junit4]   2> 3188289 T8035 oasc.SolrConfig.<init> Loaded SolrConfig: solrconfig-basic.xml
   [junit4]   2> 3188290 T8035 oass.IndexSchema.readSchema Reading Solr Schema from schema-analytics.xml
   [junit4]   2> 3188353 T8035 oass.IndexSchema.readSchema [collection1] Schema name=schema-docValues
   [junit4]   2> 3188444 T8035 oass.IndexSchema.readSchema unique key field: id
   [junit4]   2> 3188446 T8035 oasc.SolrCore.initDirectoryFactory org.apache.solr.core.MockDirectoryFactory
   [junit4]   2> 3188447 T8035 oasc.SolrCore.<init> [collection1] Opening new SolrCore at /Users/jenkins/workspace/Lucene-Solr-trunk-MacOSX/solr/build/solr-core/test-files/solr/collection1/, dataDir=/Users/jenkins/workspace/Lucene-Solr-trunk-MacOSX/solr/build/solr-core/test/J0/./solrtest-ExpressionTest-1385860350043/
   [junit4]   2> 3188447 T8035 oasc.SolrCore.<init> JMX monitoring not detected for core: collection1
   [junit4]   2> 3188448 T8035 oasc.CachingDirectoryFactory.get return new directory for /Users/jenkins/workspace/Lucene-Solr-trunk-MacOSX/solr/build/solr-core/test/J0/./solrtest-ExpressionTest-1385860350043
   [junit4]   2> 3188448 T8035 oasc.SolrCore.getNewIndexDir New index directory detected: old=null new=/Users/jenkins/workspace/Lucene-Solr-trunk-MacOSX/solr/build/solr-core/test/J0/./solrtest-ExpressionTest-1385860350043/index/
   [junit4]   2> 3188448 T8035 oasc.SolrCore.initIndex WARN [collection1] Solr index directory '/Users/jenkins/workspace/Lucene-Solr-trunk-MacOSX/solr/build/solr-core/test/J0/./solrtest-ExpressionTest-1385860350043/index' doesn't exist. Creating new index...
   [junit4]   2> 3188449 T8035 oasc.CachingDirectoryFactory.get return new directory for /Users/jenkins/workspace/Lucene-Solr-trunk-MacOSX/solr/build/solr-core/test/J0/./solrtest-ExpressionTest-1385860350043/index
   [junit4]   2> 3188449 T8035 oasu.RandomMergePolicy.<init> RandomMergePolicy wrapping class org.apache.lucene.index.LogByteSizeMergePolicy: [LogByteSizeMergePolicy: minMergeSize=1677721, mergeFactor=22, maxMergeSize=2147483648, maxMergeSizeForForcedMerge=9223372036854775807, calibrateSizeByDeletes=false, maxMergeDocs=2147483647, maxCFSSegmentSizeMB=8.796093022207999E12, noCFSRatio=0.7144233913346834]
   [junit4]   2> 3188451 T8035 oasc.SolrDeletionPolicy.onCommit SolrDeletionPolicy.onCommit: commits: num=1
   [junit4]   2> 		commit{dir=MockDirectoryWrapper(org.apache.lucene.store.RAMDirectory@72da31df lockFactory=org.apache.lucene.store.SingleInstanceLockFactory@11a78e7a),segFN=segments_1,generation=1}
   [junit4]   2> 3188451 T8035 oasc.SolrDeletionPolicy.updateCommits newest commit generation = 1
   [junit4]   2> 3188453 T8035 oasc.SolrCore.loadUpdateProcessorChains no updateRequestProcessorChain defined as default, creating implicit default
   [junit4]   2> 3188453 T8035 oasc.RequestHandlers.initHandlersFromConfig created standard: solr.StandardRequestHandler
   [junit4]   2> 3188454 T8035 oasc.RequestHandlers.initHandlersFromConfig created /update: solr.UpdateRequestHandler
   [junit4]   2> 3188464 T8035 oashl.XMLLoader.init xsltCacheLifetimeSeconds=60
   [junit4]   2> 3188475 T8035 oasu.CommitTracker.<init> Hard AutoCommit: disabled
   [junit4]   2> 3188475 T8035 oasu.CommitTracker.<init> Soft AutoCommit: disabled
   [junit4]   2> 3188476 T8035 oasu.RandomMergePolicy.<init> RandomMergePolicy wrapping class org.apache.lucene.index.TieredMergePolicy: [TieredMergePolicy: maxMergeAtOnce=43, maxMergeAtOnceExplicit=20, maxMergedSegmentMB=33.212890625, floorSegmentMB=0.66015625, forceMergeDeletesPctAllowed=21.671038638285854, segmentsPerTier=33.0, maxCFSSegmentSizeMB=8.796093022207999E12, noCFSRatio=0.376069467104278
   [junit4]   2> 3188477 T8035 oasc.SolrDeletionPolicy.onInit SolrDeletionPolicy.onInit: commits: num=1
   [junit4]   2> 		commit{dir=MockDirectoryWrapper(org.apache.lucene.store.RAMDirectory@72da31df lockFactory=org.apache.lucene.store.SingleInstanceLockFactory@11a78e7a),segFN=segments_1,generation=1}
   [junit4]   2> 3188477 T8035 oasc.SolrDeletionPolicy.updateCommits newest commit generation = 1
   [junit4]   2> 3188477 T8035 oass.SolrIndexSearcher.<init> Opening Searcher@1f8d46c3 main
   [junit4]   2> 3188478 T8035 oasc.CoreContainer.registerCore registering core: collection1
   [junit4]   2> 3188478 T8036 oasc.SolrCore.registerSearcher [collection1] Registered new searcher Searcher@1f8d46c3 main{StandardDirectoryReader(segments_1:1:nrt)}
   [junit4]   2> 3188482 T8034 oas.SolrTestCaseJ4.initCore ####initCore end
   [junit4]   2> ASYNC  NEW_CORE C1875 name=collection1 org.apache.solr.core.SolrCore@2983713c
   [junit4]   2> 3188491 T8034 C1875 oasu.DirectUpdateHandler2.deleteAll [collection1] REMOVING ALL DOCUMENTS FROM INDEX
   [junit4]   2> 3188492 T8034 C1875 oasup.LogUpdateProcessor.finish [collection1] webapp=null path=null params={} {deleteByQuery=*:*} 0 1
   [junit4]   2> 3188500 T8034 C1875 oasup.LogUpdateProcessor.finish [collection1] webapp=null path=null params={} {add=[10000]} 0 1
   [junit4]   2> 3188510 T8034 C1875 oasup.LogUpdateProcessor.finish [collection1] webapp=null path=null params={} {add=[10001]} 0 0
   [junit4]   2> 3188518 T8034 C1875 oasup.LogUpdateProcessor.finish [collection1] webapp=null path=null params={} {add=[10002]} 0 1
   [junit4]   2> 3188526 T8034 C1875 oasup.LogUpdateProcessor.finish [collection1] webapp=null path=null params={} {add=[10003]} 0 0
   [junit4]   2> 3188536 T8034 C1875 oasup.LogUpdateProcessor.finish [collection1] webapp=null path=null params={} {add=[10004]} 0 0
   [junit4]   2> 3188546 T8034 C1875 oasup.LogUpdateProcessor.finish [collection1] webapp=null path=null params={} {add=[10005]} 0 0
   [junit4]   2> 3188557 T8034 C1875 oasup.LogUpdateProcessor.finish [collection1] webapp=null path=null params={} {add=[10006]} 0 1
   [junit4]   2> 3188568 T8034 C1875 oasup.LogUpdateProcessor.finish [collection1] webapp=null path=null params={} {add=[10007]} 0 1
   [junit4]   2> 3188580 T8034 C1875 oasup.LogUpdateProcessor.finish [collection1] webapp=null path=null params={} {add=[10008]} 0 0
   [junit4]   2> 3188588 T8034 C1875 oasup.LogUpdateProcessor.finish [collection1] webapp=null path=null params={} {add=[10009]} 0 0
   [junit4]   2> 3188596 T8034 C1875 oasup.LogUpdateProcessor.finish [collection1] webapp=null path=null params={} {add=[100010]} 0 0
   [junit4]   2> 3188604 T8034 C1875 oasup.LogUpdateProcessor.finish [collection1] webapp=null path=null params={} {add=[100011]} 0 0
   [junit4]   2> 3188613 T8034 C1875 oasup.LogUpdateProcessor.finish [collection1] webapp=null path=null params={} {add=[100012]} 0 1
   [junit4]   2> 3188621 T8034 C1875 oasup.LogUpdateProcessor.finish [collection1] webapp=null path=null params={} {add=[100013]} 0 1
   [junit4]   2> 3188629 T8034 C1875 oasup.LogUpdateProcessor.finish [collection1] webapp=null path=null params={} {add=[100014]} 0 1
   [junit4]   2> 3188637 T8034 C1875 oasup.LogUpdateProcessor.finish [collection1] webapp=null path=null params={} {add=[100015]} 0 1
   [junit4]   2> 3188645 T8034 C1875 oasup.LogUpdateProcessor.finish [collection1] webapp=null path=null params={} {add=[100016]} 0 1
   [junit4]   2> 3188653 T8034 C1875 oasup.LogUpdateProcessor.finish [collection1] webapp=null path=null params={} {add=[100017]} 0 0
   [junit4]   2> 3188661 T8034 C1875 oasup.LogUpdateProcessor.finish [collection1] webapp=null path=null params={} {add=[100018]} 0 0
   [junit4]   2> 3188668 T8034 C1875 oasup.LogUpdateProcessor.finish [collection1] webapp=null path=null params={} {add=[100019]} 0 0
   [junit4]   2> 3188677 T8034 C1875 oasup.LogUpdateProcessor.finish [collection1] webapp=null path=null params={} {add=[100020]} 0 1
   [junit4]   2> 3188684 T8034 C1875 oasup.LogUpdateProcessor.finish [collection1] webapp=null path=null params={} {add=[100021]} 0 1
   [junit4]   2> 3188691 T8034 C1875 oasup.LogUpdateProcessor.finish [collection1] webapp=null path=null params={} {add=[100022]} 0 0
   [junit4]   2> 3188699 T8034 C1875 oasup.LogUpdateProcessor.finish [collection1] webapp=null path=null params={} {add=[100023]} 0 0
   [junit4]   2> 3188708 T8034 C1875 oasup.LogUpdateProcessor.finish [collection1] webapp=null path=null params={} {add=[100024]} 0 0
   [junit4]   2> 3188716 T8034 C1875 oasup.LogUpdateProcessor.finish [collection1] webapp=null path=null params={} {add=[100025]} 0 1
   [junit4]   2> 3188724 T8034 C1875 oasup.LogUpdateProcessor.finish [collection1] webapp=null path=null params={} {add=[100026]} 0 0
   [junit4]   2> 3188731 T8034 C1875 oasup.LogUpdateProcessor.finish [collection1] webapp=null path=null params={} {add=[100027]} 0 0
   [junit4]   2> 3188739 T8034 C1875 oasup.LogUpdateProcessor.finish [collection1] webapp=null path=null params={} {add=[100028]} 0 0
   [junit4]   2> 3188748 T8034 C1875 oasup.LogUpdateProcessor.finish [collection1] webapp=null path=null params={} {add=[100029]} 0 1
   [junit4]   2> 3188756 T8034 C1875 oasup.LogUpdateProcessor.finish [collection1] webapp=null path=null params={} {add=[100030]} 0 0
   [junit4]   2> 3188764 T8034 C1875 oasup.LogUpdateProcessor.finish [collection1] webapp=null path=null params={} {add=[100031]} 0 0
   [junit4]   2> 3188772 T8034 C1875 oasup.LogUpdateProcessor.finish [collection1] webapp=null path=null params={} {add=[100032]} 0 0
   [junit4]   2> 3188780 T8034 C1875 oasup.LogUpdateProcessor.finish [collection1] webapp=null path=null params={} {add=[100033]} 0 0
   [junit4]   2> 3188788 T8034 C1875 oasup.LogUpdateProcessor.finish [collection1] webapp=null path=null params={} {add=[100034]} 0 0
   [junit4]   2> 3188798 T8034 C1875 oasup.LogUpdateProcessor.finish [collection1] webapp=null path=null params={} {add=[100035]} 0 1
   [junit4]   2> 3188805 T8034 C1875 oasup.LogUpdateProcessor.finish [collection1] webapp=null path=null params={} {add=[100036]} 0 0
   [junit4]   2> 3188813 T8034 C1875 oasup.LogUpdateProcessor.finish [collection1] webapp=null path=null params={} {add=[100037]} 0 0
   [junit4]   2> 3188821 T8034 C1875 oasup.LogUpdateProcessor.finish [collection1] webapp=null path=null params={} {add=[100038]} 0 1
   [junit4]   2> 3188830 T8034 C1875 oasup.LogUpdateProcessor.finish [collection1] webapp=null path=null params={} {add=[100039]} 0 1
   [junit4]   2> 3188838 T8034 C1875 oasup.LogUpdateProcessor.finish [collection1] webapp=null path=null params={} {add=[100040]} 0 1
   [junit4]   2> 3188846 T8034 C1875 oasup.LogUpdateProcessor.finish [collection1] webapp=null path=null params={} {add=[100041]} 0 1
   [junit4]   2> 3188854 T8034 C1875 oasup.LogUpdateProcessor.finish [collection1] webapp=null path=null params={} {add=[100042]} 0 1
   [junit4]   2> 3188862 T8034 C1875 oasup.LogUpdateProcessor.finish [collection1] webapp=null path=null params={} {add=[100043]} 0 1
   [junit4]   2> 3188870 T8034 C1875 oasup.LogUpdateProcessor.finish [collection1] webapp=null path=null params={} {add=[100044]} 0 0
   [junit4]   2> 3188878 T8034 C1875 oasup.LogUpdateProcessor.finish [collection1] webapp=null path=null params={} {add=[100045]} 0 0
   [junit4]   2> 3188885 T8034 C1875 oasup.LogUpdateProcessor.finish [collection1] webapp=null path=null params={} {add=[100046]} 0 1
   [junit4]   2> 3188893 T8034 C1875 oasup.LogUpdateProcessor.finish [collection1] webapp=null path=null params={} {add=[100047]} 0 1
   [junit4]   2> 3188901 T8034 C1875 oasup.LogUpdateProcessor.finish [collection1] webapp=null path=null params={} {add=[100048]} 0 0
   [junit4]   2> 3188908 T8034 C1875 oasup.LogUpdateProcessor.finish [collection1] webapp=null path=null params={} {add=[100049]} 0 0
   [junit4]   2> 3188916 T8034 C1875 oasup.LogUpdateProcessor.finish [collection1] webapp=null path=null params={} {add=[100050]} 0 0
   [junit4]   2> 3188924 T8034 C1875 oasup.LogUpdateProcessor.finish [collection1] webapp=null path=null params={} {add=[100051]} 0 0
   [junit4]   2> 3188932 T8034 C1875 oasup.LogUpdateProcessor.finish [collection1] webapp=null path=null params={} {add=[100052]} 0 1
   [junit4]   2> 3188939 T8034 C1875 oasup.LogUpdateProcessor.finish [collection1] webapp=null path=null params={} {add=[100053]} 0 0
   [junit4]   2> 3188946 T8034 C1875 oasup.LogUpdateProcessor.finish [collection1] webapp=null path=null params={} {add=[100054]} 0 0
   [junit4]   2> 3188954 T8034 C1875 oasup.LogUpdateProcessor.finish [collection1] webapp=null path=null params={} {add=[100055]} 0 0
   [junit4]   2> 3188963 T8034 C1875 oasup.LogUpdateProcessor.finish [collection1] webapp=null path=null params={} {add=[100056]} 0 1
   [junit4]   2> 3188971 T8034 C1875 oasup.LogUpdateProcessor.finish [collection1] webapp=null path=null params={} {add=[100057]} 0 1
   [junit4]   2> 3188980 T8034 C1875 oasup.LogUpdateProcessor.finish [collection1] webapp=null path=null params={} {add=[100058]} 0 1
   [junit4]   2> 3188988 T8034 C1875 oasup.LogUpdateProcessor.finish [collection1] webapp=null path=null params={} {add=[100059]} 0 0
   [junit4]   2> 3188995 T8034 C1875 oasup.LogUpdateProcessor.finish [collection1] webapp=null path=null params={} {add=[100060]} 0 0
   [junit4]   2> 3189003 T8034 C1875 oasup.LogUpdateProcessor.finish [collection1] webapp=null path=null params={} {add=[100061]} 0 1
   [junit4]   2> 3189011 T8034 C1875 oasup.LogUpdateProcessor.finish [collection1] webapp=null path=null params={} {add=[100062]} 0 1
   [junit4]   2> 3189019 T8034 C1875 oasup.LogUpdateProcessor.finish [collection1] webapp=null path=null params={} {add=[100063]} 0 1
   [junit4]   2> 3189027 T8034 C1875 oasup.LogUpdateProcessor.finish [collection1] webapp=null path=null params={} {add=[100064]} 0 1
   [junit4]   2> 3189034 T8034 C1875 oasup.LogUpdateProcessor.finish [collection1] webapp=null path=null params={} {add=[100065]} 0 0
   [junit4]   2> 3189042 T8034 C1875 oasup.LogUpdateProcessor.finish [collection1] webapp=null path=null params={} {add=[100066]} 0 1
   [junit4]   2> 3189050 T8034 C1875 oasup.LogUpdateProcessor.finish [collection1] webapp=null path=null params={} {add=[100067]} 0 1
   [junit4]   2> 3189057 T8034 C1875 oasup.LogUpdateProcessor.finish [collection1] webapp=null path=null params={} {add=[100068]} 0 0
   [junit4]   2> 3189067 T8034 C1875 oasup.LogUpdateProcessor.finish [collection1] webapp=null path=null params={} {add=[100069]} 0 1
   [junit4]   2> 3189075 T8034 C1875 oasup.LogUpdateProcessor.finish [collection1] webapp=null path=null params={} {add=[100070]} 0 1
   [junit4]   2> 3189082 T8034 C1875 oasup.LogUpdateProcessor.finish [collection1] webapp=null path=null params={} {add=[100071]} 0 1
   [junit4]   2> 3189090 T8034 C1875 oasup.LogUpdateProcessor.finish [collection1] webapp=null path=null params={} {add=[100072]} 0 1
   [junit4]   2> 3189101 T8034 C1875 oasup.LogUpdateProcessor.finish [collection1] webapp=null path=null params={} {add=[100073]} 0 0
   [junit4]   2> 3189110 T8034 C1875 oasup.LogUpdateProcessor.finish [collection1] webapp=null path=null params={} {add=[100074]} 0 2
   [junit4]   2> 3189118 T8034 C1875 oasup.LogUpdateProcessor.finish [collection1] webapp=null path=null params={} {add=[100075]} 0 0
   [junit4]   2> 3189128 T8034 C1875 oasup.LogUpdateProcessor.finish [collection1] webapp=null path=null params={} {add=[100076]} 0 1
   [junit4]   2> 3189139 T8034 C1875 oasup.LogUpdateProcessor.finish [collection1] webapp=null path=null params={} {add=[100077]} 0 1
   [junit4]   2> 3189147 T8034 C1875 oasup.LogUpdateProcessor.finish [collection1] webapp=null path=null params={} {add=[100078]} 0 1
   [junit4]   2> 3189155 T8034 C1875 oasup.LogUpdateProcessor.finish [collection1] webapp=null path=null params={} {add=[100079]} 0 0
   [junit4]   2> 3189163 T8034 C1875 oasup.LogUpdateProcessor.finish [collection1] webapp=null path=null params={} {add=[100080]} 0 1
   [junit4]   2> 3189170 T8034 C1875 oasup.LogUpdateProcessor.finish [collection1] webapp=null path=null params={} {add=[100081]} 0 0
   [junit4]   2> 3189178 T8034 C1875 oasup.LogUpdateProcessor.finish [collection1] webapp=null path=null params={} {add=[100082]} 0 0
   [junit4]   2> 3189186 T8034 C1875 oasup.LogUpdateProcessor.finish [collection1] webapp=null path=null params={} {add=[100083]} 0 1
   [junit4]   2> 3189194 T8034 C1875 oasup.LogUpdateProcessor.finish [collection1] webapp=null path=null params={} {add=[100084]} 0 1
   [junit4]   2> 3189201 T8034 C1875 oasup.LogUpdateProcessor.finish [collection1] webapp=null path=null params={} {add=[100085]} 0 0
   [junit4]   2> 3189209 T8034 C1875 oasup.LogUpdateProcessor.finish [collection1] webapp=null path=null params={} {add=[100086]} 0 0
   [junit4]   2> ASYNC  NEW_CORE C1876 name=collection1 org.apache.solr.core.SolrCore@2983713c
   [junit4]   2> 3189258 T8034 C1876 oasup.LogUpdateProcessor.finish [collection1] webapp=null path=null params={} {add=[100087]} 0 1
   [junit4]   2> 3189270 T8034 C1876 oasup.LogUpdateProcessor.finish [collection1] webapp=null path=null params={} {add=[100088]} 0 1
   [junit4]   2> 3189283 T8034 C1876 oasup.LogUpdateProcessor.finish [collection1] webapp=null path=null params={} {add=[100089]} 0 1
   [junit4]   2> 3189295 T8034 C1876 oasup.LogUpdateProcessor.finish [collection1] webapp=null path=null params={} {add=[100090]} 0 1
   [junit4]   2> 3189306 T8034 C1876 oasup.LogUpdateProcessor.finish [collection1] webapp=null path=null params={} {add=[100091]} 0 0
   [junit4]   2> 3189318 T8034 C1876 oasup.LogUpdateProcessor.finish [collection1] webapp=null path=null params={} {add=[100092]} 0 1
   [junit4]   2> 3189329 T8034 C1876 oasup.LogUpdateProcessor.finish [collection1] webapp=null path=null params={} {add=[100093]} 0 0
   [junit4]   2> 3189340 T8034 C1876 oasup.LogUpdateProcessor.finish [collection1] webapp=null path=null params={} {add=[100094]} 0 0
   [junit4]   2> 3189348 T8034 C1876 oasup.LogUpdateProcessor.finish [collection1] webapp=null path=null params={} {add=[100095]} 0 1
   [junit4]   2> 3189356 T8034 C1876 oasup.LogUpdateProcessor.finish [collection1] webapp=null path=null params={} {add=[100096]} 0 0
   [junit4]   2> 3189363 T8034 C1876 oasup.LogUpdateProcessor.finish [collection1] webapp=null path=null params={} {add=[100097]} 0 0
   [junit4]   2> 3189371 T8034 C1876 oasup.LogUpdateProcessor.finish [collection1] webapp=null path=null params={} {add=[100098]} 0 1
   [junit4]   2> 3189378 T8034 C1876 oasup.LogUpdateProcessor.finish [collection1] webapp=null path=null params={} {add=[100099]} 0 0
   [junit4]   2> 3189385 T8034 C1876 oasu.DirectUpdateHandler2.commit start commit{,optimize=false,openSearcher=true,waitSearcher=true,expungeDeletes=false,softCommit=false,prepareCommit=false}
   [junit4]   2> 3189392 T8034 C1876 oasc.SolrDeletionPolicy.onCommit SolrDeletionPolicy.onCommit: commits: num=2
   [junit4]   2> 		commit{dir=MockDirectoryWrapper(org.apache.lucene.store.RAMDirectory@72da31df lockFactory=org.apache.lucene.store.SingleInstanceLockFactory@11a78e7a),segFN=segments_1,generation=1}
   [junit4]   2> 		commit{dir=MockDirectoryWrapper(org.apache.lucene.store.RAMDirectory@72da31df lockFactory=org.apache.lucene.store.SingleInstanceLockFactory@11a78e7a),segFN=segments_2,generation=2}
   [junit4]   2> 3189393 T8034 C1876 oasc.SolrDeletionPolicy.updateCommits newest commit generation = 2
   [junit4]   2> 3189395 T8034 C1876 oass.SolrIndexSearcher.<init> Opening Searcher@2559721b main
   [junit4]   2> 3189395 T8034 C1876 oasu.DirectUpdateHandler2.commit end_commit_flush
   [junit4]   2> 3189395 T8036 oasc.SolrCore.registerSearcher [collection1] Registered new searcher Searcher@2559721b main{StandardDirectoryReader(segments_2:4:nrt _0(5.0):c100)}
   [junit4]   2> 3189397 T8034 C1876 oasup.LogUpdateProcessor.finish [collection1] webapp=null path=null params={} {commit=} 0 12
   [junit4]   2> 3189414 T8034 C1876 oasc.SolrCore.execute [collection1] webapp=null path=null params={o.pr.s.su=pow(sum(int_id),unique(long_ld))&o.cdr.s.cs2=const_str(1804-06-30T23:59:59Z)&indent=true&o.ar.s.median=median(int_id)&o.dmr.s.cme=const_str(%2B2YEARS)&o.avr.s.sum=sum(int_id)&o.mr.s.su=mult(sum(int_id),unique(long_ld))&o.ar.s.su=add(sum(int_id),unique(long_ld))&o.rr.s.min=min(string_sd)&o.mr.s.mcm=mult(mean(int_id),count(long_ld),median(int_id))&o.csr.s.cs2=const_str(this+is+the+second)&q=*:*&o.avr.s.s=abs(neg(sum(int_id)))&o.dmr.s.cma=const_str(%2B2MONTHS)&o.dr.s.unique=unique(long_ld)&o.cr.s.csmax=const_str(this+is+the+second)&o.dr.s.su=div(sum(int_id),unique(long_ld))&o.cdr.s.cs1=const_str(1800-12-31T23:59:59Z)&o.cnr.s.c8=const_num(8)&o.mr.s.count=count(long_ld)&o.nr.s.sum=sum(int_id)&o.cr.s.min=min(string_sd)&o.dr.s.sum=sum(int_id)&stats=true&o.nr.s.s=neg(sum(int_id))&o.cr.s.ccmin=concat(const_str(this+is+the+first),min(string_sd))&o.ar.s.count=count(long_ld)&o.rr.s.max=max(string_sd)&o.pr.s.unique=unique(long_ld)&o.pr.s.mc=pow(mean(int_id),count(long_ld))&o.csr.s.cs1=const_str(this+is+the+first)&o.csr.s.cs3=const_str(this+is+the+third)&o.mr.s.sum=sum(int_id)&o.nr.s.c=neg(count(long_ld))&o.ar.s.sum=sum(int_id)&o.mr.s.median=median(int_id)&o.dmr.s.median=median(date_dtd)&o.cnr.s.c10=const_num(10)&o.mr.s.unique=unique(long_ld)&o.nr.s.count=count(long_ld)&o.avr.s.count=count(long_ld)&o.ar.s.unique=unique(long_ld)&o.cr.s.ccmax=concat(const_str(this+is+the+second),max(string_sd))&o.ar.s.mean=mean(int_id)&o.cdr.s.cd2=const_date(1804-06-30T23:59:59Z)&o.rr.s.rmin=rev(min(string_sd))&o.dr.s.count=count(long_ld)&o.ar.s.mcm=add(mean(int_id),count(long_ld),median(int_id))&o.rr.s.rmax=rev(max(string_sd))&o.dr.s.mc=div(mean(int_id),count(long_ld))&o.avr.s.c=abs(neg(count(long_ld)))&o.dr.s.mean=mean(int_id)&o.cr.s.csmin=const_str(this+is+the+first)&o.pr.s.mean=mean(int_id)&olap=true&o.dmr.s.dmme=date_math(median(date_dtd),const_str(%2B2YEARS))&o.pr.s.count=count(long_ld)&o.dmr.s.max=max(date_dtd)&rows=0&o.pr.s.sum=sum(int_id)&o.cdr.s.cd1=const_date(1800-12-31T23:59:59Z)&o.mr.s.mean=mean(int_id)&o.dmr.s.dmma=date_math(max(date_dtd),const_str(%2B2MONTHS))&o.cr.s.max=max(string_sd)} hits=100 status=0 QTime=11 
   [junit4]   2> 3189424 T8034 oas.SolrTestCaseJ4.setUp ###Starting dateMathTest
   [junit4]   2> 3189432 T8034 oas.SolrTestCaseJ4.tearDown ###Ending dateMathTest
   [junit4]   2> 3189439 T8034 oas.SolrTestCaseJ4.setUp ###Starting constantStringTest
   [junit4]   2> 3189443 T8034 oas.SolrTestCaseJ4.tearDown ###Ending constantStringTest
   [junit4]   2> 3189450 T8034 oas.SolrTestCaseJ4.setUp ###Starting negateTest
   [junit4]   2> 3189453 T8034 oas.SolrTestCaseJ4.tearDown ###Ending negateTest
   [junit4]   2> NOTE: reproduce with: ant test  -Dtestcase=ExpressionTest -Dtests.method=negateTest -Dtests.seed=62228E17E07C23F8 -Dtests.slow=true -Dtests.locale=en_ZA -Dtests.timezone=Europe/Rome -Dtests.file.encoding=US-ASCII
   [junit4] FAILURE 0.02s | ExpressionTest.negateTest <<<
   [junit4]    > Throwable #1: java.lang.AssertionError: Caught exception in getStatResult, xPath = /response/lst[@name='stats']/lst[@name='nr']/double[@name='sum'] 
   [junit4]    > raw data: <?xml version="1.0" encoding="UTF-8"?>
   [junit4]    > <response>
   [junit4]    > <lst name="responseHeader">
   [junit4]    >   <int name="status">0</int>
   [junit4]    >   <int name="QTime">11</int>
   [junit4]    > </lst>
   [junit4]    > <result name="response" numFound="100" start="0">
   [junit4]    > </result>
   [junit4]    > <lst name="stats">
   [junit4]    >   <lst name="stats_fields"/>
   [junit4]    > </lst>
   [junit4]    > <lst name="stats">
   [junit4]    >   <lst name="cnr">
   [junit4]    >     <double name="c10">10.0</double>
   [junit4]    >     <double name="c8">8.0</double>
   [junit4]    >   </lst>
   [junit4]    >   <lst name="dmr">
   [junit4]    >     <str name="cma">+2MONTHS</str>
   [junit4]    >     <str name="cme">+2YEARS</str>
   [junit4]    >     <date name="dmma">1812-02-29T23:59:59Z</date>
   [junit4]    >     <date name="dmme">1807-12-31T23:59:59Z</date>
   [junit4]    >     <date name="max">1811-12-31T23:59:59Z</date>
   [junit4]    >     <date name="median">1805-12-31T23:59:59Z</date>
   [junit4]    >   </lst>
   [junit4]    >   <lst name="csr">
   [junit4]    >     <str name="cs1">this is the first</str>
   [junit4]    >     <str name="cs2">this is the second</str>
   [junit4]    >     <str name="cs3">this is the third</str>
   [junit4]    >   </lst>
   [junit4]    >   <lst name="cr">
   [junit4]    >     <str name="ccmax">this is the secondstr9</str>
   [junit4]    >     <str name="ccmin">this is the firststr0</str>
   [junit4]    >     <str name="csmax">this is the second</str>
   [junit4]    >     <str name="csmin">this is the first</str>
   [junit4]    >     <str name="max">str9</str>
   [junit4]    >     <str name="min">str0</str>
   [junit4]    >   </lst>
   [junit4]    >   <lst name="pr">
   [junit4]    >     <long name="count">100</long>
   [junit4]    >     <null name="mc"/>
   [junit4]    >     <null name="mean"/>
   [junit4]    >     <null name="su"/>
   [junit4]    >     <null name="sum"/>
   [junit4]    >     <null name="unique"/>
   [junit4]    >   </lst>
   [junit4]    >   <lst name="nr">
   [junit4]    >     <double name="c">-100.0</double>
   [junit4]    >     <long name="count">100</long>
   [junit4]    >     <null name="s"/>
   [junit4]    >     <null name="sum"/>
   [junit4]    >   </lst>
   [junit4]    >   <lst name="mr">
   [junit4]    >     <long name="count">100</long>
   [junit4]    >     <null name="mcm"/>
   [junit4]    >     <null name="mean"/>
   [junit4]    >     <null name="median"/>
   [junit4]    >     <null name="su"/>
   [junit4]    >     <null name="sum"/>
   [junit4]    >     <null name="unique"/>
   [junit4]    >   </lst>
   [junit4]    >   <lst name="dr">
   [junit4]    >     <long name="count">100</long>
   [junit4]    >     <null name="mc"/>
   [junit4]    >     <null name="mean"/>
   [junit4]    >     <null name="su"/>
   [junit4]    >     <null name="sum"/>
   [junit4]    >     <null name="unique"/>
   [junit4]    >   </lst>
   [junit4]    >   <lst name="ar">
   [junit4]    >     <long name="count">100</long>
   [junit4]    >     <null name="mcm"/>
   [junit4]    >     <null name="mean"/>
   [junit4]    >     <null name="median"/>
   [junit4]    >     <null name="su"/>
   [junit4]    >     <null name="sum"/>
   [junit4]    >     <null name="unique"/>
   [junit4]    >   </lst>
   [junit4]    >   <lst name="rr">
   [junit4]    >     <str name="max">str9</str>
   [junit4]    >     <str name="min">str0</str>
   [junit4]    >     <str name="rmax">9rts</str>
   [junit4]    >     <str name="rmin">0rts</str>
   [junit4]    >   </lst>
   [junit4]    >   <lst name="avr">
   [junit4]    >     <double name="c">100.0</double>
   [junit4]    >     <long name

[...truncated too long message...]

3189588 T8034 oasu.DefaultSolrCoreState.closeIndexWriter closing IndexWriter with IndexWriterCloser
   [junit4]   2> 3189589 T8034 oasc.SolrCore.closeSearcher [collection1] Closing main searcher on request.
   [junit4]   2> 3189589 T8034 oasc.CachingDirectoryFactory.close Closing MockDirectoryFactory - 2 directories currently being tracked
   [junit4]   2> 3189590 T8034 oasc.CachingDirectoryFactory.closeCacheValue looking to close /Users/jenkins/workspace/Lucene-Solr-trunk-MacOSX/solr/build/solr-core/test/J0/./solrtest-ExpressionTest-1385860350043 [CachedDir<<refCount=0;path=/Users/jenkins/workspace/Lucene-Solr-trunk-MacOSX/solr/build/solr-core/test/J0/./solrtest-ExpressionTest-1385860350043;done=false>>]
   [junit4]   2> 3189590 T8034 oasc.CachingDirectoryFactory.close Closing directory: /Users/jenkins/workspace/Lucene-Solr-trunk-MacOSX/solr/build/solr-core/test/J0/./solrtest-ExpressionTest-1385860350043
   [junit4]   2> 3189590 T8034 oasc.CachingDirectoryFactory.closeCacheValue looking to close /Users/jenkins/workspace/Lucene-Solr-trunk-MacOSX/solr/build/solr-core/test/J0/./solrtest-ExpressionTest-1385860350043/index [CachedDir<<refCount=0;path=/Users/jenkins/workspace/Lucene-Solr-trunk-MacOSX/solr/build/solr-core/test/J0/./solrtest-ExpressionTest-1385860350043/index;done=false>>]
   [junit4]   2> 3189590 T8034 oasc.CachingDirectoryFactory.close Closing directory: /Users/jenkins/workspace/Lucene-Solr-trunk-MacOSX/solr/build/solr-core/test/J0/./solrtest-ExpressionTest-1385860350043/index
   [junit4]   2> NOTE: test params are: codec=Lucene45, sim=DefaultSimilarity, locale=en_ZA, timezone=Europe/Rome
   [junit4]   2> NOTE: Mac OS X 10.8.5 x86_64/Oracle Corporation 1.7.0_45 (64-bit)/cpus=2,threads=1,free=353357536,total=500170752
   [junit4]   2> NOTE: All tests run in this JVM: [SOLR749Test, TermVectorComponentTest, TestIndexingPerformance, HdfsUnloadDistributedZkTest, PathHierarchyTokenizerFactoryTest, QueryEqualityTest, SolrCoreTest, URLClassifyProcessorTest, TestSolrQueryParserDefaultOperatorResource, FullSolrCloudDistribCmdsTest, AlternateDirectoryTest, FileUtilsTest, TestSolrJ, SchemaVersionSpecificBehaviorTest, BadComponentTest, SliceStateUpdateTest, LoggingHandlerTest, CopyFieldTest, TestCodecSupport, TestCoreDiscovery, SynonymTokenizerTest, TestReplicationHandler, CurrencyFieldOpenExchangeTest, FastVectorHighlighterTest, TestQuerySenderListener, DistributedQueryElevationComponentTest, UnloadDistributedZkTest, TermVectorComponentDistributedTest, DocumentAnalysisRequestHandlerTest, QueryResultKeyTest, TestCopyFieldCollectionResource, PeerSyncTest, TestDefaultSearchFieldResource, DistanceFunctionTest, DirectUpdateHandlerTest, TestSolrXmlPersistence, TestHighFrequencyDictionaryFactory, DocValuesMultiTest, ZkSolrClientTest, DirectUpdateHandlerOptimizeTest, TestCoreContainer, ParsingFieldUpdateProcessorsTest, RequestHandlersTest, ZkNodePropsTest, TestSolrXml, HdfsCollectionsAPIDistributedZkTest, TestAnalyzeInfixSuggestions, TestCollationField, TestQueryUtils, TestSweetSpotSimilarityFactory, TestSolrQueryParser, TestJmxIntegration, CircularListTest, BasicFunctionalityTest, ShardRoutingCustomTest, NoCacheHeaderTest, DeleteShardTest, SolrIndexConfigTest, MBeansHandlerTest, CoreMergeIndexesAdminHandlerTest, TestFuzzyAnalyzedSuggestions, TestValueSourceCache, SolrIndexSplitterTest, BJQParserTest, TestModifyConfFiles, HdfsSyncSliceTest, TestAtomicUpdateErrorCases, AssignTest, TestBadConfig, TestRecoveryHdfs, TestArbitraryIndexDir, TestDocumentBuilder, LeaderElectionIntegrationTest, CoreContainerCoreInitFailuresTest, TestFoldingMultitermQuery, TestCollationFieldDocValues, OpenCloseCoreStressTest, FieldMutatingUpdateProcessorTest, SolrCmdDistributorTest, TestStressRecovery, TestSuggestSpellingConverter, CacheHeaderTest, SearchHandlerTest, DateMathParserTest, TestImplicitCoreProperties, AddBlockUpdateTest, TestCSVResponseWriter, BadIndexSchemaTest, SolrRequestParserTest, SpellingQueryConverterTest, TestFieldResource, JSONWriterTest, TestSchemaResource, TestMaxScoreQueryParser, TestDocBasedVersionConstraints, SimpleFacetsTest, ChaosMonkeyNothingIsSafeTest, StatelessScriptUpdateProcessorFactoryTest, JsonLoaderTest, TestCustomSort, InfoHandlerTest, PreAnalyzedFieldTest, SolrPluginUtilsTest, TestMultiCoreConfBootstrap, TestInfoStreamLogging, PreAnalyzedUpdateProcessorTest, HdfsRecoveryZkTest, HdfsChaosMonkeySafeLeaderTest, TestElisionMultitermQuery, TestQueryTypes, TestPostingsSolrHighlighter, TestIndexSearcher, TestComponentsName, NotRequiredUniqueKeyTest, DistributedDebugComponentTest, RegexBoostProcessorTest, MigrateRouteKeyTest, TestSimpleQParserPlugin, DOMUtilTest, TestFieldTypeResource, TestFastWriter, TestCharFilters, UpdateParamsTest, TestCloudManagedSchemaAddField, FieldFacetTest, TestStressLucene, ResponseLogComponentTest, DisMaxRequestHandlerTest, HardAutoCommitTest, DistributedTermsComponentTest, EchoParamsTest, TermsComponentTest, DocumentBuilderTest, BasicDistributedZkTest, SuggesterWFSTTest, TestDistribDocBasedVersion, SpellCheckComponentTest, ResourceLoaderTest, ShardSplitTest, SoftAutoCommitTest, NoFacetTest, TestSchemaNameResource, SuggesterTSTTest, TestJoin, HdfsDirectoryTest, UniqFieldsUpdateProcessorFactoryTest, BlockCacheTest, OpenExchangeRatesOrgProviderTest, HighlighterTest, TestMergePolicyConfig, TestPHPSerializedResponseWriter, TestFaceting, SuggesterFSTTest, ChaosMonkeySafeLeaderTest, IndexBasedSpellCheckerTest, TestDynamicFieldResource, SuggestComponentTest, CoreAdminHandlerTest, FieldAnalysisRequestHandlerTest, AutoCommitTest, StressHdfsTest, TestSchemaSimilarityResource, TestGroupingSearch, TestHashPartitioner, ModifyConfFileTest, ClusterStateTest, TestJmxMonitoredMap, RecoveryZkTest, HdfsBasicDistributedZkTest, FunctionTest, BasicDistributedZk2Test, CollectionsAPIDistributedZkTest, SyncSliceTest, OverseerTest, ShardRoutingTest, BasicZkTest, ClusterStateUpdateTest, TestRandomFaceting, LeaderElectionTest, TestZkChroot, TestRandomDVFaceting, ZkCLITest, TestDistributedSearch, TestDistributedGrouping, TestRecovery, DistributedSpellCheckComponentTest, ZkControllerTest, TestRealTimeGet, TestStressReorder, TestReload, TestStressVersions, TestRangeQuery, TestSolr4Spatial, StatsComponentTest, QueryElevationComponentTest, ConvertedLegacyTest, TestSort, TestFiltering, TestFunctionQuery, TestLazyCores, OverseerCollectionProcessorTest, ShowFileRequestHandlerTest, CurrencyFieldXmlFileTest, SimplePostToolTest, AnalysisAfterCoreReloadTest, SignatureUpdateProcessorFactoryTest, TestExtendedDismaxParser, SpellCheckCollatorTest, DocValuesTest, SuggesterTest, TestTrie, SpatialFilterTest, TestCSVLoader, PolyFieldTest, WordBreakSolrSpellCheckerTest, SolrCoreCheckLockOnStartupTest, TestPseudoReturnFields, TestUpdate, TestWordDelimiterFilterFactory, DefaultValueUpdateProcessorTest, SortByFunctionTest, TestRemoteStreaming, TestSolrDeletionPolicy1, SolrInfoMBeanTest, XsltUpdateRequestHandlerTest, DebugComponentTest, TestSurroundQueryParser, LukeRequestHandlerTest, StandardRequestHandlerTest, TestWriterPerf, DirectSolrSpellCheckerTest, TestReversedWildcardFilterFactory, PrimitiveFieldTypeTest, TestOmitPositions, FileBasedSpellCheckerTest, XmlUpdateRequestHandlerTest, MoreLikeThisHandlerTest, RequiredFieldsTest, IndexSchemaRuntimeFieldTest, IndexSchemaTest, ReturnFieldsTest, UpdateRequestProcessorFactoryTest, QueryParsingTest, TestAnalyzedSuggestions, BinaryUpdateRequestHandlerTest, TestPartialUpdateDeduplication, PingRequestHandlerTest, CSVRequestHandlerTest, TestBinaryResponseWriter, TestLFUCache, HighlighterConfigTest, TestSolrIndexConfig, TestQuerySenderNoQuery, TestSolrDeletionPolicy2, MultiTermTest, SampleTest, TestDocSet, TestBinaryField, TestSearchPerf, NumericFieldsTest, MinimalSchemaTest, TestConfig, OutputWriterTest, ExternalFileFieldSortTest, TestSolrCoreProperties, DirectSolrConnectionTest, TestLuceneMatchVersion, TestPhraseSuggestions, SpellPossibilityIteratorTest, TestXIncludeConfig, TestDFRSimilarityFactory, TestPerFieldSimilarity, TestNumberUtils, TestLMDirichletSimilarityFactory, TestLMJelinekMercerSimilarityFactory, TestIBSimilarityFactory, TestBM25SimilarityFactory, TestDefaultSimilarityFactory, LegacyHTMLStripCharFilterTest, TimeZoneUtilsTest, TestFastOutputStream, ScriptEngineTest, PluginInfoTest, TestFastLRUCache, TestSolrXMLSerializer, TestSystemIdResolver, PrimUtilsTest, DateFieldTest, RAMDirectoryFactoryTest, TestLRUCache, TestUtils, SliceStateTest, SystemInfoHandlerTest, UUIDFieldTest, TestRTGBase, SolrTestCaseJ4Test, TestDistributedMissingSort, AbstractAnalyticsStatsTest, ExpressionTest]
   [junit4] Completed in 1.81s, 12 tests, 6 failures <<< FAILURES!

[...truncated 149 lines...]
BUILD FAILED
/Users/jenkins/workspace/Lucene-Solr-trunk-MacOSX/build.xml:420: The following error occurred while executing this line:
/Users/jenkins/workspace/Lucene-Solr-trunk-MacOSX/build.xml:400: The following error occurred while executing this line:
/Users/jenkins/workspace/Lucene-Solr-trunk-MacOSX/build.xml:39: The following error occurred while executing this line:
/Users/jenkins/workspace/Lucene-Solr-trunk-MacOSX/extra-targets.xml:37: The following error occurred while executing this line:
/Users/jenkins/workspace/Lucene-Solr-trunk-MacOSX/solr/build.xml:189: The following error occurred while executing this line:
/Users/jenkins/workspace/Lucene-Solr-trunk-MacOSX/solr/common-build.xml:491: The following error occurred while executing this line:
/Users/jenkins/workspace/Lucene-Solr-trunk-MacOSX/lucene/common-build.xml:1275: The following error occurred while executing this line:
/Users/jenkins/workspace/Lucene-Solr-trunk-MacOSX/lucene/common-build.xml:908: There were test failures: 357 suites, 1569 tests, 6 failures, 39 ignored (5 assumptions)

Total time: 96 minutes 42 seconds
Build step 'Invoke Ant' marked build as failure
Description set: Java: 64bit/jdk1.7.0 -XX:+UseCompressedOops -XX:+UseG1GC
Archiving artifacts
Recording test results
Email was triggered for: Failure
Sending email for trigger: Failure



Mime
View raw message