lucene-dev mailing list archives

Site index · List index
Message view « Date » · « Thread »
Top « Date » · « Thread »
From Policeman Jenkins Server <jenk...@thetaphi.de>
Subject [JENKINS] Lucene-Solr-trunk-Linux (64bit/ibm-j9-jdk7) - Build # 8534 - Failure!
Date Sun, 01 Dec 2013 17:35:41 GMT
Build: http://jenkins.thetaphi.de/job/Lucene-Solr-trunk-Linux/8534/
Java: 64bit/ibm-j9-jdk7 -Xjit:exclude={org/apache/lucene/util/fst/FST.pack(IIF)Lorg/apache/lucene/util/fst/FST;}

4 tests failed.
REGRESSION:  org.apache.solr.analytics.expression.ExpressionTest.multiplyTest

Error Message:
Caught exception in getStatResult, xPath = /response/lst[@name='stats']/lst[@name='mr']/double[@name='sum']  raw data: <?xml version="1.0" encoding="UTF-8"?> <response>  <lst name="responseHeader">   <int name="status">0</int>   <int name="QTime">38</int> </lst> <result name="response" numFound="100" start="0"> </result> <lst name="stats">   <lst name="stats_fields"/> </lst> <lst name="stats">   <lst name="cnr">     <double name="c10">10.0</double>     <double name="c8">8.0</double>   </lst>   <lst name="dr">     <long name="count">100</long>     <double name="mc">0.2891</double>     <double name="mean">28.91</double>     <double name="su">80.30555555555556</double>     <double name="sum">2891.0</double>     <long name="unique">36</long>   </lst>   <lst name="cr">     <str name="ccmax">this is the secondstr9</str>     <str name="ccmin">this is the firststr0</str>     <str name="csmax">this is the second</str>     <str name="csmin">this is the first</str>     <str name="max">str9</str>     <str name="min">str0</str>   </lst>   <lst name="pr">     <long name="count">100</long>     <double name="mc">1.2729436151389237E146</double>     <double name="mean">28.91</double>     <double name="su">3.9603293116911423E124</double>     <double name="sum">2891.0</double>     <long name="unique">36</long>   </lst>   <lst name="mr">     <long name="count">100</long>     <null name="mcm"/>     <null name="mean"/>     <null name="median"/>     <null name="su"/>     <null name="sum"/>     <null name="unique"/>   </lst>   <lst name="avr">     <double name="c">100.0</double>     <long name="count">100</long>     <double name="s">2891.0</double>     <double name="sum">2891.0</double>   </lst>   <lst name="cdr">     <date name="cd1">1800-12-31T23:59:59Z</date>     <date name="cd2">1804-06-30T23:59:59Z</date>     <str name="cs1">1800-12-31T23:59:59Z</str>     <str name="cs2">1804-06-30T23:59:59Z</str>   </lst>   <lst name="dmr">     <str name="cma">+2MONTHS</str>     <str name="cme">+2YEARS</str>     <date name="dmma">1812-02-29T23:59:59Z</date>     <date name="dmme">1807-12-31T23:59:59Z</date>     <date name="max">1811-12-31T23:59:59Z</date>     <date name="median">1805-12-31T23:59:59Z</date>   </lst>   <lst name="rr">     <str name="max">str9</str>     <str name="min">str0</str>     <str name="rmax">9rts</str>     <str name="rmin">0rts</str>   </lst>   <lst name="ar">     <long name="count">100</long>     <double name="mcm">153.41</double>     <double name="mean">28.91</double>     <double name="median">24.5</double>     <double name="su">2927.0</double>     <double name="sum">2891.0</double>     <long name="unique">36</long>   </lst>   <lst name="csr">     <str name="cs1">this is the first</str>     <str name="cs2">this is the second</str>     <str name="cs3">this is the third</str>   </lst>   <lst name="nr">     <double name="c">-100.0</double>     <long name="count">100</long>     <double name="s">-2891.0</double>     <double name="sum">2891.0</double>   </lst> </lst> </response> 

Stack Trace:
java.lang.AssertionError: Caught exception in getStatResult, xPath = /response/lst[@name='stats']/lst[@name='mr']/double[@name='sum'] 
raw data: <?xml version="1.0" encoding="UTF-8"?>
<response>

<lst name="responseHeader">
  <int name="status">0</int>
  <int name="QTime">38</int>
</lst>
<result name="response" numFound="100" start="0">
</result>
<lst name="stats">
  <lst name="stats_fields"/>
</lst>
<lst name="stats">
  <lst name="cnr">
    <double name="c10">10.0</double>
    <double name="c8">8.0</double>
  </lst>
  <lst name="dr">
    <long name="count">100</long>
    <double name="mc">0.2891</double>
    <double name="mean">28.91</double>
    <double name="su">80.30555555555556</double>
    <double name="sum">2891.0</double>
    <long name="unique">36</long>
  </lst>
  <lst name="cr">
    <str name="ccmax">this is the secondstr9</str>
    <str name="ccmin">this is the firststr0</str>
    <str name="csmax">this is the second</str>
    <str name="csmin">this is the first</str>
    <str name="max">str9</str>
    <str name="min">str0</str>
  </lst>
  <lst name="pr">
    <long name="count">100</long>
    <double name="mc">1.2729436151389237E146</double>
    <double name="mean">28.91</double>
    <double name="su">3.9603293116911423E124</double>
    <double name="sum">2891.0</double>
    <long name="unique">36</long>
  </lst>
  <lst name="mr">
    <long name="count">100</long>
    <null name="mcm"/>
    <null name="mean"/>
    <null name="median"/>
    <null name="su"/>
    <null name="sum"/>
    <null name="unique"/>
  </lst>
  <lst name="avr">
    <double name="c">100.0</double>
    <long name="count">100</long>
    <double name="s">2891.0</double>
    <double name="sum">2891.0</double>
  </lst>
  <lst name="cdr">
    <date name="cd1">1800-12-31T23:59:59Z</date>
    <date name="cd2">1804-06-30T23:59:59Z</date>
    <str name="cs1">1800-12-31T23:59:59Z</str>
    <str name="cs2">1804-06-30T23:59:59Z</str>
  </lst>
  <lst name="dmr">
    <str name="cma">+2MONTHS</str>
    <str name="cme">+2YEARS</str>
    <date name="dmma">1812-02-29T23:59:59Z</date>
    <date name="dmme">1807-12-31T23:59:59Z</date>
    <date name="max">1811-12-31T23:59:59Z</date>
    <date name="median">1805-12-31T23:59:59Z</date>
  </lst>
  <lst name="rr">
    <str name="max">str9</str>
    <str name="min">str0</str>
    <str name="rmax">9rts</str>
    <str name="rmin">0rts</str>
  </lst>
  <lst name="ar">
    <long name="count">100</long>
    <double name="mcm">153.41</double>
    <double name="mean">28.91</double>
    <double name="median">24.5</double>
    <double name="su">2927.0</double>
    <double name="sum">2891.0</double>
    <long name="unique">36</long>
  </lst>
  <lst name="csr">
    <str name="cs1">this is the first</str>
    <str name="cs2">this is the second</str>
    <str name="cs3">this is the third</str>
  </lst>
  <lst name="nr">
    <double name="c">-100.0</double>
    <long name="count">100</long>
    <double name="s">-2891.0</double>
    <double name="sum">2891.0</double>
  </lst>
</lst>
</response>

	at __randomizedtesting.SeedInfo.seed([865248978DC22F8C:EDD356E9B8CC19E2]:0)
	at org.junit.Assert.fail(Assert.java:93)
	at org.apache.solr.analytics.AbstractAnalyticsStatsTest.getStatResult(AbstractAnalyticsStatsTest.java:113)
	at org.apache.solr.analytics.expression.ExpressionTest.multiplyTest(ExpressionTest.java:92)
	at sun.reflect.NativeMethodAccessorImpl.invoke0(Native Method)
	at sun.reflect.NativeMethodAccessorImpl.invoke(NativeMethodAccessorImpl.java:88)
	at sun.reflect.DelegatingMethodAccessorImpl.invoke(DelegatingMethodAccessorImpl.java:55)
	at java.lang.reflect.Method.invoke(Method.java:613)
	at com.carrotsearch.randomizedtesting.RandomizedRunner.invoke(RandomizedRunner.java:1559)
	at com.carrotsearch.randomizedtesting.RandomizedRunner.access$600(RandomizedRunner.java:79)
	at com.carrotsearch.randomizedtesting.RandomizedRunner$6.evaluate(RandomizedRunner.java:737)
	at com.carrotsearch.randomizedtesting.RandomizedRunner$7.evaluate(RandomizedRunner.java:773)
	at com.carrotsearch.randomizedtesting.RandomizedRunner$8.evaluate(RandomizedRunner.java:787)
	at com.carrotsearch.randomizedtesting.rules.SystemPropertiesRestoreRule$1.evaluate(SystemPropertiesRestoreRule.java:53)
	at org.apache.lucene.util.TestRuleSetupTeardownChained$1.evaluate(TestRuleSetupTeardownChained.java:50)
	at org.apache.lucene.util.TestRuleFieldCacheSanity$1.evaluate(TestRuleFieldCacheSanity.java:51)
	at org.apache.lucene.util.AbstractBeforeAfterRule$1.evaluate(AbstractBeforeAfterRule.java:46)
	at com.carrotsearch.randomizedtesting.rules.SystemPropertiesInvariantRule$1.evaluate(SystemPropertiesInvariantRule.java:55)
	at org.apache.lucene.util.TestRuleThreadAndTestName$1.evaluate(TestRuleThreadAndTestName.java:49)
	at org.apache.lucene.util.TestRuleIgnoreAfterMaxFailures$1.evaluate(TestRuleIgnoreAfterMaxFailures.java:70)
	at org.apache.lucene.util.TestRuleMarkFailure$1.evaluate(TestRuleMarkFailure.java:48)
	at com.carrotsearch.randomizedtesting.rules.StatementAdapter.evaluate(StatementAdapter.java:36)
	at com.carrotsearch.randomizedtesting.ThreadLeakControl$StatementRunner.run(ThreadLeakControl.java:358)
	at com.carrotsearch.randomizedtesting.ThreadLeakControl.forkTimeoutingTask(ThreadLeakControl.java:782)
	at com.carrotsearch.randomizedtesting.ThreadLeakControl$3.evaluate(ThreadLeakControl.java:442)
	at com.carrotsearch.randomizedtesting.RandomizedRunner.runSingleTest(RandomizedRunner.java:746)
	at com.carrotsearch.randomizedtesting.RandomizedRunner$3.evaluate(RandomizedRunner.java:648)
	at com.carrotsearch.randomizedtesting.RandomizedRunner$4.evaluate(RandomizedRunner.java:682)
	at com.carrotsearch.randomizedtesting.RandomizedRunner$5.evaluate(RandomizedRunner.java:693)
	at com.carrotsearch.randomizedtesting.rules.StatementAdapter.evaluate(StatementAdapter.java:36)
	at com.carrotsearch.randomizedtesting.rules.SystemPropertiesRestoreRule$1.evaluate(SystemPropertiesRestoreRule.java:53)
	at org.apache.lucene.util.AbstractBeforeAfterRule$1.evaluate(AbstractBeforeAfterRule.java:46)
	at org.apache.lucene.util.TestRuleStoreClassName$1.evaluate(TestRuleStoreClassName.java:42)
	at com.carrotsearch.randomizedtesting.rules.SystemPropertiesInvariantRule$1.evaluate(SystemPropertiesInvariantRule.java:55)
	at com.carrotsearch.randomizedtesting.rules.NoShadowingOrOverridesOnMethodsRule$1.evaluate(NoShadowingOrOverridesOnMethodsRule.java:39)
	at com.carrotsearch.randomizedtesting.rules.NoShadowingOrOverridesOnMethodsRule$1.evaluate(NoShadowingOrOverridesOnMethodsRule.java:39)
	at com.carrotsearch.randomizedtesting.rules.StatementAdapter.evaluate(StatementAdapter.java:36)
	at org.apache.lucene.util.TestRuleAssertionsRequired$1.evaluate(TestRuleAssertionsRequired.java:43)
	at org.apache.lucene.util.TestRuleMarkFailure$1.evaluate(TestRuleMarkFailure.java:48)
	at org.apache.lucene.util.TestRuleIgnoreAfterMaxFailures$1.evaluate(TestRuleIgnoreAfterMaxFailures.java:70)
	at org.apache.lucene.util.TestRuleIgnoreTestSuites$1.evaluate(TestRuleIgnoreTestSuites.java:55)
	at com.carrotsearch.randomizedtesting.rules.StatementAdapter.evaluate(StatementAdapter.java:36)
	at com.carrotsearch.randomizedtesting.ThreadLeakControl$StatementRunner.run(ThreadLeakControl.java:358)
	at java.lang.Thread.run(Thread.java:780)


REGRESSION:  org.apache.solr.update.AutoCommitTest.testMaxTime

Error Message:
Exception during query

Stack Trace:
java.lang.RuntimeException: Exception during query
	at __randomizedtesting.SeedInfo.seed([865248978DC22F8C:1CA635751358B3B0]:0)
	at org.apache.solr.SolrTestCaseJ4.assertQ(SolrTestCaseJ4.java:641)
	at org.apache.solr.update.AutoCommitTest.testMaxTime(AutoCommitTest.java:227)
	at sun.reflect.NativeMethodAccessorImpl.invoke0(Native Method)
	at sun.reflect.NativeMethodAccessorImpl.invoke(NativeMethodAccessorImpl.java:88)
	at sun.reflect.DelegatingMethodAccessorImpl.invoke(DelegatingMethodAccessorImpl.java:55)
	at java.lang.reflect.Method.invoke(Method.java:613)
	at com.carrotsearch.randomizedtesting.RandomizedRunner.invoke(RandomizedRunner.java:1559)
	at com.carrotsearch.randomizedtesting.RandomizedRunner.access$600(RandomizedRunner.java:79)
	at com.carrotsearch.randomizedtesting.RandomizedRunner$6.evaluate(RandomizedRunner.java:737)
	at com.carrotsearch.randomizedtesting.RandomizedRunner$7.evaluate(RandomizedRunner.java:773)
	at com.carrotsearch.randomizedtesting.RandomizedRunner$8.evaluate(RandomizedRunner.java:787)
	at com.carrotsearch.randomizedtesting.rules.SystemPropertiesRestoreRule$1.evaluate(SystemPropertiesRestoreRule.java:53)
	at org.apache.lucene.util.TestRuleSetupTeardownChained$1.evaluate(TestRuleSetupTeardownChained.java:50)
	at org.apache.lucene.util.TestRuleFieldCacheSanity$1.evaluate(TestRuleFieldCacheSanity.java:51)
	at org.apache.lucene.util.AbstractBeforeAfterRule$1.evaluate(AbstractBeforeAfterRule.java:46)
	at com.carrotsearch.randomizedtesting.rules.SystemPropertiesInvariantRule$1.evaluate(SystemPropertiesInvariantRule.java:55)
	at org.apache.lucene.util.TestRuleThreadAndTestName$1.evaluate(TestRuleThreadAndTestName.java:49)
	at org.apache.lucene.util.TestRuleIgnoreAfterMaxFailures$1.evaluate(TestRuleIgnoreAfterMaxFailures.java:70)
	at org.apache.lucene.util.TestRuleMarkFailure$1.evaluate(TestRuleMarkFailure.java:48)
	at com.carrotsearch.randomizedtesting.rules.StatementAdapter.evaluate(StatementAdapter.java:36)
	at com.carrotsearch.randomizedtesting.ThreadLeakControl$StatementRunner.run(ThreadLeakControl.java:358)
	at com.carrotsearch.randomizedtesting.ThreadLeakControl.forkTimeoutingTask(ThreadLeakControl.java:782)
	at com.carrotsearch.randomizedtesting.ThreadLeakControl$3.evaluate(ThreadLeakControl.java:442)
	at com.carrotsearch.randomizedtesting.RandomizedRunner.runSingleTest(RandomizedRunner.java:746)
	at com.carrotsearch.randomizedtesting.RandomizedRunner$3.evaluate(RandomizedRunner.java:648)
	at com.carrotsearch.randomizedtesting.RandomizedRunner$4.evaluate(RandomizedRunner.java:682)
	at com.carrotsearch.randomizedtesting.RandomizedRunner$5.evaluate(RandomizedRunner.java:693)
	at com.carrotsearch.randomizedtesting.rules.StatementAdapter.evaluate(StatementAdapter.java:36)
	at com.carrotsearch.randomizedtesting.rules.SystemPropertiesRestoreRule$1.evaluate(SystemPropertiesRestoreRule.java:53)
	at org.apache.lucene.util.AbstractBeforeAfterRule$1.evaluate(AbstractBeforeAfterRule.java:46)
	at org.apache.lucene.util.TestRuleStoreClassName$1.evaluate(TestRuleStoreClassName.java:42)
	at com.carrotsearch.randomizedtesting.rules.SystemPropertiesInvariantRule$1.evaluate(SystemPropertiesInvariantRule.java:55)
	at com.carrotsearch.randomizedtesting.rules.NoShadowingOrOverridesOnMethodsRule$1.evaluate(NoShadowingOrOverridesOnMethodsRule.java:39)
	at com.carrotsearch.randomizedtesting.rules.NoShadowingOrOverridesOnMethodsRule$1.evaluate(NoShadowingOrOverridesOnMethodsRule.java:39)
	at com.carrotsearch.randomizedtesting.rules.StatementAdapter.evaluate(StatementAdapter.java:36)
	at org.apache.lucene.util.TestRuleAssertionsRequired$1.evaluate(TestRuleAssertionsRequired.java:43)
	at org.apache.lucene.util.TestRuleMarkFailure$1.evaluate(TestRuleMarkFailure.java:48)
	at org.apache.lucene.util.TestRuleIgnoreAfterMaxFailures$1.evaluate(TestRuleIgnoreAfterMaxFailures.java:70)
	at org.apache.lucene.util.TestRuleIgnoreTestSuites$1.evaluate(TestRuleIgnoreTestSuites.java:55)
	at com.carrotsearch.randomizedtesting.rules.StatementAdapter.evaluate(StatementAdapter.java:36)
	at com.carrotsearch.randomizedtesting.ThreadLeakControl$StatementRunner.run(ThreadLeakControl.java:358)
	at java.lang.Thread.run(Thread.java:780)
Caused by: java.lang.RuntimeException: REQUEST FAILED: xpath=//result[@numFound=0]
	xml response was: <?xml version="1.0" encoding="UTF-8"?>
<response>
<lst name="responseHeader"><int name="status">0</int><int name="QTime">1240</int></lst><result name="response" numFound="1" start="0"><doc><int name="id">529</int><int name="range_facet_si">529</int><arr name="range_facet_l"><long>529</long></arr><arr name="range_facet_sl"><long>529</long></arr><arr name="field_t"><str>what's inside?</str></arr><arr name="subject"><str>info</str></arr><long name="_version_">1453241459775897600</long><int name="intDefault">42</int><date name="timestamp">2013-12-01T17:30:55.725Z</date><arr name="multiDefault"><str>muLti-Default</str></arr></doc></result>
</response>

	request was:start=0&qt=standard&version=2.2&q=id:529&rows=20
	at org.apache.solr.SolrTestCaseJ4.assertQ(SolrTestCaseJ4.java:634)
	... 41 more


REGRESSION:  org.apache.solr.update.processor.SignatureUpdateProcessorFactoryTest.testDupeDetection

Error Message:
expected:<1> but was:<2>

Stack Trace:
java.lang.AssertionError: expected:<1> but was:<2>
	at __randomizedtesting.SeedInfo.seed([865248978DC22F8C:DD62B35F8E858CF0]:0)
	at org.junit.Assert.fail(Assert.java:93)
	at org.junit.Assert.failNotEquals(Assert.java:647)
	at org.junit.Assert.assertEquals(Assert.java:128)
	at org.junit.Assert.assertEquals(Assert.java:472)
	at org.junit.Assert.assertEquals(Assert.java:456)
	at org.apache.solr.update.processor.SignatureUpdateProcessorFactoryTest.checkNumDocs(SignatureUpdateProcessorFactoryTest.java:71)
	at org.apache.solr.update.processor.SignatureUpdateProcessorFactoryTest.testDupeDetection(SignatureUpdateProcessorFactoryTest.java:119)
	at sun.reflect.NativeMethodAccessorImpl.invoke0(Native Method)
	at sun.reflect.NativeMethodAccessorImpl.invoke(NativeMethodAccessorImpl.java:88)
	at sun.reflect.DelegatingMethodAccessorImpl.invoke(DelegatingMethodAccessorImpl.java:55)
	at java.lang.reflect.Method.invoke(Method.java:613)
	at com.carrotsearch.randomizedtesting.RandomizedRunner.invoke(RandomizedRunner.java:1559)
	at com.carrotsearch.randomizedtesting.RandomizedRunner.access$600(RandomizedRunner.java:79)
	at com.carrotsearch.randomizedtesting.RandomizedRunner$6.evaluate(RandomizedRunner.java:737)
	at com.carrotsearch.randomizedtesting.RandomizedRunner$7.evaluate(RandomizedRunner.java:773)
	at com.carrotsearch.randomizedtesting.RandomizedRunner$8.evaluate(RandomizedRunner.java:787)
	at com.carrotsearch.randomizedtesting.rules.SystemPropertiesRestoreRule$1.evaluate(SystemPropertiesRestoreRule.java:53)
	at org.apache.lucene.util.TestRuleSetupTeardownChained$1.evaluate(TestRuleSetupTeardownChained.java:50)
	at org.apache.lucene.util.TestRuleFieldCacheSanity$1.evaluate(TestRuleFieldCacheSanity.java:51)
	at org.apache.lucene.util.AbstractBeforeAfterRule$1.evaluate(AbstractBeforeAfterRule.java:46)
	at com.carrotsearch.randomizedtesting.rules.SystemPropertiesInvariantRule$1.evaluate(SystemPropertiesInvariantRule.java:55)
	at org.apache.lucene.util.TestRuleThreadAndTestName$1.evaluate(TestRuleThreadAndTestName.java:49)
	at org.apache.lucene.util.TestRuleIgnoreAfterMaxFailures$1.evaluate(TestRuleIgnoreAfterMaxFailures.java:70)
	at org.apache.lucene.util.TestRuleMarkFailure$1.evaluate(TestRuleMarkFailure.java:48)
	at com.carrotsearch.randomizedtesting.rules.StatementAdapter.evaluate(StatementAdapter.java:36)
	at com.carrotsearch.randomizedtesting.ThreadLeakControl$StatementRunner.run(ThreadLeakControl.java:358)
	at com.carrotsearch.randomizedtesting.ThreadLeakControl.forkTimeoutingTask(ThreadLeakControl.java:782)
	at com.carrotsearch.randomizedtesting.ThreadLeakControl$3.evaluate(ThreadLeakControl.java:442)
	at com.carrotsearch.randomizedtesting.RandomizedRunner.runSingleTest(RandomizedRunner.java:746)
	at com.carrotsearch.randomizedtesting.RandomizedRunner$3.evaluate(RandomizedRunner.java:648)
	at com.carrotsearch.randomizedtesting.RandomizedRunner$4.evaluate(RandomizedRunner.java:682)
	at com.carrotsearch.randomizedtesting.RandomizedRunner$5.evaluate(RandomizedRunner.java:693)
	at com.carrotsearch.randomizedtesting.rules.StatementAdapter.evaluate(StatementAdapter.java:36)
	at com.carrotsearch.randomizedtesting.rules.SystemPropertiesRestoreRule$1.evaluate(SystemPropertiesRestoreRule.java:53)
	at org.apache.lucene.util.AbstractBeforeAfterRule$1.evaluate(AbstractBeforeAfterRule.java:46)
	at org.apache.lucene.util.TestRuleStoreClassName$1.evaluate(TestRuleStoreClassName.java:42)
	at com.carrotsearch.randomizedtesting.rules.SystemPropertiesInvariantRule$1.evaluate(SystemPropertiesInvariantRule.java:55)
	at com.carrotsearch.randomizedtesting.rules.NoShadowingOrOverridesOnMethodsRule$1.evaluate(NoShadowingOrOverridesOnMethodsRule.java:39)
	at com.carrotsearch.randomizedtesting.rules.NoShadowingOrOverridesOnMethodsRule$1.evaluate(NoShadowingOrOverridesOnMethodsRule.java:39)
	at com.carrotsearch.randomizedtesting.rules.StatementAdapter.evaluate(StatementAdapter.java:36)
	at org.apache.lucene.util.TestRuleAssertionsRequired$1.evaluate(TestRuleAssertionsRequired.java:43)
	at org.apache.lucene.util.TestRuleMarkFailure$1.evaluate(TestRuleMarkFailure.java:48)
	at org.apache.lucene.util.TestRuleIgnoreAfterMaxFailures$1.evaluate(TestRuleIgnoreAfterMaxFailures.java:70)
	at org.apache.lucene.util.TestRuleIgnoreTestSuites$1.evaluate(TestRuleIgnoreTestSuites.java:55)
	at com.carrotsearch.randomizedtesting.rules.StatementAdapter.evaluate(StatementAdapter.java:36)
	at com.carrotsearch.randomizedtesting.ThreadLeakControl$StatementRunner.run(ThreadLeakControl.java:358)
	at java.lang.Thread.run(Thread.java:780)


REGRESSION:  org.apache.solr.update.processor.SignatureUpdateProcessorFactoryTest.testMultiThreaded

Error Message:
expected:<1> but was:<2>

Stack Trace:
java.lang.AssertionError: expected:<1> but was:<2>
	at __randomizedtesting.SeedInfo.seed([865248978DC22F8C:E7C792776513257A]:0)
	at org.junit.Assert.fail(Assert.java:93)
	at org.junit.Assert.failNotEquals(Assert.java:647)
	at org.junit.Assert.assertEquals(Assert.java:128)
	at org.junit.Assert.assertEquals(Assert.java:472)
	at org.junit.Assert.assertEquals(Assert.java:456)
	at org.apache.solr.update.processor.SignatureUpdateProcessorFactoryTest.checkNumDocs(SignatureUpdateProcessorFactoryTest.java:71)
	at org.apache.solr.update.processor.SignatureUpdateProcessorFactoryTest.testMultiThreaded(SignatureUpdateProcessorFactoryTest.java:222)
	at sun.reflect.NativeMethodAccessorImpl.invoke0(Native Method)
	at sun.reflect.NativeMethodAccessorImpl.invoke(NativeMethodAccessorImpl.java:88)
	at sun.reflect.DelegatingMethodAccessorImpl.invoke(DelegatingMethodAccessorImpl.java:55)
	at java.lang.reflect.Method.invoke(Method.java:613)
	at com.carrotsearch.randomizedtesting.RandomizedRunner.invoke(RandomizedRunner.java:1559)
	at com.carrotsearch.randomizedtesting.RandomizedRunner.access$600(RandomizedRunner.java:79)
	at com.carrotsearch.randomizedtesting.RandomizedRunner$6.evaluate(RandomizedRunner.java:737)
	at com.carrotsearch.randomizedtesting.RandomizedRunner$7.evaluate(RandomizedRunner.java:773)
	at com.carrotsearch.randomizedtesting.RandomizedRunner$8.evaluate(RandomizedRunner.java:787)
	at com.carrotsearch.randomizedtesting.rules.SystemPropertiesRestoreRule$1.evaluate(SystemPropertiesRestoreRule.java:53)
	at org.apache.lucene.util.TestRuleSetupTeardownChained$1.evaluate(TestRuleSetupTeardownChained.java:50)
	at org.apache.lucene.util.TestRuleFieldCacheSanity$1.evaluate(TestRuleFieldCacheSanity.java:51)
	at org.apache.lucene.util.AbstractBeforeAfterRule$1.evaluate(AbstractBeforeAfterRule.java:46)
	at com.carrotsearch.randomizedtesting.rules.SystemPropertiesInvariantRule$1.evaluate(SystemPropertiesInvariantRule.java:55)
	at org.apache.lucene.util.TestRuleThreadAndTestName$1.evaluate(TestRuleThreadAndTestName.java:49)
	at org.apache.lucene.util.TestRuleIgnoreAfterMaxFailures$1.evaluate(TestRuleIgnoreAfterMaxFailures.java:70)
	at org.apache.lucene.util.TestRuleMarkFailure$1.evaluate(TestRuleMarkFailure.java:48)
	at com.carrotsearch.randomizedtesting.rules.StatementAdapter.evaluate(StatementAdapter.java:36)
	at com.carrotsearch.randomizedtesting.ThreadLeakControl$StatementRunner.run(ThreadLeakControl.java:358)
	at com.carrotsearch.randomizedtesting.ThreadLeakControl.forkTimeoutingTask(ThreadLeakControl.java:782)
	at com.carrotsearch.randomizedtesting.ThreadLeakControl$3.evaluate(ThreadLeakControl.java:442)
	at com.carrotsearch.randomizedtesting.RandomizedRunner.runSingleTest(RandomizedRunner.java:746)
	at com.carrotsearch.randomizedtesting.RandomizedRunner$3.evaluate(RandomizedRunner.java:648)
	at com.carrotsearch.randomizedtesting.RandomizedRunner$4.evaluate(RandomizedRunner.java:682)
	at com.carrotsearch.randomizedtesting.RandomizedRunner$5.evaluate(RandomizedRunner.java:693)
	at com.carrotsearch.randomizedtesting.rules.StatementAdapter.evaluate(StatementAdapter.java:36)
	at com.carrotsearch.randomizedtesting.rules.SystemPropertiesRestoreRule$1.evaluate(SystemPropertiesRestoreRule.java:53)
	at org.apache.lucene.util.AbstractBeforeAfterRule$1.evaluate(AbstractBeforeAfterRule.java:46)
	at org.apache.lucene.util.TestRuleStoreClassName$1.evaluate(TestRuleStoreClassName.java:42)
	at com.carrotsearch.randomizedtesting.rules.SystemPropertiesInvariantRule$1.evaluate(SystemPropertiesInvariantRule.java:55)
	at com.carrotsearch.randomizedtesting.rules.NoShadowingOrOverridesOnMethodsRule$1.evaluate(NoShadowingOrOverridesOnMethodsRule.java:39)
	at com.carrotsearch.randomizedtesting.rules.NoShadowingOrOverridesOnMethodsRule$1.evaluate(NoShadowingOrOverridesOnMethodsRule.java:39)
	at com.carrotsearch.randomizedtesting.rules.StatementAdapter.evaluate(StatementAdapter.java:36)
	at org.apache.lucene.util.TestRuleAssertionsRequired$1.evaluate(TestRuleAssertionsRequired.java:43)
	at org.apache.lucene.util.TestRuleMarkFailure$1.evaluate(TestRuleMarkFailure.java:48)
	at org.apache.lucene.util.TestRuleIgnoreAfterMaxFailures$1.evaluate(TestRuleIgnoreAfterMaxFailures.java:70)
	at org.apache.lucene.util.TestRuleIgnoreTestSuites$1.evaluate(TestRuleIgnoreTestSuites.java:55)
	at com.carrotsearch.randomizedtesting.rules.StatementAdapter.evaluate(StatementAdapter.java:36)
	at com.carrotsearch.randomizedtesting.ThreadLeakControl$StatementRunner.run(ThreadLeakControl.java:358)
	at java.lang.Thread.run(Thread.java:780)




Build Log:
[...truncated 10319 lines...]
   [junit4] Suite: org.apache.solr.analytics.expression.ExpressionTest
   [junit4]   2> 133086 T539 oas.SolrTestCaseJ4.initCore ####initCore
   [junit4]   2> Creating dataDir: /mnt/ssd/jenkins/workspace/Lucene-Solr-trunk-Linux/solr/build/solr-core/test/J0/./solrtest-ExpressionTest-1385918695507
   [junit4]   2> 133087 T539 oasc.SolrResourceLoader.<init> new SolrResourceLoader for directory: '/mnt/ssd/jenkins/workspace/Lucene-Solr-trunk-Linux/solr/build/solr-core/test-files/solr/collection1/'
   [junit4]   2> 133087 T539 oasc.SolrResourceLoader.replaceClassLoader Adding 'file:/mnt/ssd/jenkins/workspace/Lucene-Solr-trunk-Linux/solr/build/solr-core/test-files/solr/collection1/lib/classes/' to classloader
   [junit4]   2> 133088 T539 oasc.SolrResourceLoader.replaceClassLoader Adding 'file:/mnt/ssd/jenkins/workspace/Lucene-Solr-trunk-Linux/solr/build/solr-core/test-files/solr/collection1/lib/README' to classloader
   [junit4]   2> 133125 T539 oasc.SolrConfig.<init> Using Lucene MatchVersion: LUCENE_50
   [junit4]   2> 133160 T539 oasc.SolrConfig.<init> Loaded SolrConfig: solrconfig-basic.xml
   [junit4]   2> 133161 T539 oass.IndexSchema.readSchema Reading Solr Schema from schema-analytics.xml
   [junit4]   2> 133165 T539 oass.IndexSchema.readSchema [null] Schema name=schema-docValues
   [junit4]   2> 133201 T539 oass.IndexSchema.readSchema unique key field: id
   [junit4]   2> 133203 T539 oasc.SolrResourceLoader.locateSolrHome JNDI not configured for solr (NoInitialContextEx)
   [junit4]   2> 133203 T539 oasc.SolrResourceLoader.locateSolrHome using system property solr.solr.home: /mnt/ssd/jenkins/workspace/Lucene-Solr-trunk-Linux/solr/build/solr-core/test-files/solr
   [junit4]   2> 133203 T539 oasc.SolrResourceLoader.<init> new SolrResourceLoader for directory: '/mnt/ssd/jenkins/workspace/Lucene-Solr-trunk-Linux/solr/build/solr-core/test-files/solr/'
   [junit4]   2> 133211 T539 oasc.SolrResourceLoader.locateSolrHome JNDI not configured for solr (NoInitialContextEx)
   [junit4]   2> 133211 T539 oasc.SolrResourceLoader.locateSolrHome using system property solr.solr.home: /mnt/ssd/jenkins/workspace/Lucene-Solr-trunk-Linux/solr/build/solr-core/test-files/solr
   [junit4]   2> 133212 T539 oasc.SolrResourceLoader.<init> new SolrResourceLoader for deduced Solr Home: '/mnt/ssd/jenkins/workspace/Lucene-Solr-trunk-Linux/solr/build/solr-core/test-files/solr/'
   [junit4]   2> 133251 T539 oasc.CoreContainer.<init> New CoreContainer 1424968760
   [junit4]   2> 133251 T539 oasc.CoreContainer.load Loading cores into CoreContainer [instanceDir=/mnt/ssd/jenkins/workspace/Lucene-Solr-trunk-Linux/solr/build/solr-core/test-files/solr/]
   [junit4]   2> 133252 T539 oashc.HttpShardHandlerFactory.getParameter Setting socketTimeout to: 0
   [junit4]   2> 133253 T539 oashc.HttpShardHandlerFactory.getParameter Setting urlScheme to: http://
   [junit4]   2> 133253 T539 oashc.HttpShardHandlerFactory.getParameter Setting connTimeout to: 0
   [junit4]   2> 133253 T539 oashc.HttpShardHandlerFactory.getParameter Setting maxConnectionsPerHost to: 20
   [junit4]   2> 133254 T539 oashc.HttpShardHandlerFactory.getParameter Setting corePoolSize to: 0
   [junit4]   2> 133254 T539 oashc.HttpShardHandlerFactory.getParameter Setting maximumPoolSize to: 2147483647
   [junit4]   2> 133254 T539 oashc.HttpShardHandlerFactory.getParameter Setting maxThreadIdleTime to: 5
   [junit4]   2> 133255 T539 oashc.HttpShardHandlerFactory.getParameter Setting sizeOfQueue to: -1
   [junit4]   2> 133255 T539 oashc.HttpShardHandlerFactory.getParameter Setting fairnessPolicy to: false
   [junit4]   2> 133260 T539 oasl.LogWatcher.createWatcher SLF4J impl is org.slf4j.impl.Log4jLoggerFactory
   [junit4]   2> 133260 T539 oasl.LogWatcher.newRegisteredLogWatcher Registering Log Listener [Log4j (org.slf4j.impl.Log4jLoggerFactory)]
   [junit4]   2> 133261 T539 oasc.CoreContainer.load Host Name: 
   [junit4]   2> 133264 T540 oasc.CoreContainer.create Creating SolrCore 'collection1' using instanceDir: /mnt/ssd/jenkins/workspace/Lucene-Solr-trunk-Linux/solr/build/solr-core/test-files/solr/collection1
   [junit4]   2> 133265 T540 oasc.SolrResourceLoader.<init> new SolrResourceLoader for directory: '/mnt/ssd/jenkins/workspace/Lucene-Solr-trunk-Linux/solr/build/solr-core/test-files/solr/collection1/'
   [junit4]   2> 133265 T540 oasc.SolrResourceLoader.replaceClassLoader Adding 'file:/mnt/ssd/jenkins/workspace/Lucene-Solr-trunk-Linux/solr/build/solr-core/test-files/solr/collection1/lib/classes/' to classloader
   [junit4]   2> 133266 T540 oasc.SolrResourceLoader.replaceClassLoader Adding 'file:/mnt/ssd/jenkins/workspace/Lucene-Solr-trunk-Linux/solr/build/solr-core/test-files/solr/collection1/lib/README' to classloader
   [junit4]   2> 133293 T540 oasc.SolrConfig.<init> Using Lucene MatchVersion: LUCENE_50
   [junit4]   2> 133318 T540 oasc.SolrConfig.<init> Loaded SolrConfig: solrconfig-basic.xml
   [junit4]   2> 133319 T540 oass.IndexSchema.readSchema Reading Solr Schema from schema-analytics.xml
   [junit4]   2> 133323 T540 oass.IndexSchema.readSchema [collection1] Schema name=schema-docValues
   [junit4]   2> 133346 T540 oass.IndexSchema.readSchema unique key field: id
   [junit4]   2> 133348 T540 oasc.SolrCore.initDirectoryFactory org.apache.solr.core.MockDirectoryFactory
   [junit4]   2> 133348 T540 oasc.SolrCore.<init> [collection1] Opening new SolrCore at /mnt/ssd/jenkins/workspace/Lucene-Solr-trunk-Linux/solr/build/solr-core/test-files/solr/collection1/, dataDir=/mnt/ssd/jenkins/workspace/Lucene-Solr-trunk-Linux/solr/build/solr-core/test/J0/./solrtest-ExpressionTest-1385918695507/
   [junit4]   2> 133348 T540 oasc.SolrCore.<init> JMX monitoring not detected for core: collection1
   [junit4]   2> 133349 T540 oasc.CachingDirectoryFactory.get return new directory for /mnt/ssd/jenkins/workspace/Lucene-Solr-trunk-Linux/solr/build/solr-core/test/J0/./solrtest-ExpressionTest-1385918695507
   [junit4]   2> 133349 T540 oasc.SolrCore.getNewIndexDir New index directory detected: old=null new=/mnt/ssd/jenkins/workspace/Lucene-Solr-trunk-Linux/solr/build/solr-core/test/J0/./solrtest-ExpressionTest-1385918695507/index/
   [junit4]   2> 133349 T540 oasc.SolrCore.initIndex WARN [collection1] Solr index directory '/mnt/ssd/jenkins/workspace/Lucene-Solr-trunk-Linux/solr/build/solr-core/test/J0/./solrtest-ExpressionTest-1385918695507/index' doesn't exist. Creating new index...
   [junit4]   2> 133350 T540 oasc.CachingDirectoryFactory.get return new directory for /mnt/ssd/jenkins/workspace/Lucene-Solr-trunk-Linux/solr/build/solr-core/test/J0/./solrtest-ExpressionTest-1385918695507/index
   [junit4]   2> 133350 T540 oasu.RandomMergePolicy.<init> RandomMergePolicy wrapping class org.apache.lucene.index.AlcoholicMergePolicy: [AlcoholicMergePolicy: minMergeSize=0, mergeFactor=10, maxMergeSize=1514715327, maxMergeSizeForForcedMerge=9223372036854775807, calibrateSizeByDeletes=true, maxMergeDocs=2147483647, maxCFSSegmentSizeMB=8.796093022207999E12, noCFSRatio=0.1]
   [junit4]   2> 133351 T540 oasc.SolrDeletionPolicy.onCommit SolrDeletionPolicy.onCommit: commits: num=1
   [junit4]   2> 		commit{dir=MockDirectoryWrapper(org.apache.lucene.store.RAMDirectory@455604eb lockFactory=org.apache.lucene.store.SingleInstanceLockFactory@d39bbae0),segFN=segments_1,generation=1}
   [junit4]   2> 133351 T540 oasc.SolrDeletionPolicy.updateCommits newest commit generation = 1
   [junit4]   2> 133352 T540 oasc.SolrCore.loadUpdateProcessorChains no updateRequestProcessorChain defined as default, creating implicit default
   [junit4]   2> 133352 T540 oasc.RequestHandlers.initHandlersFromConfig created standard: solr.StandardRequestHandler
   [junit4]   2> 133353 T540 oasc.RequestHandlers.initHandlersFromConfig created /update: solr.UpdateRequestHandler
   [junit4]   2> 133354 T540 oashl.XMLLoader.init xsltCacheLifetimeSeconds=60
   [junit4]   2> 133356 T540 oasu.CommitTracker.<init> Hard AutoCommit: disabled
   [junit4]   2> 133356 T540 oasu.CommitTracker.<init> Soft AutoCommit: disabled
   [junit4]   2> 133358 T540 oasu.RandomMergePolicy.<init> RandomMergePolicy wrapping class org.apache.lucene.index.TieredMergePolicy: [TieredMergePolicy: maxMergeAtOnce=46, maxMergeAtOnceExplicit=15, maxMergedSegmentMB=10.669921875, floorSegmentMB=2.173828125, forceMergeDeletesPctAllowed=1.9684768928228613, segmentsPerTier=46.0, maxCFSSegmentSizeMB=8.796093022207999E12, noCFSRatio=0.5299946473124797
   [junit4]   2> 133359 T540 oasc.SolrDeletionPolicy.onInit SolrDeletionPolicy.onInit: commits: num=1
   [junit4]   2> 		commit{dir=MockDirectoryWrapper(org.apache.lucene.store.RAMDirectory@455604eb lockFactory=org.apache.lucene.store.SingleInstanceLockFactory@d39bbae0),segFN=segments_1,generation=1}
   [junit4]   2> 133359 T540 oasc.SolrDeletionPolicy.updateCommits newest commit generation = 1
   [junit4]   2> 133359 T540 oass.SolrIndexSearcher.<init> Opening Searcher@ae603fb5 main
   [junit4]   2> 133360 T540 oasc.CoreContainer.registerCore registering core: collection1
   [junit4]   2> 133360 T541 oasc.SolrCore.registerSearcher [collection1] Registered new searcher Searcher@ae603fb5 main{StandardDirectoryReader(segments_1:1:nrt)}
   [junit4]   2> 133361 T539 oas.SolrTestCaseJ4.initCore ####initCore end
   [junit4]   2> ASYNC  NEW_CORE C195 name=collection1 org.apache.solr.core.SolrCore@2cb9c3c2
   [junit4]   2> 133365 T539 C195 oasu.DirectUpdateHandler2.deleteAll [collection1] REMOVING ALL DOCUMENTS FROM INDEX
   [junit4]   2> 133366 T539 C195 oasup.LogUpdateProcessor.finish [collection1] webapp=null path=null params={} {deleteByQuery=*:*} 0 1
   [junit4]   2> 133370 T539 C195 oasup.LogUpdateProcessor.finish [collection1] webapp=null path=null params={} {add=[10000]} 0 1
   [junit4]   2> 133377 T539 C195 oasup.LogUpdateProcessor.finish [collection1] webapp=null path=null params={} {add=[10001]} 0 1
   [junit4]   2> 133382 T539 C195 oasup.LogUpdateProcessor.finish [collection1] webapp=null path=null params={} {add=[10002]} 0 1
   [junit4]   2> 133387 T539 C195 oasup.LogUpdateProcessor.finish [collection1] webapp=null path=null params={} {add=[10003]} 0 1
   [junit4]   2> 133392 T539 C195 oasup.LogUpdateProcessor.finish [collection1] webapp=null path=null params={} {add=[10004]} 0 1
   [junit4]   2> 133397 T539 C195 oasup.LogUpdateProcessor.finish [collection1] webapp=null path=null params={} {add=[10005]} 0 1
   [junit4]   2> 133403 T539 C195 oasup.LogUpdateProcessor.finish [collection1] webapp=null path=null params={} {add=[10006]} 0 1
   [junit4]   2> 133408 T539 C195 oasup.LogUpdateProcessor.finish [collection1] webapp=null path=null params={} {add=[10007]} 0 1
   [junit4]   2> 133413 T539 C195 oasup.LogUpdateProcessor.finish [collection1] webapp=null path=null params={} {add=[10008]} 0 1
   [junit4]   2> 133417 T539 C195 oasup.LogUpdateProcessor.finish [collection1] webapp=null path=null params={} {add=[10009]} 0 0
   [junit4]   2> 133422 T539 C195 oasup.LogUpdateProcessor.finish [collection1] webapp=null path=null params={} {add=[100010]} 0 0
   [junit4]   2> 133427 T539 C195 oasup.LogUpdateProcessor.finish [collection1] webapp=null path=null params={} {add=[100011]} 0 1
   [junit4]   2> 133432 T539 C195 oasup.LogUpdateProcessor.finish [collection1] webapp=null path=null params={} {add=[100012]} 0 1
   [junit4]   2> 133437 T539 C195 oasup.LogUpdateProcessor.finish [collection1] webapp=null path=null params={} {add=[100013]} 0 1
   [junit4]   2> 133442 T539 C195 oasup.LogUpdateProcessor.finish [collection1] webapp=null path=null params={} {add=[100014]} 0 1
   [junit4]   2> 133447 T539 C195 oasup.LogUpdateProcessor.finish [collection1] webapp=null path=null params={} {add=[100015]} 0 0
   [junit4]   2> 133452 T539 C195 oasup.LogUpdateProcessor.finish [collection1] webapp=null path=null params={} {add=[100016]} 0 0
   [junit4]   2> 133457 T539 C195 oasup.LogUpdateProcessor.finish [collection1] webapp=null path=null params={} {add=[100017]} 0 0
   [junit4]   2> 133462 T539 C195 oasup.LogUpdateProcessor.finish [collection1] webapp=null path=null params={} {add=[100018]} 0 1
   [junit4]   2> 133467 T539 C195 oasup.LogUpdateProcessor.finish [collection1] webapp=null path=null params={} {add=[100019]} 0 1
   [junit4]   2> 133472 T539 C195 oasup.LogUpdateProcessor.finish [collection1] webapp=null path=null params={} {add=[100020]} 0 1
   [junit4]   2> 133477 T539 C195 oasup.LogUpdateProcessor.finish [collection1] webapp=null path=null params={} {add=[100021]} 0 1
   [junit4]   2> 133481 T539 C195 oasup.LogUpdateProcessor.finish [collection1] webapp=null path=null params={} {add=[100022]} 0 0
   [junit4]   2> 133486 T539 C195 oasup.LogUpdateProcessor.finish [collection1] webapp=null path=null params={} {add=[100023]} 0 0
   [junit4]   2> 133491 T539 C195 oasup.LogUpdateProcessor.finish [collection1] webapp=null path=null params={} {add=[100024]} 0 0
   [junit4]   2> 133497 T539 C195 oasup.LogUpdateProcessor.finish [collection1] webapp=null path=null params={} {add=[100025]} 0 1
   [junit4]   2> 133502 T539 C195 oasup.LogUpdateProcessor.finish [collection1] webapp=null path=null params={} {add=[100026]} 0 1
   [junit4]   2> 133507 T539 C195 oasup.LogUpdateProcessor.finish [collection1] webapp=null path=null params={} {add=[100027]} 0 1
   [junit4]   2> 133512 T539 C195 oasup.LogUpdateProcessor.finish [collection1] webapp=null path=null params={} {add=[100028]} 0 1
   [junit4]   2> 133517 T539 C195 oasup.LogUpdateProcessor.finish [collection1] webapp=null path=null params={} {add=[100029]} 0 1
   [junit4]   2> 133522 T539 C195 oasup.LogUpdateProcessor.finish [collection1] webapp=null path=null params={} {add=[100030]} 0 1
   [junit4]   2> 133527 T539 C195 oasup.LogUpdateProcessor.finish [collection1] webapp=null path=null params={} {add=[100031]} 0 1
   [junit4]   2> 133534 T539 C195 oasup.LogUpdateProcessor.finish [collection1] webapp=null path=null params={} {add=[100032]} 0 1
   [junit4]   2> 133540 T539 C195 oasup.LogUpdateProcessor.finish [collection1] webapp=null path=null params={} {add=[100033]} 0 1
   [junit4]   2> 133545 T539 C195 oasup.LogUpdateProcessor.finish [collection1] webapp=null path=null params={} {add=[100034]} 0 0
   [junit4]   2> 133550 T539 C195 oasup.LogUpdateProcessor.finish [collection1] webapp=null path=null params={} {add=[100035]} 0 0
   [junit4]   2> 133555 T539 C195 oasup.LogUpdateProcessor.finish [collection1] webapp=null path=null params={} {add=[100036]} 0 0
   [junit4]   2> ASYNC  NEW_CORE C196 name=collection1 org.apache.solr.core.SolrCore@2cb9c3c2
   [junit4]   2> 133566 T539 C196 oasup.LogUpdateProcessor.finish [collection1] webapp=null path=null params={} {add=[100037]} 0 1
   [junit4]   2> 133570 T539 C196 oasup.LogUpdateProcessor.finish [collection1] webapp=null path=null params={} {add=[100038]} 0 0
   [junit4]   2> 133575 T539 C196 oasup.LogUpdateProcessor.finish [collection1] webapp=null path=null params={} {add=[100039]} 0 0
   [junit4]   2> 133580 T539 C196 oasup.LogUpdateProcessor.finish [collection1] webapp=null path=null params={} {add=[100040]} 0 1
   [junit4]   2> 133585 T539 C196 oasup.LogUpdateProcessor.finish [collection1] webapp=null path=null params={} {add=[100041]} 0 1
   [junit4]   2> 133589 T539 C196 oasup.LogUpdateProcessor.finish [collection1] webapp=null path=null params={} {add=[100042]} 0 0
   [junit4]   2> 133594 T539 C196 oasup.LogUpdateProcessor.finish [collection1] webapp=null path=null params={} {add=[100043]} 0 0
   [junit4]   2> 133599 T539 C196 oasup.LogUpdateProcessor.finish [collection1] webapp=null path=null params={} {add=[100044]} 0 1
   [junit4]   2> 133604 T539 C196 oasup.LogUpdateProcessor.finish [collection1] webapp=null path=null params={} {add=[100045]} 0 1
   [junit4]   2> 133608 T539 C196 oasup.LogUpdateProcessor.finish [collection1] webapp=null path=null params={} {add=[100046]} 0 0
   [junit4]   2> 133613 T539 C196 oasup.LogUpdateProcessor.finish [collection1] webapp=null path=null params={} {add=[100047]} 0 0
   [junit4]   2> 133618 T539 C196 oasup.LogUpdateProcessor.finish [collection1] webapp=null path=null params={} {add=[100048]} 0 1
   [junit4]   2> 133623 T539 C196 oasup.LogUpdateProcessor.finish [collection1] webapp=null path=null params={} {add=[100049]} 0 1
   [junit4]   2> 133628 T539 C196 oasup.LogUpdateProcessor.finish [collection1] webapp=null path=null params={} {add=[100050]} 0 1
   [junit4]   2> 133633 T539 C196 oasup.LogUpdateProcessor.finish [collection1] webapp=null path=null params={} {add=[100051]} 0 1
   [junit4]   2> 133638 T539 C196 oasup.LogUpdateProcessor.finish [collection1] webapp=null path=null params={} {add=[100052]} 0 1
   [junit4]   2> 133643 T539 C196 oasup.LogUpdateProcessor.finish [collection1] webapp=null path=null params={} {add=[100053]} 0 1
   [junit4]   2> 133648 T539 C196 oasup.LogUpdateProcessor.finish [collection1] webapp=null path=null params={} {add=[100054]} 0 1
   [junit4]   2> 133653 T539 C196 oasup.LogUpdateProcessor.finish [collection1] webapp=null path=null params={} {add=[100055]} 0 0
   [junit4]   2> 133660 T539 C196 oasup.LogUpdateProcessor.finish [collection1] webapp=null path=null params={} {add=[100056]} 0 1
   [junit4]   2> 133665 T539 C196 oasup.LogUpdateProcessor.finish [collection1] webapp=null path=null params={} {add=[100057]} 0 0
   [junit4]   2> 133670 T539 C196 oasup.LogUpdateProcessor.finish [collection1] webapp=null path=null params={} {add=[100058]} 0 1
   [junit4]   2> 133675 T539 C196 oasup.LogUpdateProcessor.finish [collection1] webapp=null path=null params={} {add=[100059]} 0 1
   [junit4]   2> 133680 T539 C196 oasup.LogUpdateProcessor.finish [collection1] webapp=null path=null params={} {add=[100060]} 0 1
   [junit4]   2> 133684 T539 C196 oasup.LogUpdateProcessor.finish [collection1] webapp=null path=null params={} {add=[100061]} 0 0
   [junit4]   2> 133689 T539 C196 oasup.LogUpdateProcessor.finish [collection1] webapp=null path=null params={} {add=[100062]} 0 0
   [junit4]   2> 133694 T539 C196 oasup.LogUpdateProcessor.finish [collection1] webapp=null path=null params={} {add=[100063]} 0 1
   [junit4]   2> 133699 T539 C196 oasup.LogUpdateProcessor.finish [collection1] webapp=null path=null params={} {add=[100064]} 0 1
   [junit4]   2> 133704 T539 C196 oasup.LogUpdateProcessor.finish [collection1] webapp=null path=null params={} {add=[100065]} 0 1
   [junit4]   2> 133708 T539 C196 oasup.LogUpdateProcessor.finish [collection1] webapp=null path=null params={} {add=[100066]} 0 0
   [junit4]   2> 133713 T539 C196 oasup.LogUpdateProcessor.finish [collection1] webapp=null path=null params={} {add=[100067]} 0 0
   [junit4]   2> 133718 T539 C196 oasup.LogUpdateProcessor.finish [collection1] webapp=null path=null params={} {add=[100068]} 0 0
   [junit4]   2> 133723 T539 C196 oasup.LogUpdateProcessor.finish [collection1] webapp=null path=null params={} {add=[100069]} 0 1
   [junit4]   2> 133728 T539 C196 oasup.LogUpdateProcessor.finish [collection1] webapp=null path=null params={} {add=[100070]} 0 1
   [junit4]   2> 133733 T539 C196 oasup.LogUpdateProcessor.finish [collection1] webapp=null path=null params={} {add=[100071]} 0 1
   [junit4]   2> 133738 T539 C196 oasup.LogUpdateProcessor.finish [collection1] webapp=null path=null params={} {add=[100072]} 0 1
   [junit4]   2> 133743 T539 C196 oasup.LogUpdateProcessor.finish [collection1] webapp=null path=null params={} {add=[100073]} 0 1
   [junit4]   2> 133747 T539 C196 oasup.LogUpdateProcessor.finish [collection1] webapp=null path=null params={} {add=[100074]} 0 0
   [junit4]   2> 133752 T539 C196 oasup.LogUpdateProcessor.finish [collection1] webapp=null path=null params={} {add=[100075]} 0 1
   [junit4]   2> 133757 T539 C196 oasup.LogUpdateProcessor.finish [collection1] webapp=null path=null params={} {add=[100076]} 0 1
   [junit4]   2> 133762 T539 C196 oasup.LogUpdateProcessor.finish [collection1] webapp=null path=null params={} {add=[100077]} 0 1
   [junit4]   2> 133766 T539 C196 oasup.LogUpdateProcessor.finish [collection1] webapp=null path=null params={} {add=[100078]} 0 0
   [junit4]   2> 133771 T539 C196 oasup.LogUpdateProcessor.finish [collection1] webapp=null path=null params={} {add=[100079]} 0 0
   [junit4]   2> 133777 T539 C196 oasup.LogUpdateProcessor.finish [collection1] webapp=null path=null params={} {add=[100080]} 0 1
   [junit4]   2> 133784 T539 C196 oasup.LogUpdateProcessor.finish [collection1] webapp=null path=null params={} {add=[100081]} 0 1
   [junit4]   2> 133791 T539 C196 oasup.LogUpdateProcessor.finish [collection1] webapp=null path=null params={} {add=[100082]} 0 0
   [junit4]   2> 133799 T539 C196 oasup.LogUpdateProcessor.finish [collection1] webapp=null path=null params={} {add=[100083]} 0 0
   [junit4]   2> 133807 T539 C196 oasup.LogUpdateProcessor.finish [collection1] webapp=null path=null params={} {add=[100084]} 0 1
   [junit4]   2> 133814 T539 C196 oasup.LogUpdateProcessor.finish [collection1] webapp=null path=null params={} {add=[100085]} 0 0
   [junit4]   2> 133822 T539 C196 oasup.LogUpdateProcessor.finish [collection1] webapp=null path=null params={} {add=[100086]} 0 1
   [junit4]   2> 133829 T539 C196 oasup.LogUpdateProcessor.finish [collection1] webapp=null path=null params={} {add=[100087]} 0 0
   [junit4]   2> 133835 T539 C196 oasup.LogUpdateProcessor.finish [collection1] webapp=null path=null params={} {add=[100088]} 0 1
   [junit4]   2> 133840 T539 C196 oasup.LogUpdateProcessor.finish [collection1] webapp=null path=null params={} {add=[100089]} 0 1
   [junit4]   2> 133845 T539 C196 oasup.LogUpdateProcessor.finish [collection1] webapp=null path=null params={} {add=[100090]} 0 1
   [junit4]   2> 133850 T539 C196 oasup.LogUpdateProcessor.finish [collection1] webapp=null path=null params={} {add=[100091]} 0 1
   [junit4]   2> 133855 T539 C196 oasup.LogUpdateProcessor.finish [collection1] webapp=null path=null params={} {add=[100092]} 0 1
   [junit4]   2> 133860 T539 C196 oasup.LogUpdateProcessor.finish [collection1] webapp=null path=null params={} {add=[100093]} 0 1
   [junit4]   2> 133865 T539 C196 oasup.LogUpdateProcessor.finish [collection1] webapp=null path=null params={} {add=[100094]} 0 1
   [junit4]   2> 133870 T539 C196 oasup.LogUpdateProcessor.finish [collection1] webapp=null path=null params={} {add=[100095]} 0 1
   [junit4]   2> 133875 T539 C196 oasup.LogUpdateProcessor.finish [collection1] webapp=null path=null params={} {add=[100096]} 0 1
   [junit4]   2> 133880 T539 C196 oasup.LogUpdateProcessor.finish [collection1] webapp=null path=null params={} {add=[100097]} 0 0
   [junit4]   2> 133885 T539 C196 oasup.LogUpdateProcessor.finish [collection1] webapp=null path=null params={} {add=[100098]} 0 0
   [junit4]   2> 133890 T539 C196 oasup.LogUpdateProcessor.finish [collection1] webapp=null path=null params={} {add=[100099]} 0 0
   [junit4]   2> 133895 T539 C196 oasu.DirectUpdateHandler2.commit start commit{,optimize=false,openSearcher=true,waitSearcher=true,expungeDeletes=false,softCommit=false,prepareCommit=false}
   [junit4]   2> 133919 T539 C196 oasc.SolrDeletionPolicy.onCommit SolrDeletionPolicy.onCommit: commits: num=2
   [junit4]   2> 		commit{dir=MockDirectoryWrapper(org.apache.lucene.store.RAMDirectory@455604eb lockFactory=org.apache.lucene.store.SingleInstanceLockFactory@d39bbae0),segFN=segments_1,generation=1}
   [junit4]   2> 		commit{dir=MockDirectoryWrapper(org.apache.lucene.store.RAMDirectory@455604eb lockFactory=org.apache.lucene.store.SingleInstanceLockFactory@d39bbae0),segFN=segments_2,generation=2}
   [junit4]   2> 133919 T539 C196 oasc.SolrDeletionPolicy.updateCommits newest commit generation = 2
   [junit4]   2> 133927 T539 C196 oass.SolrIndexSearcher.<init> Opening Searcher@b94c4bdc main
   [junit4]   2> 133929 T539 C196 oasu.DirectUpdateHandler2.commit end_commit_flush
   [junit4]   2> 133929 T541 oasc.SolrCore.registerSearcher [collection1] Registered new searcher Searcher@b94c4bdc main{StandardDirectoryReader(segments_2:4:nrt _0(5.0):C100)}
   [junit4]   2> 133930 T539 C196 oasup.LogUpdateProcessor.finish [collection1] webapp=null path=null params={} {commit=} 0 35
   [junit4]   2> 133972 T539 C196 oasc.SolrCore.execute [collection1] webapp=null path=null params={stats=true&o.csr.s.cs2=const_str(this+is+the+second)&o.pr.s.mean=mean(int_id)&o.cr.s.ccmin=concat(const_str(this+is+the+first),min(string_sd))&o.dmr.s.max=max(date_dtd)&o.mr.s.count=count(long_ld)&o.cdr.s.cs1=const_str(1800-12-31T23:59:59Z)&o.cr.s.min=min(string_sd)&o.dr.s.su=div(sum(int_id),unique(long_ld))&o.mr.s.median=median(int_id)&o.nr.s.s=neg(sum(int_id))&o.cr.s.csmax=const_str(this+is+the+second)&o.dr.s.mean=mean(int_id)&o.pr.s.mc=pow(mean(int_id),count(long_ld))&o.avr.s.count=count(long_ld)&o.cdr.s.cd1=const_date(1800-12-31T23:59:59Z)&o.cdr.s.cd2=const_date(1804-06-30T23:59:59Z)&o.ar.s.mcm=add(mean(int_id),count(long_ld),median(int_id))&o.pr.s.su=pow(sum(int_id),unique(long_ld))&rows=0&o.dr.s.mc=div(mean(int_id),count(long_ld))&o.ar.s.unique=unique(long_ld)&o.csr.s.cs3=const_str(this+is+the+third)&o.dmr.s.dmma=date_math(max(date_dtd),const_str(%2B2MONTHS))&o.ar.s.median=median(int_id)&o.csr.s.cs1=const_str(this+is+the+first)&o.ar.s.su=add(sum(int_id),unique(long_ld))&o.mr.s.mean=mean(int_id)&o.cr.s.ccmax=concat(const_str(this+is+the+second),max(string_sd))&o.cdr.s.cs2=const_str(1804-06-30T23:59:59Z)&o.dmr.s.median=median(date_dtd)&o.mr.s.unique=unique(long_ld)&o.pr.s.count=count(long_ld)&olap=true&o.avr.s.c=abs(neg(count(long_ld)))&o.rr.s.max=max(string_sd)&o.mr.s.sum=sum(int_id)&o.cnr.s.c8=const_num(8)&o.mr.s.su=mult(sum(int_id),unique(long_ld))&indent=true&o.dr.s.unique=unique(long_ld)&o.dr.s.count=count(long_ld)&o.ar.s.mean=mean(int_id)&o.avr.s.s=abs(neg(sum(int_id)))&o.mr.s.mcm=mult(mean(int_id),count(long_ld),median(int_id))&o.avr.s.sum=sum(int_id)&o.nr.s.sum=sum(int_id)&o.pr.s.unique=unique(long_ld)&o.cnr.s.c10=const_num(10)&o.dr.s.sum=sum(int_id)&o.ar.s.count=count(long_ld)&o.dmr.s.dmme=date_math(median(date_dtd),const_str(%2B2YEARS))&o.rr.s.rmin=rev(min(string_sd))&o.cr.s.max=max(string_sd)&o.rr.s.rmax=rev(max(string_sd))&o.ar.s.sum=sum(int_id)&o.nr.s.count=count(long_ld)&o.pr.s.sum=sum(int_id)&o.rr.s.min=min(string_sd)&o.cr.s.csmin=const_str(this+is+the+first)&o.dmr.s.cma=const_str(%2B2MONTHS)&q=*:*&o.dmr.s.cme=const_str(%2B2YEARS)&o.nr.s.c=neg(count(long_ld))} hits=100 status=0 QTime=38 
   [junit4]   2> 133982 T539 oas.SolrTestCaseJ4.setUp ###Starting divideTest
   [junit4]   2> 133989 T539 oas.SolrTestCaseJ4.tearDown ###Ending divideTest
   [junit4]   2> 133996 T539 oas.SolrTestCaseJ4.setUp ###Starting concatenateTest
   [junit4]   2> 134002 T539 oas.SolrTestCaseJ4.tearDown ###Ending concatenateTest
   [junit4]   2> 134009 T539 oas.SolrTestCaseJ4.setUp ###Starting constantDateTest
   [junit4]   2> 134015 T539 oas.SolrTestCaseJ4.tearDown ###Ending constantDateTest
   [junit4]   2> 134021 T539 oas.SolrTestCaseJ4.setUp ###Starting constantStringTest
   [junit4]   2> 134023 T539 oas.SolrTestCaseJ4.tearDown ###Ending constantStringTest
   [junit4]   2> 134027 T539 oas.SolrTestCaseJ4.setUp ###Starting powerTest
   [junit4]   2> 134032 T539 oas.SolrTestCaseJ4.tearDown ###Ending powerTest
   [junit4]   2> 134036 T539 oas.SolrTestCaseJ4.setUp ###Starting reverseTest
   [junit4]   2> 134039 T539 oas.SolrTestCaseJ4.tearDown ###Ending reverseTest
   [junit4]   2> 134047 T539 oas.SolrTestCaseJ4.setUp ###Starting addTest
   [junit4]   2> 134052 T539 oas.SolrTestCaseJ4.tearDown ###Ending addTest
   [junit4]   2> 134057 T539 oas.SolrTestCaseJ4.setUp ###Starting negateTest
   [junit4]   2> 134060 T539 oas.SolrTestCaseJ4.tearDown ###Ending negateTest
   [junit4]   2> 134065 T539 oas.SolrTestCaseJ4.setUp ###Starting dateMathTest
   [junit4]   2> 134070 T539 oas.SolrTestCaseJ4.tearDown ###Ending dateMathTest
   [junit4]   2> 134077 T539 oas.SolrTestCaseJ4.setUp ###Starting absoluteValueTest
   [junit4]   2> 134082 T539 oas.SolrTestCaseJ4.tearDown ###Ending absoluteValueTest
   [junit4]   2> 134090 T539 oas.SolrTestCaseJ4.setUp ###Starting multiplyTest
   [junit4]   2> 134092 T539 oas.SolrTestCaseJ4.tearDown ###Ending multiplyTest
   [junit4]   2> NOTE: reproduce with: ant test  -Dtestcase=ExpressionTest -Dtests.method=multiplyTest -Dtests.seed=865248978DC22F8C -Dtests.multiplier=3 -Dtests.slow=true -Dtests.locale=th_TH_TH_#u-nu-thai -Dtests.timezone=Europe/Prague -Dtests.file.encoding=ISO-8859-1
   [junit4] FAILURE 0.02s J0 | ExpressionTest.multiplyTest <<<
   [junit4]    > Throwable #1: java.lang.AssertionError: Caught exception in getStatResult, xPath = /response/lst[@name='stats']/lst[@name='mr']/double[@name='sum'] 
   [junit4]    > raw data: <?xml version="1.0" encoding="UTF-8"?>
   [junit4]    > <response>
   [junit4]    > <lst name="responseHeader">
   [junit4]    >   <int name="status">0</int>
   [junit4]    >   <int name="QTime">38</int>
   [junit4]    > </lst>
   [junit4]    > <result name="response" numFound="100" start="0">
   [junit4]    > </result>
   [junit4]    > <lst name="stats">
   [junit4]    >   <lst name="stats_fields"/>
   [junit4]    > </lst>
   [junit4]    > <lst name="stats">
   [junit4]    >   <lst name="cnr">
   [junit4]    >     <double name="c10">10.0</double>
   [junit4]    >     <double name="c8">8.0</double>
   [junit4]    >   </lst>
   [junit4]    >   <lst name="dr">
   [junit4]    >     <long name="count">100</long>
   [junit4]    >     <double name="mc">0.2891</double>
   [junit4]    >     <double name="mean">28.91</double>
   [junit4]    >     <double name="su">80.30555555555556</double>
   [junit4]    >     <double name="sum">2891.0</double>
   [junit4]    >     <long name="unique">36</long>
   [junit4]    >   </lst>
   [junit4]    >   <lst name="cr">
   [junit4]    >     <str name="ccmax">this is the secondstr9</str>
   [junit4]    >     <str name="ccmin">this is the firststr0</str>
   [junit4]    >     <str name="csmax">this is the second</str>
   [junit4]    >     <str name="csmin">this is the first</str>
   [junit4]    >     <str name="max">str9</str>
   [junit4]    >     <str name="min">str0</str>
   [junit4]    >   </lst>
   [junit4]    >   <lst name="pr">
   [junit4]    >     <long name="count">100</long>
   [junit4]    >     <double name="mc">1.2729436151389237E146</double>
   [junit4]    >     <double name="mean">28.91</double>
   [junit4]    >     <double name="su">3.9603293116911423E124</double>
   [junit4]    >     <double name="sum">2891.0</double>
   [junit4]    >     <long name="unique">36</long>
   [junit4]    >   </lst>
   [junit4]    >   <lst name="mr">
   [junit4]    >     <long name="count">100</long>
   [junit4]    >     <null name="mcm"/>
   [junit4]    >     <null name="mean"/>
   [junit4]    >     <null name="median"/>
   [junit4]    >     <null name="su"/>
   [junit4]    >     <null name="sum"/>
   [junit4]    >     <null name="unique"/>
   [junit4]    >   </lst>
   [junit4]    >   <lst name="avr">
   [junit4]    >     <double name="c">100.0</double>
   [junit4]    >     <long name="count">100</long>
   [junit4]    >     <double name="s">2891.0</double>
   [junit4]    >     <double name="sum">2891.0</double>
   [junit4]    >   </lst>
   [junit4]    >   <lst name="cdr">
   [junit4]    >     <date name="cd1">1800-12-31T23:59:59Z</date>
   [junit4]    >     <date name="cd2">1804-06-30T23:59:59Z</date>
   [junit4]    >     <str name="cs1">1800-12-31T23:59:59Z</str>
   [junit4]    >     <str name="cs2">1804-06-30T23:59:59Z</str>
   [junit4]    >   </lst>
   [junit4]    >   <lst name="dmr">
   [junit4]    >     <str name="cma">+2MONTHS</str>
   [junit4]    >     <str name="cme">+2YEARS</str>
   [junit4]    >     <date name="dmma">1812-02-29T23:59:59Z</date>
   [junit4]    >     <date name="dmme">1807-12-31T23:59:59Z</date>
   [junit4]    >     <date name="max">1811-12-31T23:59:59Z</date>
   [junit4]    >     <date name="median">1805-12-31T23:59:59Z</date>
   [junit4]    >   </lst>
   [junit4]    >   <lst name="rr">
   [junit4]    >     <str name="max">str9</str>
   [junit4]    >     <str name="min">str0</str>
   [junit4]    >     <str name="rmax">9rts</str>
   [junit4]    >     <str name="rmin">0rts</str>
   [junit4]    >   </lst>
   [junit4]    >   <lst name="ar">
   [junit4]    >     <long name="count">100</long>
   [junit4]    >     <double name="mcm">153.41</double>
   [junit4]    >     <double name="mean">28.91</double>
   [junit4]    >     <double name="median">24.5</double>
   [junit4]    >     <double name="su">2927.0</double>
   [junit4]    >     <double name="sum">2891.0</double>
   [junit4]    >     <long name="unique">36</long>
   [junit4]    >   </lst>
   [junit4]    >   <lst name="csr">
   [junit4]    >     <str name="cs1">this is the first</str>
   [junit4]    >     <str name="cs2">this is the second</str>
   [junit4]    >     <str name="cs3">this is the third</str>
   [junit4]    >   </lst>
   [junit4]    >   <lst name="nr">
   [junit4]    >     <double name="c">-100.0</double>
   [junit4]    >     <long name="count">100</long>
   [junit4]    >     <double name="s">-2891.0</double>
   [junit4]    >     <double name="sum">2891.0</double>
   [junit4]    >   </lst>
   [junit4]    > </lst>
   [junit4]    > </response>
   [junit4]    > 	at __randomizedtesting.SeedInfo.seed([865248978DC22F8C:EDD356E9B8CC19E2]:0)
   [junit4]    > 	at org.apache.solr.analytics.AbstractAnalyticsStatsTest.getStatResult(AbstractAnalyticsStatsTest.java:113)
   [junit4]    > 	at org.apache.solr.analytics.expression.ExpressionTest.multiplyTest(ExpressionTest.java:92)
   [junit4]    > 	at java.lang.Thread.run(Thread.java:780)
   [junit4]   2> 134107 T539 oas.SolrTestCaseJ4.setUp ###Starting constantNumberTest
   [junit4]   2> 134110 T539 oas.SolrTestCaseJ4.tearDown ###Ending constantNumberTest
   [junit4]   2> 134112 T539 oas.SolrTestCaseJ4.deleteCore ###deleteCore
   [junit4]   2> 134112 T539 oasc.CoreContainer.shutdown Shutting down CoreContainer instance=1424968760
   [junit4]   2> 134113 T539 oasc.SolrCore.close [collection1]  CLOSING SolrCore org.apache.solr.core.SolrCore@2cb9c3c2
   [junit4]   2> 134113 T539 oasu.DirectUpdateHandler2.close closing DirectUpdateHandler2{commits=1,autocommits=0,soft autocommits=0,optimizes=0,rollbacks=0,expungeDeletes=0,docsPending=0,adds=0,deletesById=0,deletesByQuery=0,errors=0,cumulative_adds=100,cumulative_deletesById=0,cumulative_deletesByQuery=1,cumulative_errors=0}
   [junit4]   2> 134114 T539 oasu.SolrCoreState.decrefSolrCoreState Closing SolrCoreState
   [junit4]   2> 134114 T539 oasu.DefaultSolrCoreState.closeIndexWriter SolrCoreState ref count has reached 0 - closing IndexWriter
   [junit4]   2> 134115 T539 oasu.DefaultSolrCoreState.closeIndexWriter closing IndexWriter with IndexWriterCloser
   [junit4]   2> 134119 T539 oasc.SolrCore.closeSearcher [collection1] Closing main searcher on request.
   [junit4]   2> 134119 T539 oasc.CachingDirectoryFactory.close Closing MockDirectoryFactory - 2 directories currently being tracked
   [junit4]   2> 134120 T539 oasc.CachingDirectoryFactory.closeCacheValue looking to close /mnt/ssd/jenkins/workspace/Lucene-Solr-trunk-Linux/solr/build/solr-core/test/J0/./solrtest-ExpressionTest-1385918695507 [CachedDir<<refCount=0;path=/mnt/ssd/jenkins/workspace/Lucene-Solr-trunk-Linux/solr/build/solr-core/test/J0/./solrtest-ExpressionTest-1385918695507;done=false>>]
   [junit4]   2> 134120 T539 oasc.CachingDirectoryFactory.close Closing directory: /mnt/ssd/jenkins/workspace/Lucene-Solr-trunk-Linux/solr/build/solr-core/test/J0/./solrtest-ExpressionTest-1385918695507
   [junit4]   2> 134121 T539 oasc.CachingDirectoryFactory.closeCacheValue looking to close /mnt/ssd/jenkins/workspace/Lucene-Solr-trunk-Linux/solr/build/solr-core/test/J0/./solrtest-ExpressionTest-1385918695507/index [CachedDir<<refCount=0;path=/mnt/ssd/jenkins/workspace/Lucene-Solr-trunk-Linux/solr/build/solr-core/test/J0/./solrtest-ExpressionTest-1385918695507/index;done=false>>]
   [junit4]   2> 134121 T539 oasc.CachingDirectoryFactory.close Closing directory: /mnt/ssd/jenkins/workspace/Lucene-Solr-trunk-Linux/solr/build/solr-core/test/J0/./solrtest-ExpressionTest-1385918695507/index
   [junit4]   2> NOTE: test params are: codec=Lucene46: {string_sd=PostingsFormat(name=FSTPulsing41), float_fd=PostingsFormat(name=FSTPulsing41), id=FST41, int_id=PostingsFormat(name=FSTPulsing41), double_dd=PostingsFormat(name=MockRandom), long_ld=FST41, date_dtd=FST41}, docValues:{intdv=DocValuesFormat(name=SimpleText), int_id=DocValuesFormat(name=SimpleText), stringdvm=DocValuesFormat(name=Memory), long_ld=DocValuesFormat(name=Disk), stringdv=DocValuesFormat(name=Disk), floatdv=DocValuesFormat(name=Memory), float_fd=DocValuesFormat(name=Disk), string_sd=DocValuesFormat(name=SimpleText), longdv=DocValuesFormat(name=Memory), date_dtd=DocValuesFormat(name=Disk), datedv=DocValuesFormat(name=Lucene45), double_dd=DocValuesFormat(name=Memory), doubledv=DocValuesFormat(name=Disk)}, sim=DefaultSimilarity, locale=th_TH_TH_#u-nu-thai, timezone=Europe/Prague
   [junit4]   2> NOTE: Linux 3.8.0-33-generic amd64/IBM Corporation 1.7.0 (64-bit)/cpus=8,threads=1,free=106032912,total=168886272
   [junit4]   2> NOTE: All tests run in this JVM: [TestShardHandlerFactory, ShardRoutingTest, TestFunctionQuery, TestSort, DateMathParserTest, IndexSchemaTest, SOLR749Test, TestSimpleQParserPlugin, InfoHandlerTest, TestModifyConfFiles, TestSuggestSpellingConverter, TestNonNRTOpen, SliceStateTest, TestPerFieldSimilarity, TestSolrIndexConfig, BJQParserTest, TestSolrDeletionPolicy1, RangeFacetTest, TestDistributedMissingSort, SpellPossibilityIteratorTest, UpdateParamsTest, FieldMutatingUpdateProcessorTest, TestNoOpRegenerator, TestDocSet, TestQueryUtils, FunctionTest, DistributedTermsComponentTest, DistributedQueryElevationComponentTest, DeleteInactiveReplicaTest, JsonLoaderTest, DocumentBuilderTest, BasicFunctionalityTest, TestRemoteStreaming, MBeansHandlerTest, TestStressUserVersions, TestInfoStreamLogging, TestValueSourceCache, TestNRTOpen, SolrCoreTest, LukeRequestHandlerTest, TestConfig, LeaderElectionTest, TestElisionMultitermQuery, URLClassifyProcessorTest, HdfsSyncSliceTest, TestDefaultSearchFieldResource, CacheHeaderTest, MoreLikeThisHandlerTest, CopyFieldTest, TermsComponentTest, TestMaxScoreQueryParser, UUIDFieldTest, ExpressionTest]
   [junit4] Completed on J0 in 1.06s, 12 tests, 1 failure <<< FAILURES!

[...truncated 103 lines...]
   [junit4] Suite: org.apache.solr.update.processor.SignatureUpdateProcessorFactoryTest
   [junit4]   2> 224801 T668 oas.SolrTestCaseJ4.initCore ####initCore
   [junit4]   2> Creating dataDir: /mnt/ssd/jenkins/workspace/Lucene-Solr-trunk-Linux/solr/build/solr-core/test/J1/./solrtest-SignatureUpdateProcessorFactoryTest-1385918787955
   [junit4]   2> 224802 T668 oasc.SolrResourceLoader.<init> new SolrResourceLoader for directory: '/mnt/ssd/jenkins/workspace/Lucene-Solr-trunk-Linux/solr/build/solr-core/test-files/solr/collection1/'
   [junit4]   2> 224802 T668 oasc.SolrResourceLoader.replaceClassLoader Adding 'file:/mnt/ssd/jenkins/workspace/Lucene-Solr-trunk-Linux/solr/build/solr-core/test-files/solr/collection1/lib/classes/' to classloader
   [junit4]   2> 224803 T668 oasc.SolrResourceLoader.replaceClassLoader Adding 'file:/mnt/ssd/jenkins/workspace/Lucene-Solr-trunk-Linux/solr/build/solr-core/test-files/solr/collection1/lib/README' to classloader
   [junit4]   2> 224851 T668 oasc.SolrConfig.<init> Using Lucene MatchVersion: LUCENE_50
   [junit4]   2> 224901 T668 oasc.SolrConfig.<init> Loaded SolrConfig: solrconfig.xml
   [junit4]   2> 224902 T668 oass.IndexSchema.readSchema Reading Solr Schema from schema12.xml
   [junit4]   2> 224907 T668 oass.IndexSchema.readSchema [null] Schema name=test
   [junit4]   2> 225202 T668 oass.IndexSchema.readSchema default search field in schema is text
   [junit4]   2> 225205 T668 oass.IndexSchema.readSchema unique key field: id
   [junit4]   2> 225206 T668 oass.IndexSchema.readSchema WARN Field text is not multivalued and destination for multiple copyFields (2)
   [junit4]   2> 225213 T668 oass.FileExchangeRateProvider.reload Reloading exchange rates from file currency.xml
   [junit4]   2> 225217 T668 oass.FileExchangeRateProvider.reload Reloading exchange rates from file currency.xml
   [junit4]   2> 225221 T668 oasc.SolrResourceLoader.locateSolrHome JNDI not configured for solr (NoInitialContextEx)
   [junit4]   2> 225221 T668 oasc.SolrResourceLoader.locateSolrHome using system property solr.solr.home: /mnt/ssd/jenkins/workspace/Lucene-Solr-trunk-Linux/solr/build/solr-core/test-files/solr
   [junit4]   2> 225221 T668 oasc.SolrResourceLoader.<init> new SolrResourceLoader for directory: '/mnt/ssd/jenkins/workspace/Lucene-Solr-trunk-Linux/solr/build/solr-core/test-files/solr/'
   [junit4]   2> 225229 T668 oasc.SolrResourceLoader.locateSolrHome JNDI not configured for solr (NoInitialContextEx)
   [junit4]   2> 225229 T668 oasc.SolrResourceLoader.locateSolrHome using system property solr.solr.home: /mnt/ssd/jenkins/workspace/Lucene-Solr-trunk-Linux/solr/build/solr-core/test-files/solr
   [junit4]   2> 225229 T668 oasc.SolrResourceLoader.<init> new SolrResourceLoader for deduced Solr Home: '/mnt/ssd/jenkins/workspace/Lucene-Solr-trunk-Linux/solr/build/solr-core/test-files/solr/'
   [junit4]   2> 225266 T668 oasc.CoreContainer.<init> New CoreContainer 674648066
   [junit4]   2> 225266 T668 oasc.CoreContainer.load Loading cores into CoreContainer [instanceDir=/mnt/ssd/jenkins/workspace/Lucene-Solr-trunk-Linux/solr/build/solr-core/test-files/solr/]
   [junit4]   2> 225267 T668 oashc.HttpShardHandlerFactory.getParameter Setting socketTimeout to: 0
   [junit4]   2> 225267 T668 oashc.HttpShardHandlerFactory.getParameter Setting urlScheme to: http://
   [junit4]   2> 225268 T668 oashc.HttpShardHandlerFactory.getParameter Setting connTimeout to: 0
   [junit4]   2> 225268 T668 oashc.HttpShardHandlerFactory.getParameter Setting maxConnectionsPerHost to: 20
   [junit4]   2> 225268 T668 oashc.HttpShardHandlerFactory.getParameter Setting corePoolSize to: 0
   [junit4]   2> 225268 T668 oashc.HttpShardHandlerFactory.getParameter Setting maximumPoolSize to: 2147483647
   [junit4]   2> 225269 T668 oashc.HttpShardHandlerFactory.getParameter Setting maxThreadIdleTime to: 5
   [junit4]   2> 225269 T668 oashc.HttpShardHandlerFactory.getParameter Setting sizeOfQueue to: -1
   [junit4]   2> 225269 T668 oashc.HttpShardHandlerFactory.getParameter Setting fairnessPolicy to: false
   [junit4]   2> 225273 T668 oasl.LogWatcher.createWatcher SLF4J impl is org.slf4j.impl.Log4jLoggerFactory
   [junit4]   2> 225273 T668 oasl.LogWatcher.newRegisteredLogWatcher Registering Log Listener [Log4j (org.slf4j.impl.Log4jLoggerFactory)]
   [junit4]   2> 225273 T668 oasc.CoreContainer.load Host Name: 
   [junit4]   2> 225276 T669 oasc.CoreContainer.create Creating SolrCore 'collection1' using instanceDir: /mnt/ssd/jenkins/workspace/Lucene-Solr-trunk-Linux/solr/build/solr-core/test-files/solr/collection1
   [junit4]   2> 225276 T669 oasc.SolrResourceLoader.<init> new SolrResourceLoader for directory: '/mnt/ssd/jenkins/workspace/Lucene-Solr-trunk-Linux/solr/build/solr-core/test-files/solr/collection1/'
   [junit4]   2> 225277 T669 oasc.SolrResourceLoader.replaceClassLoader Adding 'file:/mnt/ssd/jenkins/workspace/Lucene-Solr-trunk-Linux/solr/build/solr-core/test-files/solr/collection1/lib/classes/' to classloader
   [junit4]   2> 225277 T669 oasc.SolrResourceLoader.replaceClassLoader Adding 'file:/mnt/ssd/jenkins/workspace/Lucene-Solr-trunk-Linux/solr/build/solr-core/test-files/solr/collection1/lib/README' to classloader
   [junit4]   2> 225313 T669 oasc.SolrConfig.<init> Using Lucene MatchVersion: LUCENE_50
   [junit4]   2> 225359 T669 oasc.SolrConfig.<init> Loaded SolrConfig: solrconfig.xml
   [junit4]   2> 225360 T669 oass.IndexSchema.readSchema Reading Solr Schema from schema12.xml
   [junit4]   2> 225365 T669 oass.IndexSchema.readSchema [collection1] Schema name=test
   [junit4]   2> 225642 T669 oass.IndexSchema.readSchema default search field in schema is text
   [junit4]   2> 225645 T669 oass.IndexSchema.readSchema unique key field: id
   [junit4]   2> 225647 T669 oass.IndexSchema.readSchema WARN Field text is not multivalued and destination for multiple copyFields (2)
   [junit4]   2> 225655 T669 oass.FileExchangeRateProvider.reload Reloading exchange rates from file currency.xml
   [junit4]   2> 225658 T669 oass.FileExchangeRateProvider.reload Reloading exchange rates from file currency.xml
   [junit4]   2> 225661 T669 oasc.SolrCore.initDirectoryFactory org.apache.solr.core.MockDirectoryFactory
   [junit4]   2> 225662 T669 oasc.SolrCore.<init> [collection1] Opening new SolrCore at /mnt/ssd/jenkins/workspace/Lucene-Solr-trunk-Linux/solr/build/solr-core/test-files/solr/collection1/, dataDir=/mnt/ssd/jenkins/workspace/Lucene-Solr-trunk-Linux/solr/build/solr-core/test/J1/./solrtest-SignatureUpdateProcessorFactoryTest-1385918787955/
   [junit4]   2> 225662 T669 oasc.JmxMonitoredMap.<init> JMX monitoring is enabled. Adding Solr mbeans to JMX Server: com.sun.jmx.mbeanserver.JmxMBeanServer@e229d454
   [junit4]   2> 225663 T669 oasc.CachingDirectoryFactory.get return new directory for /mnt/ssd/jenkins/workspace/Lucene-Solr-trunk-Linux/solr/build/solr-core/test/J1/./solrtest-SignatureUpdateProcessorFactoryTest-1385918787955
   [junit4]   2> 225663 T669 oasc.SolrCore.getNewIndexDir New index directory detected: old=null new=/mnt/ssd/jenkins/workspace/Lucene-Solr-trunk-Linux/solr/build/solr-core/test/J1/./solrtest-SignatureUpdateProcessorFactoryTest-1385918787955/index/
   [junit4]   2> 225663 T669 oasc.SolrCore.initIndex WARN [collection1] Solr index directory '/mnt/ssd/jenkins/workspace/Lucene-Solr-trunk-Linux/solr/build/solr-core/test/J1/./solrtest-SignatureUpdateProcessorFactoryTest-1385918787955/index' doesn't exist. Creating new index...
   [junit4]   2> 225664 T669 oasc.CachingDirectoryFactory.get return new directory for /mnt/ssd/jenkins/workspace/Lucene-Solr-trunk-Linux/solr/build/solr-core/test/J1/./solrtest-SignatureUpdateProcessorFactoryTest-1385918787955/index
   [junit4]   2> 225664 T669 oasu.RandomMergePolicy.<init> RandomMergePolicy wrapping class org.apache.lucene.index.TieredMergePolicy: [TieredMergePolicy: maxMergeAtOnce=50, maxMergeAtOnceExplicit=13, maxMergedSegmentMB=81.5595703125, floorSegmentMB=1.8408203125, forceMergeDeletesPctAllowed=14.935727904562855, segmentsPerTier=11.0, maxCFSSegmentSizeMB=8.796093022207999E12, noCFSRatio=0.2028266763735684
   [junit4]   2> 225665 T669 oasc.SolrDeletionPolicy.onCommit SolrDeletionPolicy.onCommit: commits: num=1
   [junit4]   2> 		commit{dir=RateLimitedDirectoryWrapper(MockDirectoryWrapper(org.apache.lucene.store.RAMDirectory@3a07fd83 lockFactory=org.apache.lucene.store.SingleInstanceLockFactory@2ade4c7b)),segFN=segments_1,generation=1}
   [junit4]   2> 225665 T669 oasc.SolrDeletionPolicy.updateCommits newest commit generation = 1
   [junit4]   2> 225666 T669 oasc.SolrCore.initWriters created xml: solr.XMLResponseWriter
   [junit4]   2> 225668 T669 oasup.UpdateRequestProcessorChain.init creating updateRequestProcessorChain "dedupe"
   [junit4]   2> 225668 T669 oasup.UpdateRequestProcessorChain.init inserting DistributedUpdateProcessorFactory into updateRequestProcessorChain "dedupe"
   [junit4]   2> 225668 T669 oasup.UpdateRequestProcessorChain.init creating updateRequestProcessorChain "dedupe-allfields"
   [junit4]   2> 225669 T669 oasup.UpdateRequestProcessorChain.init inserting DistributedUpdateProcessorFactory into updateRequestProcessorChain "dedupe-allfields"
   [junit4]   2> 225669 T669 oasup.UpdateRequestProcessorChain.init creating updateRequestProcessorChain "stored_sig"
   [junit4]   2> 225669 T669 oasup.UpdateRequestProcessorChain.init inserting DistributedUpdateProcessorFactory into updateRequestProcessorChain "stored_sig"
   [junit4]   2> 225669 T669 oasup.UpdateRequestProcessorChain.init creating updateRequestProcessorChain "uniq-fields"
   [junit4]   2> 225670 T669 oasup.UpdateRequestProcessorChain.init inserting DistributedUpdateProcessorFactory into updateRequestProcessorChain "uniq-fields"
   [junit4]   2> 225670 T669 oasup.UpdateRequestProcessorChain.init creating updateRequestProcessorChain "distrib-dup-test-chain-explicit"
   [junit4]   2> 225671 T669 oasup.UpdateRequestProcessorChain.init creating updateRequestProcessorChain "distrib-dup-test-chain-implicit"
   [junit4]   2> 225671 T669 oasup.UpdateRequestProcessorChain.init inserting DistributedUpdateProcessorFactory into updateRequestProcessorChain "distrib-dup-test-chain-implicit"
   [junit4]   2> 225671 T669 oasc.SolrCore.loadUpdateProcessorChains no updateRequestProcessorChain defined as default, creating implicit default
   [junit4]   2> 225672 T669 oasc.RequestHandlers.initHandlersFromConfig adding lazy requestHandler: solr.ReplicationHandler
   [junit4]   2> 225672 T669 oasc.RequestHandlers.initHandlersFromConfig created /replication: solr.ReplicationHandler
   [junit4]   2> 225672 T669 oasc.RequestHandlers.initHandlersFromConfig created standard: solr.StandardRequestHandler
   [junit4]   2> 225673 T669 oasc.RequestHandlers.initHandlersFromConfig created /get: solr.RealTimeGetHandler
   [junit4]   2> 225673 T669 oasc.RequestHandlers.initHandlersFromConfig created dismax: solr.SearchHandler
   [junit4]   2> 225673 T669 oasc.RequestHandlers.initHandlersFromConfig created mock: org.apache.solr.core.MockQuerySenderListenerReqHandler
   [junit4]   2> 225674 T669 oasc.RequestHandlers.initHandlersFromConfig created /admin/: org.apache.solr.handler.admin.AdminHandlers
   [junit4]   2> 225674 T669 oasc.RequestHandlers.initHandlersFromConfig created /admin/file: solr.admin.ShowFileRequestHandler
   [junit4]   2> 225675 T669 oasc.RequestHandlers.initHandlersFromConfig created defaults: solr.StandardRequestHandler
   [junit4]   2> 225675 T669 oasc.RequestHandlers.initHandlersFromConfig adding lazy requestHandler: solr.StandardRequestHandler
   [junit4]   2> 225675 T669 oasc.RequestHandlers.initHandlersFromConfig created lazy: solr.StandardRequestHandler
   [junit4]   2> 225676 T669 oasc.RequestHandlers.initHandlersFromConfig created /update: solr.UpdateRequestHandler
   [junit4]   2> 225676 T669 oasc.RequestHandlers.initHandlersFromConfig created /terms: org.apache.solr.handler.component.SearchHandler
   [junit4]   2> 225676 T669 oasc.RequestHandlers.initHandlersFromConfig created spellCheckCompRH: org.apache.solr.handler.component.SearchHandler
   [junit4]   2> 225677 T669 oasc.RequestHandlers.initHandlersFromConfig created spellCheckCompRH_Direct: org.apache.solr.handler.component.SearchHandler
   [junit4]   2> 225677 T669 oasc.RequestHandlers.initHandlersFromConfig created spellCheckWithWordbreak: org.apache.solr.handler.component.SearchHandler
   [junit4]   2> 225678 T669 oasc.RequestHandlers.initHandlersFromConfig created spellCheckWithWordbreak_Direct: org.apache.solr.handler.component.SearchHandler
   [junit4]   2> 225678 T669 oasc.RequestHandlers.initHandlersFromConfig created spellCheckCompRH1: org.apache.solr.handler.component.SearchHandler
   [junit4]   2> 225678 T669 oasc.RequestHandlers.initHandlersFromConfig created mltrh: org.apache.solr.handler.component.SearchHandler
   [junit4]   2> 225679 T669 oasc.RequestHandlers.initHandlersFromConfig created tvrh: org.apache.solr.handler.component.SearchHandler
   [junit4]   2> 225679 T669 oasc.RequestHandlers.initHandlersFromConfig created /mlt: solr.MoreLikeThisHandler
   [junit4]   2> 225679 T669 oasc.RequestHandlers.initHandlersFromConfig created /debug/dump: solr.DumpRequestHandler
   [junit4]   2> 225681 T669 oashl.XMLLoader.init xsltCacheLifetimeSeconds=60
   [junit4]   2> 225682 T669 oasc.SolrCore.initDeprecatedSupport WARN solrconfig.xml uses deprecated <admin/gettableFiles>, Please update your config to use the ShowFileRequestHandler.
   [junit4]   2> 225683 T669 oasu.CommitTracker.<init> Hard AutoCommit: disabled
   [junit4]   2> 225684 T669 oasu.CommitTracker.<init> Soft AutoCommit: disabled
   [junit4]   2> 225684 T669 oasu.RandomMergePolicy.<init> RandomMergePolicy wrapping class org.apache.lucene.index.LogByteSizeMergePolicy: [LogByteSizeMergePolicy: minMergeSize=1677721, mergeFactor=43, maxMergeSize=2147483648, maxMergeSizeForForcedMerge=9223372036854775807, calibrateSizeByDeletes=true, maxMergeDocs=2147483647, maxCFSSegmentSizeMB=8.796093022207999E12, noCFSRatio=0.556955357198134]
   [junit4]   2> 225685 T669 oasc.SolrDeletionPolicy.onInit SolrDeletionPolicy.onInit: commits: num=1
   [junit4]   2> 		commit{dir=RateLimitedDirectoryWrapper(MockDirectoryWrapper(org.apache.lucene.store.RAMDirectory@3a07fd83 lockFactory=org.apache.lucene.store.SingleInstanceLockFactory@2ade4c7b)),segFN=segments_1,generation=1}
   [junit4]   2> 225685 T669 oasc.SolrDeletionPolicy.updateCommits newest commit generation = 1
   [junit4]   2> 225685 T669 oass.SolrIndexSearcher.<init> Opening Searcher@2a8a79da main
   [junit4]   2> 225686 T669 oashc.SpellCheckComponent.inform Initializing spell checkers
   [junit4]   2> 225758 T669 oass.DirectSolrSpellChecker.init init: {name=direct,classname=DirectSolrSpellChecker,field=lowerfilt,minQueryLength=3}
   [junit4]   2> 225777 T670 oasc.SolrCore.registerSearcher [collection1] Registered new searcher Searcher@2a8a79da main{StandardDirectoryReader(segments_1:1:nrt)}
   [junit4]   2> 225781 T669 oasc.CoreContainer.registerCore registering core: collection1
   [junit4]   2> 225783 T668 oas.SolrTestCaseJ4.initCore ####initCore end
   [junit4]   2> 225786 T668 oas.SolrTestCaseJ4.setUp ###Starting testNonStringFieldsValues
   [junit4]   2> ASYNC  NEW_CORE C624 name=collection1 org.apache.solr.core.SolrCore@3e0e3a29
   [junit4]   2> 225795 T668 C624 oasu.DirectUpdateHandler2.deleteAll [collection1] REMOVING ALL DOCUMENTS FROM INDEX
   [junit4]   2> 225796 T668 C624 oasup.LogUpdateProcessor.finish [collection1] webapp=null path=null params={} {deleteByQuery=*:*} 0 1
   [junit4]   2> 225804 T668 C624 oasu.DirectUpdateHandler2.commit start commit{,optimize=false,openSearcher=true,waitSearcher=true,expungeDeletes=false,softCommit=false,prepareCommit=false}
   [junit4]   2> 225805 T668 C624 oasc.SolrDeletionPolicy.onCommit SolrDeletionPolicy.onCommit: commits: num=2
   [junit4]   2> 		commit{dir=RateLimitedDirectoryWrapper(MockDirectoryWrapper(org.apache.lucene.store.RAMDirectory@3a07fd83 lockFactory=org.apache.lucene.store.SingleInstanceLockFactory@2ade4c7b)),segFN=segments_1,generation=1}
   [junit4]   2> 		commit{dir=RateLimitedDirectoryWrapper(MockDirectoryWrapper(org.apache.lucene.store.RAMDirectory@3a07fd83 lockFactory=org.apache.lucene.store.SingleInstanceLockFactory@2ade4c7b)),segFN=segments_2,generation=2}
   [junit4]   2> 225806 T668 C624 oasc.SolrDeletionPolicy.updateCommits newest commit generation = 2
   [junit4]   2> 225806 T668 C624 oass.SolrIndexSearcher.<init> Opening Searcher@b5de1f9 main
   [junit4]   2> 225807 T668 C624 oasu.DirectUpdateHandler2.commit end_commit_flush
   [junit4]   2> 225808 T670 oasc.SolrCore.registerSearcher [collection1] Registered new searcher Searcher@b5de1f9 main{StandardDirectoryReader(segments_2:2:nrt)}
   [junit4]   2> 225809 T668 C624 oasup.LogUpdateProcessor.finish [collection1] webapp=null path=null params={} {commit=} 0 5
   [junit4]   2> 225814 T668 oashl.XMLLoader.init xsltCacheLifetimeSeconds=60
   [junit4]   2> 225915 T668 oasu.DirectUpdateHandler2.commit start commit{,optimize=false,openSearcher=true,waitSearcher=true,expungeDeletes=false,softCommit=false,prepareCommit=false}
   [junit4]   2> 225917 T668 oasc.SolrDeletionPolicy.onCommit SolrDeletionPolicy.onCommit: commits: num=2
   [junit4]   2> 		commit{dir=RateLimitedDirectoryWrapper(MockDirectoryWrapper(org.apache.lucene.store.RAMDirectory@3a07fd83 lockFactory=org.apache.lucene.store.SingleInstanceLockFactory@2ade4c7b)),segFN=segments_2,generation=2}
   [junit4]   2> 		commit{dir=RateLimitedDirectoryWrapper(MockDirectoryWrapper(org.apache.lucene.store.RAMDirectory@3a07fd83 lockFactory=org.apache.lucene.store.SingleInstanceLockFactory@2ade4c7b)),segFN=segments_3,generation=3}
   [junit4]   2> 225917 T668 oasc.SolrDeletionPolicy.updateCommits newest commit generation = 3
   [junit4]   2> 225918 T668 oass.SolrIndexSearcher.<init> Opening Searcher@9e3aaed6 main
   [junit4]   2> 225919 T668 oasu.DirectUpdateHandler2.commit end_commit_flush
   [junit4]   2> 225920 T670 oasc.SolrCore.registerSearcher [collection1] Registered new searcher Searcher@9e3aaed6 main{StandardDirectoryReader(segments_3:4:nrt _0(5.0):c5/1:delGen=1)}
   [junit4]   2> 225921 T668 oas.SolrTestCaseJ4.tearDown ###Ending testNonStringFieldsValues
   [junit4]   2> 225924 T668 oas.SolrTestCaseJ4.setUp ###Starting testFailNonIndexedSigWithOverwriteDupes
   [junit4]   2> 225929 T668 C624 oasu.DirectUpdateHandler2.deleteAll [collection1] REMOVING ALL DOCUMENTS FROM INDEX
   [junit4]   2> 225930 T668 C624 oasup.LogUpdateProcessor.finish [collection1] webapp=null path=null params={} {deleteByQuery=*:*} 0 1
   [junit4]   2> 225936 T668 C624 oasu.DirectUpdateHandler2.commit start commit{,optimize=false,openSearcher=true,waitSearcher=true,expungeDeletes=false,softCommit=false,prepareCommit=false}
   [junit4]   2> 225937 T668 C624 oasc.SolrDeletionPolicy.onCommit SolrDeletionPolicy.onCommit: commits: num=2
   [junit4]   2> 		commit{dir=RateLimitedDirectoryWrapper(MockDirectoryWrapper(org.apache.lucene.store.RAMDirectory@3a07fd83 lockFactory=org.apache.lucene.store.SingleInstanceLockFactory@2ade4c7b)),segFN=segments_3,generation=3}
   [junit4]   2> 		commit{dir=RateLimitedDirectoryWrapper(MockDirectoryWrapper(org.apache.lucene.store.RAMDirectory@3a07fd83 lockFactory=org.apache.lucene.store.SingleInstanceLockFactory@2ade4c7b)),segFN=segments_4,generation=4}
   [junit4]   2> 225937 T668 C624 oasc.SolrDeletionPolicy.updateCommits newest commit generation = 4
   [junit4]   2> 225938 T668 C624 oass.SolrIndexSearcher.<init> Opening Searcher@1e5dc51b main
   [junit4]   2> 225939 T668 C624 oasu.DirectUpdateHandler2.commit end_commit_flush
   [junit4]   2> 225940 T670 oasc.SolrCore.registerSearcher [collection1] Registered new searcher Searcher@1e5dc51b main{StandardDirectoryReader(segments_4:5:nrt)}
   [junit4]   2> 225941 T668 C624 oasup.LogUpdateProcessor.finish [collection1] webapp=null path=null params={} {commit=} 0 5
   [junit4]   2> 225942 T668 oas.SolrTestCaseJ4.tearDown ###Ending testFailNonIndexedSigWithOverwriteDupes
   [junit4]   2> 225945 T668 oas.SolrTestCaseJ4.setUp ###Starting testDupeAllFieldsDetection
   [junit4]   2> 225950 T668 C624 oasu.DirectUpdateHandler2.deleteAll [collection1] REMOVING ALL DOCUMENTS FROM INDEX
   [junit4]   2> 225951 T668 C624 oasup.LogUpdateProcessor.finish [collection1] webapp=null path=null params={} {deleteByQuery=*:*} 0 1
   [junit4]   2> 225956 T668 C624 oasu.DirectUpdateHandler2.commit start commit{,optimize=false,openSearcher=true,waitSearcher=true,expungeDeletes=false,softCommit=false,prepareCommit=false}
   [junit4]   2> 225957 T668 C624 oasc.SolrDeletionPolicy.onCommit SolrDeletionPolicy.onCommit: commits: num=2
   [junit4]   2> 		commit{dir=RateLimitedDirectoryWrapper(MockDirectoryWrapper(org.apache.lucene.store.RAMDirectory@3a07fd83 lockFactory=org.apache.lucene.store.SingleInstanceLockFactory@2ade4c7b)),segFN=segments_4,generation=4}
   [junit4]   2> 		commit{dir=RateLimitedDirectoryWrapper(MockDirectoryWrapper(org.apache.lucene.store.RAMDirectory@3a07fd83 lockFactory=org.apache.lucene.store.SingleInstanceLockFactory@2ade4c7b)),segFN=segments_5,generation=5}
   [junit4]   2> 225958 T668 C624 oasc.SolrDeletionPolicy.updateCommits newest commit generation = 5
   [junit4]   2> 225958 T668 C624 oass.SolrIndexSearcher.<init> Opening Searcher@3b319ac main
   [junit4]   2> 225959 T668 C624 oasu.DirectUpdateHandler2.commit end_commit_flush
   [junit4]   2> 225960 T670 oasc.SolrCore.registerSearcher [collection1] Registered new searcher Searcher@3b319ac main{StandardDirectoryReader(segments_5:6:nrt)}
   [junit4]   2> 225961 T668 C624 oasup.LogUpdateProcessor.finish [collection1] webapp=null path=null params={} {commit=} 0 5
   [junit4]   2> 225966 T668 oasu.DirectUpdateHandler2.commit start commit{,optimize=false,openSearcher=true,waitSearcher=true,expungeDeletes=false,softCommit=false,prepareCommit=false}
   [junit4]   2> 225968 T668 oasc.SolrDeletionPolicy.onCommit SolrDeletionPolicy.onCommit: commits: num=2
   [junit4]   2> 		commit{dir=RateLimitedDirectoryWrapper(MockDirectoryWrapper(org.apache.lucene.store.RAMDirectory@3a07fd83 lockFactory=org.apache.lucene.store.SingleInstanceLockFactory@2ade4c7b)),segFN=segments_5,generation=5}
   [junit4]   2> 		commit{dir=RateLimitedDirectoryWrapper(MockDirectoryWrapper(org.apache.lucene.store.RAMDirectory@3a07fd83 lockFactory=org.apache.lucene.store.SingleInstanceLockFactory@2ade4c7b)),segFN=segments_6,generation=6}
   [junit4]   2> 225969 T668 oasc.SolrDeletionPolicy.updateCommits newest commit generation = 6
   [junit4]   2> 225969 T668 oass.SolrIndexSearcher.<init> Opening Searcher@25f382ea main
   [junit4]   2> 225970 T668 oasu.DirectUpdateHandler2.commit end_commit_flush
   [junit4]   2> 225972 T670 oasc.SolrCore.registerSearcher [collection1] Registered new searcher Searcher@25f382ea main{StandardDirectoryReader(segments_6:8:nrt _1(5.0):c3)}
   [junit4]   2> 225972 T668 oas.SolrTestCaseJ4.tearDown ###Ending testDupeAllFieldsDetection
   [junit4]   2> 225976 T668 oas.SolrTestCaseJ4.setUp ###Starting testDupeDetection
   [junit4]   2> 225981 T668 C624 oasu.DirectUpdateHandler2.deleteAll [collection1] REMOVING ALL DOCUMENTS FROM INDEX
   [junit4]   2> 225981 T668 C624 oasup.LogUpdateProcessor.finish [collection1] webapp=null path=null params={} {deleteByQuery=*:*} 0 1
   [junit4]   2> 225987 T668 C624 oasu.DirectUpdateHandler2.commit start commit{,optimize=false,openSearcher=true,waitSearcher=true,expungeDeletes=false,softCommit=false,prepareCommit=false}
   [junit4]   2> 225987 T668 C624 oasc.SolrDeletionPolicy.onCommit SolrDeletionPolicy.onCommit: commits: num=2
   [junit4]   2> 		commit{dir=RateLimitedDirectoryWrapper(MockDirectoryWrapper(org.apache.lucene.store.RAMDirectory@3a07fd83 lockFactory=org.apache.lucene.store.SingleInstanceLockFactory@2ade4c7b)),segFN=segments_6,generation=6}
   [junit4]   2> 		commit{dir=RateLimitedDirectoryWrapper(MockDirectoryWrapper(org.apache.lucene.store.RAMDirectory@3a07fd83 lockFactory=org.apache.lucene.store.SingleInstanceLockFactory@2ade4c7b)),segFN=segments_7,generation=7}
   [junit4]   2> 225988 T668 C624 oasc.SolrDeletionPolicy.updateCommits newest commit generation = 7
   [junit4]   2> 225989 T668 C624 oass.SolrIndexSearcher.<init> Opening Searcher@513c8b5d main
   [junit4]   2> 225989 T668 C624 oasu.DirectUpdateHandler2.commit end_commit_flush
   [junit4]   2> 225991 T670 oasc.SolrCore.registerSearcher [collection1] Registered new searcher Searcher@513c8b5d main{StandardDirectoryReader(segments_7:9:nrt)}
   [junit4]   2> 225991 T668 C624 oasup.LogUpdateProcessor.finish [collection1] webapp=null path=null params={} {commit=} 0 4
   [junit4]   2> 225996 T668 oasu.DirectUpdateHandler2.commit start commit{,optimize=false,openSearcher=true,waitSearcher=true,expungeDeletes=false,softCommit=false,prepareCommit=false}
   [junit4]   2> 225999 T668 oasc.SolrDeletionPolicy.onCommit SolrDeletionPolicy.onCommit: commits: num=2
   [junit4]   2> 		commit{dir=RateLimitedDirectoryWrapper(MockDirectoryWrapper(org.apache.lucene.store.RAMDirectory@3a07fd83 lockFactory=org.apache.lucene.store.SingleInstanceLockFactory@2ade4c7b)),segFN=segments_7,generation=7}
   [junit4]   2> 		commit{dir=RateLimitedDirectoryWrapper(MockDirectoryWrapper(org.apache.lucene.store.RAMDirectory@3a07fd83 lockFactory=org.apache.lucene.store.SingleInstanceLockFactory@2ade4c7b)),segFN=segments_8,generation=8}
   [junit4]   2> 225999 T668 oasc.SolrDeletionPolicy.updateCommits newest commit generation = 8
   [junit4]   2> 226000 T668 oass.SolrIndexSearcher.<init> Opening Searcher@d3892d3e main
   [junit4]   2> 226000 T668 oasu.DirectUpdateHandler2.commit end_commit_flush
   [junit4]   2> 226002 T670 oasc.SolrCore.registerSearcher [collection1] Registered new searcher Searcher@d3892d3e main{StandardDirectoryReader(segments_8:11:nrt _2(5.0):c2)}
   [junit4]   2> 226005 T668 oasu.DirectUpdateHandler2.commit start commit{,optimize=false,openSearcher=true,waitSearcher=true,expungeDeletes=false,softCommit=false,prepareCommit=false}
   [junit4]   2> 226008 T668 oasc.SolrDeletionPolicy.onCommit SolrDeletionPolicy.onCommit: commits: num=2
   [junit4]   2> 		commit{dir=RateLimitedDirectoryWrapper(MockDirectoryWrapper(org.apache.lucene.store.RAMDirectory@3a07fd83 lockFactory=org.apache.lucene.store.SingleInstanceLockFactory@2ade4c7b)),segFN=segments_8,generation=8}
   [junit4]

[...truncated too long message...]

1
   [junit4]   2> 501101 T1356 oasup.LogUpdateProcessor.finish [collection1] {add=[4 (1453241468720250881)]} 0 1
   [junit4]   2> 501102 T1356 oasup.LogUpdateProcessor.finish [collection1] {add=[5 (1453241468721299456)]} 0 1
   [junit4]   2> 501103 T1356 oasup.LogUpdateProcessor.finish [collection1] {add=[6 (1453241468721299457)]} 0 1
   [junit4]   2> 501103 T1356 oasup.LogUpdateProcessor.finish [collection1] {add=[7 (1453241468722348032)]} 0 1
   [junit4]   2> 501104 T1356 oasup.LogUpdateProcessor.finish [collection1] {add=[8 (1453241468723396608)]} 0 1
   [junit4]   2> 501104 T1356 oasup.LogUpdateProcessor.finish [collection1] {add=[9 (1453241468723396609)]} 0 1
   [junit4]   2> 501105 T1356 oasup.LogUpdateProcessor.finish [collection1] {add=[10 (1453241468724445184)]} 0 1
   [junit4]   2> 501106 T1356 oasup.LogUpdateProcessor.finish [collection1] {add=[11 (1453241468724445185)]} 0 1
   [junit4]   2> 501106 T1356 oasup.LogUpdateProcessor.finish [collection1] {add=[12 (1453241468725493760)]} 0 1
   [junit4]   2> 501107 T1356 oasup.LogUpdateProcessor.finish [collection1] {add=[13 (1453241468726542336)]} 0 1
   [junit4]   2> ASYNC  NEW_CORE C1046 name=collection1 org.apache.solr.core.SolrCore@da9c8646
   [junit4]   2> 501107 T1356 C1046 oasc.SolrCore.execute [collection1] webapp=null path=null params={rows=20&q=id:1&version=2.2&start=0&qt=standard} hits=0 status=0 QTime=0 
   [junit4]   2> 501109 T1356 oasup.LogUpdateProcessor.finish [collection1] {add=[14 (1453241468728639488)]} 0 1
   [junit4]   2> 501110 T1365 oasu.DirectUpdateHandler2.commit start commit{,optimize=false,openSearcher=true,waitSearcher=true,expungeDeletes=false,softCommit=true,prepareCommit=false}
   [junit4]   2> 501112 T1365 oass.SolrIndexSearcher.<init> Opening Searcher@f25d59c main
   [junit4]   2> 501112 T1365 oasu.DirectUpdateHandler2.commit end_commit_flush
   [junit4]   2> 501114 T1364 oasc.SolrCore.registerSearcher [collection1] Registered new searcher Searcher@f25d59c main{StandardDirectoryReader(segments_3:19:nrt _4(5.0):c15)}
   [junit4]   2> 501360 T1356 oasup.LogUpdateProcessor.finish [collection1] {add=[15 (1453241468991832064)]} 0 1
   [junit4]   2> 501361 T1356 C1046 oasc.SolrCore.execute [collection1] webapp=null path=null params={version=2.2&start=0&qt=standard&rows=20&q=id:14} hits=1 status=0 QTime=0 
   [junit4]   2> 501362 T1356 C1046 oasc.SolrCore.execute [collection1] webapp=null path=null params={q=id:15&rows=20&start=0&qt=standard&version=2.2} hits=0 status=0 QTime=0 
   [junit4]   2> 501370 T1356 oas.SolrTestCaseJ4.tearDown ###Ending testMaxDocs
   [junit4]   2> 501372 T1356 oas.SolrTestCaseJ4.deleteCore ###deleteCore
   [junit4]   2> 501372 T1356 oasc.CoreContainer.shutdown Shutting down CoreContainer instance=189298331
   [junit4]   2> 501372 T1356 oasc.SolrCore.close [collection1]  CLOSING SolrCore org.apache.solr.core.SolrCore@da9c8646
   [junit4]   2> 501382 T1356 oasu.DirectUpdateHandler2.close closing DirectUpdateHandler2{commits=1,autocommits=0,soft autocommit maxDocs=14,soft autocommits=1,optimizes=0,rollbacks=0,expungeDeletes=0,docsPending=16,adds=1,deletesById=0,deletesByQuery=0,errors=0,cumulative_adds=16,cumulative_deletesById=0,cumulative_deletesByQuery=0,cumulative_errors=0,transaction_logs_total_size=0,transaction_logs_total_number=0}
   [junit4]   2> 501382 T1356 oasu.SolrCoreState.decrefSolrCoreState Closing SolrCoreState
   [junit4]   2> 501382 T1356 oasu.DefaultSolrCoreState.closeIndexWriter SolrCoreState ref count has reached 0 - closing IndexWriter
   [junit4]   2> 501382 T1356 oasu.DefaultSolrCoreState.closeIndexWriter closing IndexWriter with IndexWriterCloser
   [junit4]   2> ASYNC  NEW_CORE C1047 name=collection1 org.apache.solr.core.SolrCore@da9c8646
   [junit4]   2> 501384 T1356 C1047 oasc.SolrDeletionPolicy.onCommit SolrDeletionPolicy.onCommit: commits: num=2
   [junit4]   2> 		commit{dir=RateLimitedDirectoryWrapper(MockDirectoryWrapper(org.apache.lucene.store.RAMDirectory@d6b31b0e lockFactory=org.apache.lucene.store.SingleInstanceLockFactory@fd44abb2)),segFN=segments_3,generation=3}
   [junit4]   2> 		commit{dir=RateLimitedDirectoryWrapper(MockDirectoryWrapper(org.apache.lucene.store.RAMDirectory@d6b31b0e lockFactory=org.apache.lucene.store.SingleInstanceLockFactory@fd44abb2)),segFN=segments_4,generation=4}
   [junit4]   2> 501384 T1356 C1047 oasc.SolrDeletionPolicy.updateCommits newest commit generation = 4
   [junit4]   2> 501385 T1356 oasc.SolrCore.closeSearcher [collection1] Closing main searcher on request.
   [junit4]   2> 501385 T1356 oasc.CachingDirectoryFactory.close Closing MockDirectoryFactory - 2 directories currently being tracked
   [junit4]   2> 501386 T1356 oasc.CachingDirectoryFactory.closeCacheValue looking to close /mnt/ssd/jenkins/workspace/Lucene-Solr-trunk-Linux/solr/build/solr-core/test/J1/./solrtest-AutoCommitTest-1385919053782/index [CachedDir<<refCount=0;path=/mnt/ssd/jenkins/workspace/Lucene-Solr-trunk-Linux/solr/build/solr-core/test/J1/./solrtest-AutoCommitTest-1385919053782/index;done=false>>]
   [junit4]   2> 501386 T1356 oasc.CachingDirectoryFactory.close Closing directory: /mnt/ssd/jenkins/workspace/Lucene-Solr-trunk-Linux/solr/build/solr-core/test/J1/./solrtest-AutoCommitTest-1385919053782/index
   [junit4]   2> 501386 T1356 oasc.CachingDirectoryFactory.closeCacheValue looking to close /mnt/ssd/jenkins/workspace/Lucene-Solr-trunk-Linux/solr/build/solr-core/test/J1/./solrtest-AutoCommitTest-1385919053782 [CachedDir<<refCount=0;path=/mnt/ssd/jenkins/workspace/Lucene-Solr-trunk-Linux/solr/build/solr-core/test/J1/./solrtest-AutoCommitTest-1385919053782;done=false>>]
   [junit4]   2> 501386 T1356 oasc.CachingDirectoryFactory.close Closing directory: /mnt/ssd/jenkins/workspace/Lucene-Solr-trunk-Linux/solr/build/solr-core/test/J1/./solrtest-AutoCommitTest-1385919053782
   [junit4]   2> NOTE: test params are: codec=Asserting, sim=DefaultSimilarity, locale=fr_LU, timezone=America/Rankin_Inlet
   [junit4]   2> NOTE: Linux 3.8.0-33-generic amd64/IBM Corporation 1.7.0 (64-bit)/cpus=8,threads=1,free=108137656,total=189923328
   [junit4]   2> NOTE: All tests run in this JVM: [TestFastOutputStream, TestSolrCoreProperties, HdfsCollectionsAPIDistributedZkTest, TestNumberUtils, TestDistribDocBasedVersion, TestQueryTypes, HdfsChaosMonkeySafeLeaderTest, TestHighFrequencyDictionaryFactory, ParsingFieldUpdateProcessorsTest, TestDistributedSearch, TestFastWriter, DistributedSuggesterComponentTest, IndexSchemaRuntimeFieldTest, CoreContainerCoreInitFailuresTest, StatsComponentTest, TestRandomMergePolicy, TestPhraseSuggestions, OpenExchangeRatesOrgProviderTest, HdfsBasicDistributedZkTest, TestPartialUpdateDeduplication, TestCollationField, AbstractAnalyticsFacetTest, TestRangeQuery, ChaosMonkeySafeLeaderTest, TestSolrQueryParserDefaultOperatorResource, AbstractAnalyticsStatsTest, MultiTermTest, SortByFunctionTest, TestCSVLoader, CustomCollectionTest, SpellingQueryConverterTest, AlternateDirectoryTest, DirectUpdateHandlerTest, DirectSolrConnectionTest, SolrCmdDistributorTest, XmlUpdateRequestHandlerTest, TestRTGBase, DocValuesMissingTest, UniqFieldsUpdateProcessorFactoryTest, TestManagedSchema, TestIBSimilarityFactory, TestAnalyzeInfixSuggestions, SuggesterWFSTTest, TestSolr4Spatial, TestFoldingMultitermQuery, TestComponentsName, TestOmitPositions, FullSolrCloudDistribCmdsTest, CurrencyFieldXmlFileTest, TestDynamicFieldCollectionResource, TestCloudManagedSchema, TestSolrXmlPersistence, TestAnalyzedSuggestions, SolrXmlInZkTest, TestFieldTypeResource, ChaosMonkeyNothingIsSafeTest, JSONWriterTest, RequiredFieldsTest, PrimUtilsTest, TestWordDelimiterFilterFactory, TestFieldResource, TestSchemaSimilarityResource, TestDistributedGrouping, PingRequestHandlerTest, TestFiltering, NoFacetTest, SolrRequestParserTest, TestRecoveryHdfs, TestIndexingPerformance, PluginInfoTest, TestAtomicUpdateErrorCases, PreAnalyzedFieldTest, NotRequiredUniqueKeyTest, TestStressRecovery, TestSolrXmlPersistor, HdfsDirectoryTest, TestDefaultSimilarityFactory, DefaultValueUpdateProcessorTest, TestUpdate, TestUniqueKeyFieldResource, HdfsLockFactoryTest, HdfsBasicDistributedZk2Test, AliasIntegrationTest, SignatureUpdateProcessorFactoryTest, XsltUpdateRequestHandlerTest, DisMaxRequestHandlerTest, ZkSolrClientTest, BasicDistributedZkTest, BasicDistributedZk2Test, UnloadDistributedZkTest, CollectionsAPIDistributedZkTest, SyncSliceTest, OpenCloseCoreStressTest, OverseerTest, BasicZkTest, TestZkChroot, TestRandomDVFaceting, AutoCommitTest]
   [junit4] Completed on J1 in 10.78s, 3 tests, 1 error <<< FAILURES!

[...truncated 503 lines...]
BUILD FAILED
/mnt/ssd/jenkins/workspace/Lucene-Solr-trunk-Linux/build.xml:420: The following error occurred while executing this line:
/mnt/ssd/jenkins/workspace/Lucene-Solr-trunk-Linux/build.xml:413: The following error occurred while executing this line:
/mnt/ssd/jenkins/workspace/Lucene-Solr-trunk-Linux/build.xml:39: The following error occurred while executing this line:
/mnt/ssd/jenkins/workspace/Lucene-Solr-trunk-Linux/extra-targets.xml:37: The following error occurred while executing this line:
/mnt/ssd/jenkins/workspace/Lucene-Solr-trunk-Linux/solr/build.xml:189: The following error occurred while executing this line:
/mnt/ssd/jenkins/workspace/Lucene-Solr-trunk-Linux/solr/common-build.xml:491: The following error occurred while executing this line:
/mnt/ssd/jenkins/workspace/Lucene-Solr-trunk-Linux/lucene/common-build.xml:1275: The following error occurred while executing this line:
/mnt/ssd/jenkins/workspace/Lucene-Solr-trunk-Linux/lucene/common-build.xml:908: There were test failures: 357 suites, 1570 tests, 1 error, 3 failures, 68 ignored (6 assumptions)

Total time: 35 minutes 28 seconds
Build step 'Invoke Ant' marked build as failure
Description set: Java: 64bit/ibm-j9-jdk7 -Xjit:exclude={org/apache/lucene/util/fst/FST.pack(IIF)Lorg/apache/lucene/util/fst/FST;}
Archiving artifacts
Recording test results
Email was triggered for: Failure
Sending email for trigger: Failure



Mime
View raw message