lucene-dev mailing list archives

Site index · List index
Message view « Date » · « Thread »
Top « Date » · « Thread »
From Policeman Jenkins Server <jenk...@thetaphi.de>
Subject [JENKINS] Lucene-Solr-trunk-Linux (32bit/ibm-j9-jdk7) - Build # 8632 - Failure!
Date Tue, 10 Dec 2013 03:41:43 GMT
Build: http://jenkins.thetaphi.de/job/Lucene-Solr-trunk-Linux/8632/
Java: 32bit/ibm-j9-jdk7 -Xjit:exclude={org/apache/lucene/util/fst/FST.pack(IIF)Lorg/apache/lucene/util/fst/FST;}

8 tests failed.
REGRESSION:  org.apache.solr.analytics.expression.ExpressionTest.addTest

Error Message:
Caught exception in getStatResult, xPath = /response/lst[@name='stats']/lst[@name='ar']/double[@name='sum']  raw data: <?xml version="1.0" encoding="UTF-8"?> <response>  <lst name="responseHeader">   <int name="status">0</int>   <int name="QTime">4</int> </lst> <result name="response" numFound="100" start="0"> </result> <lst name="stats">   <lst name="stats_fields"/> </lst> <lst name="stats">   <lst name="avr">     <double name="c">100.0</double>     <long name="count">100</long>     <null name="s"/>     <null name="sum"/>   </lst>   <lst name="rr">     <str name="max">str9</str>     <str name="min">str0</str>     <str name="rmax">9rts</str>     <str name="rmin">0rts</str>   </lst>   <lst name="ar">     <long name="count">100</long>     <null name="mcm"/>     <null name="mean"/>     <null name="median"/>     <null name="su"/>     <null name="sum"/>     <null name="unique"/>   </lst>   <lst name="cnr">     <double name="c10">10.0</double>     <double name="c8">8.0</double>   </lst>   <lst name="pr">     <long name="count">100</long>     <double name="mc">1.2729436151389237E146</double>     <double name="mean">28.91</double>     <double name="su">3.9603293116911423E124</double>     <double name="sum">2891.0</double>     <long name="unique">36</long>   </lst>   <lst name="nr">     <double name="c">-100.0</double>     <long name="count">100</long>     <double name="s">-2891.0</double>     <double name="sum">2891.0</double>   </lst>   <lst name="csr">     <str name="cs1">this is the first</str>     <str name="cs2">this is the second</str>     <str name="cs3">this is the third</str>   </lst>   <lst name="cr">     <str name="ccmax">this is the secondstr9</str>     <str name="ccmin">this is the firststr0</str>     <str name="csmax">this is the second</str>     <str name="csmin">this is the first</str>     <str name="max">str9</str>     <str name="min">str0</str>   </lst>   <lst name="mr">     <long name="count">100</long>     <null name="mcm"/>     <null name="mean"/>     <null name="median"/>     <null name="su"/>     <null name="sum"/>     <null name="unique"/>   </lst>   <lst name="dmr">     <str name="cma">+2MONTHS</str>     <str name="cme">+2YEARS</str>     <date name="dmma">1812-02-29T23:59:59Z</date>     <date name="dmme">1807-12-31T23:59:59Z</date>     <date name="max">1811-12-31T23:59:59Z</date>     <date name="median">1805-12-31T23:59:59Z</date>   </lst>   <lst name="dr">     <long name="count">100</long>     <null name="mc"/>     <null name="mean"/>     <null name="su"/>     <null name="sum"/>     <null name="unique"/>   </lst>   <lst name="cdr">     <date name="cd1">1800-12-31T23:59:59Z</date>     <date name="cd2">1804-06-30T23:59:59Z</date>     <str name="cs1">1800-12-31T23:59:59Z</str>     <str name="cs2">1804-06-30T23:59:59Z</str>   </lst> </lst> </response> 

Stack Trace:
java.lang.AssertionError: Caught exception in getStatResult, xPath = /response/lst[@name='stats']/lst[@name='ar']/double[@name='sum'] 
raw data: <?xml version="1.0" encoding="UTF-8"?>
<response>

<lst name="responseHeader">
  <int name="status">0</int>
  <int name="QTime">4</int>
</lst>
<result name="response" numFound="100" start="0">
</result>
<lst name="stats">
  <lst name="stats_fields"/>
</lst>
<lst name="stats">
  <lst name="avr">
    <double name="c">100.0</double>
    <long name="count">100</long>
    <null name="s"/>
    <null name="sum"/>
  </lst>
  <lst name="rr">
    <str name="max">str9</str>
    <str name="min">str0</str>
    <str name="rmax">9rts</str>
    <str name="rmin">0rts</str>
  </lst>
  <lst name="ar">
    <long name="count">100</long>
    <null name="mcm"/>
    <null name="mean"/>
    <null name="median"/>
    <null name="su"/>
    <null name="sum"/>
    <null name="unique"/>
  </lst>
  <lst name="cnr">
    <double name="c10">10.0</double>
    <double name="c8">8.0</double>
  </lst>
  <lst name="pr">
    <long name="count">100</long>
    <double name="mc">1.2729436151389237E146</double>
    <double name="mean">28.91</double>
    <double name="su">3.9603293116911423E124</double>
    <double name="sum">2891.0</double>
    <long name="unique">36</long>
  </lst>
  <lst name="nr">
    <double name="c">-100.0</double>
    <long name="count">100</long>
    <double name="s">-2891.0</double>
    <double name="sum">2891.0</double>
  </lst>
  <lst name="csr">
    <str name="cs1">this is the first</str>
    <str name="cs2">this is the second</str>
    <str name="cs3">this is the third</str>
  </lst>
  <lst name="cr">
    <str name="ccmax">this is the secondstr9</str>
    <str name="ccmin">this is the firststr0</str>
    <str name="csmax">this is the second</str>
    <str name="csmin">this is the first</str>
    <str name="max">str9</str>
    <str name="min">str0</str>
  </lst>
  <lst name="mr">
    <long name="count">100</long>
    <null name="mcm"/>
    <null name="mean"/>
    <null name="median"/>
    <null name="su"/>
    <null name="sum"/>
    <null name="unique"/>
  </lst>
  <lst name="dmr">
    <str name="cma">+2MONTHS</str>
    <str name="cme">+2YEARS</str>
    <date name="dmma">1812-02-29T23:59:59Z</date>
    <date name="dmme">1807-12-31T23:59:59Z</date>
    <date name="max">1811-12-31T23:59:59Z</date>
    <date name="median">1805-12-31T23:59:59Z</date>
  </lst>
  <lst name="dr">
    <long name="count">100</long>
    <null name="mc"/>
    <null name="mean"/>
    <null name="su"/>
    <null name="sum"/>
    <null name="unique"/>
  </lst>
  <lst name="cdr">
    <date name="cd1">1800-12-31T23:59:59Z</date>
    <date name="cd2">1804-06-30T23:59:59Z</date>
    <str name="cs1">1800-12-31T23:59:59Z</str>
    <str name="cs2">1804-06-30T23:59:59Z</str>
  </lst>
</lst>
</response>

	at __randomizedtesting.SeedInfo.seed([83CA0A58087F9A3F:75E6A78649B09D78]:0)
	at org.junit.Assert.fail(Assert.java:93)
	at org.apache.solr.analytics.AbstractAnalyticsStatsTest.getStatResult(AbstractAnalyticsStatsTest.java:113)
	at org.apache.solr.analytics.expression.ExpressionTest.addTest(ExpressionTest.java:78)
	at sun.reflect.NativeMethodAccessorImpl.invoke0(Native Method)
	at sun.reflect.NativeMethodAccessorImpl.invoke(NativeMethodAccessorImpl.java:88)
	at sun.reflect.DelegatingMethodAccessorImpl.invoke(DelegatingMethodAccessorImpl.java:55)
	at java.lang.reflect.Method.invoke(Method.java:613)
	at com.carrotsearch.randomizedtesting.RandomizedRunner.invoke(RandomizedRunner.java:1559)
	at com.carrotsearch.randomizedtesting.RandomizedRunner.access$600(RandomizedRunner.java:79)
	at com.carrotsearch.randomizedtesting.RandomizedRunner$6.evaluate(RandomizedRunner.java:737)
	at com.carrotsearch.randomizedtesting.RandomizedRunner$7.evaluate(RandomizedRunner.java:773)
	at com.carrotsearch.randomizedtesting.RandomizedRunner$8.evaluate(RandomizedRunner.java:787)
	at com.carrotsearch.randomizedtesting.rules.SystemPropertiesRestoreRule$1.evaluate(SystemPropertiesRestoreRule.java:53)
	at org.apache.lucene.util.TestRuleSetupTeardownChained$1.evaluate(TestRuleSetupTeardownChained.java:50)
	at org.apache.lucene.util.TestRuleFieldCacheSanity$1.evaluate(TestRuleFieldCacheSanity.java:51)
	at org.apache.lucene.util.AbstractBeforeAfterRule$1.evaluate(AbstractBeforeAfterRule.java:46)
	at com.carrotsearch.randomizedtesting.rules.SystemPropertiesInvariantRule$1.evaluate(SystemPropertiesInvariantRule.java:55)
	at org.apache.lucene.util.TestRuleThreadAndTestName$1.evaluate(TestRuleThreadAndTestName.java:49)
	at org.apache.lucene.util.TestRuleIgnoreAfterMaxFailures$1.evaluate(TestRuleIgnoreAfterMaxFailures.java:70)
	at org.apache.lucene.util.TestRuleMarkFailure$1.evaluate(TestRuleMarkFailure.java:48)
	at com.carrotsearch.randomizedtesting.rules.StatementAdapter.evaluate(StatementAdapter.java:36)
	at com.carrotsearch.randomizedtesting.ThreadLeakControl$StatementRunner.run(ThreadLeakControl.java:358)
	at com.carrotsearch.randomizedtesting.ThreadLeakControl.forkTimeoutingTask(ThreadLeakControl.java:782)
	at com.carrotsearch.randomizedtesting.ThreadLeakControl$3.evaluate(ThreadLeakControl.java:442)
	at com.carrotsearch.randomizedtesting.RandomizedRunner.runSingleTest(RandomizedRunner.java:746)
	at com.carrotsearch.randomizedtesting.RandomizedRunner$3.evaluate(RandomizedRunner.java:648)
	at com.carrotsearch.randomizedtesting.RandomizedRunner$4.evaluate(RandomizedRunner.java:682)
	at com.carrotsearch.randomizedtesting.RandomizedRunner$5.evaluate(RandomizedRunner.java:693)
	at com.carrotsearch.randomizedtesting.rules.StatementAdapter.evaluate(StatementAdapter.java:36)
	at com.carrotsearch.randomizedtesting.rules.SystemPropertiesRestoreRule$1.evaluate(SystemPropertiesRestoreRule.java:53)
	at org.apache.lucene.util.AbstractBeforeAfterRule$1.evaluate(AbstractBeforeAfterRule.java:46)
	at org.apache.lucene.util.TestRuleStoreClassName$1.evaluate(TestRuleStoreClassName.java:42)
	at com.carrotsearch.randomizedtesting.rules.SystemPropertiesInvariantRule$1.evaluate(SystemPropertiesInvariantRule.java:55)
	at com.carrotsearch.randomizedtesting.rules.NoShadowingOrOverridesOnMethodsRule$1.evaluate(NoShadowingOrOverridesOnMethodsRule.java:39)
	at com.carrotsearch.randomizedtesting.rules.NoShadowingOrOverridesOnMethodsRule$1.evaluate(NoShadowingOrOverridesOnMethodsRule.java:39)
	at com.carrotsearch.randomizedtesting.rules.StatementAdapter.evaluate(StatementAdapter.java:36)
	at org.apache.lucene.util.TestRuleAssertionsRequired$1.evaluate(TestRuleAssertionsRequired.java:43)
	at org.apache.lucene.util.TestRuleMarkFailure$1.evaluate(TestRuleMarkFailure.java:48)
	at org.apache.lucene.util.TestRuleIgnoreAfterMaxFailures$1.evaluate(TestRuleIgnoreAfterMaxFailures.java:70)
	at org.apache.lucene.util.TestRuleIgnoreTestSuites$1.evaluate(TestRuleIgnoreTestSuites.java:55)
	at com.carrotsearch.randomizedtesting.rules.StatementAdapter.evaluate(StatementAdapter.java:36)
	at com.carrotsearch.randomizedtesting.ThreadLeakControl$StatementRunner.run(ThreadLeakControl.java:358)
	at java.lang.Thread.run(Thread.java:780)


REGRESSION:  org.apache.solr.analytics.expression.ExpressionTest.absoluteValueTest

Error Message:
Caught exception in getStatResult, xPath = /response/lst[@name='stats']/lst[@name='avr']/double[@name='sum']  raw data: <?xml version="1.0" encoding="UTF-8"?> <response>  <lst name="responseHeader">   <int name="status">0</int>   <int name="QTime">4</int> </lst> <result name="response" numFound="100" start="0"> </result> <lst name="stats">   <lst name="stats_fields"/> </lst> <lst name="stats">   <lst name="avr">     <double name="c">100.0</double>     <long name="count">100</long>     <null name="s"/>     <null name="sum"/>   </lst>   <lst name="rr">     <str name="max">str9</str>     <str name="min">str0</str>     <str name="rmax">9rts</str>     <str name="rmin">0rts</str>   </lst>   <lst name="ar">     <long name="count">100</long>     <null name="mcm"/>     <null name="mean"/>     <null name="median"/>     <null name="su"/>     <null name="sum"/>     <null name="unique"/>   </lst>   <lst name="cnr">     <double name="c10">10.0</double>     <double name="c8">8.0</double>   </lst>   <lst name="pr">     <long name="count">100</long>     <double name="mc">1.2729436151389237E146</double>     <double name="mean">28.91</double>     <double name="su">3.9603293116911423E124</double>     <double name="sum">2891.0</double>     <long name="unique">36</long>   </lst>   <lst name="nr">     <double name="c">-100.0</double>     <long name="count">100</long>     <double name="s">-2891.0</double>     <double name="sum">2891.0</double>   </lst>   <lst name="csr">     <str name="cs1">this is the first</str>     <str name="cs2">this is the second</str>     <str name="cs3">this is the third</str>   </lst>   <lst name="cr">     <str name="ccmax">this is the secondstr9</str>     <str name="ccmin">this is the firststr0</str>     <str name="csmax">this is the second</str>     <str name="csmin">this is the first</str>     <str name="max">str9</str>     <str name="min">str0</str>   </lst>   <lst name="mr">     <long name="count">100</long>     <null name="mcm"/>     <null name="mean"/>     <null name="median"/>     <null name="su"/>     <null name="sum"/>     <null name="unique"/>   </lst>   <lst name="dmr">     <str name="cma">+2MONTHS</str>     <str name="cme">+2YEARS</str>     <date name="dmma">1812-02-29T23:59:59Z</date>     <date name="dmme">1807-12-31T23:59:59Z</date>     <date name="max">1811-12-31T23:59:59Z</date>     <date name="median">1805-12-31T23:59:59Z</date>   </lst>   <lst name="dr">     <long name="count">100</long>     <null name="mc"/>     <null name="mean"/>     <null name="su"/>     <null name="sum"/>     <null name="unique"/>   </lst>   <lst name="cdr">     <date name="cd1">1800-12-31T23:59:59Z</date>     <date name="cd2">1804-06-30T23:59:59Z</date>     <str name="cs1">1800-12-31T23:59:59Z</str>     <str name="cs2">1804-06-30T23:59:59Z</str>   </lst> </lst> </response> 

Stack Trace:
java.lang.AssertionError: Caught exception in getStatResult, xPath = /response/lst[@name='stats']/lst[@name='avr']/double[@name='sum'] 
raw data: <?xml version="1.0" encoding="UTF-8"?>
<response>

<lst name="responseHeader">
  <int name="status">0</int>
  <int name="QTime">4</int>
</lst>
<result name="response" numFound="100" start="0">
</result>
<lst name="stats">
  <lst name="stats_fields"/>
</lst>
<lst name="stats">
  <lst name="avr">
    <double name="c">100.0</double>
    <long name="count">100</long>
    <null name="s"/>
    <null name="sum"/>
  </lst>
  <lst name="rr">
    <str name="max">str9</str>
    <str name="min">str0</str>
    <str name="rmax">9rts</str>
    <str name="rmin">0rts</str>
  </lst>
  <lst name="ar">
    <long name="count">100</long>
    <null name="mcm"/>
    <null name="mean"/>
    <null name="median"/>
    <null name="su"/>
    <null name="sum"/>
    <null name="unique"/>
  </lst>
  <lst name="cnr">
    <double name="c10">10.0</double>
    <double name="c8">8.0</double>
  </lst>
  <lst name="pr">
    <long name="count">100</long>
    <double name="mc">1.2729436151389237E146</double>
    <double name="mean">28.91</double>
    <double name="su">3.9603293116911423E124</double>
    <double name="sum">2891.0</double>
    <long name="unique">36</long>
  </lst>
  <lst name="nr">
    <double name="c">-100.0</double>
    <long name="count">100</long>
    <double name="s">-2891.0</double>
    <double name="sum">2891.0</double>
  </lst>
  <lst name="csr">
    <str name="cs1">this is the first</str>
    <str name="cs2">this is the second</str>
    <str name="cs3">this is the third</str>
  </lst>
  <lst name="cr">
    <str name="ccmax">this is the secondstr9</str>
    <str name="ccmin">this is the firststr0</str>
    <str name="csmax">this is the second</str>
    <str name="csmin">this is the first</str>
    <str name="max">str9</str>
    <str name="min">str0</str>
  </lst>
  <lst name="mr">
    <long name="count">100</long>
    <null name="mcm"/>
    <null name="mean"/>
    <null name="median"/>
    <null name="su"/>
    <null name="sum"/>
    <null name="unique"/>
  </lst>
  <lst name="dmr">
    <str name="cma">+2MONTHS</str>
    <str name="cme">+2YEARS</str>
    <date name="dmma">1812-02-29T23:59:59Z</date>
    <date name="dmme">1807-12-31T23:59:59Z</date>
    <date name="max">1811-12-31T23:59:59Z</date>
    <date name="median">1805-12-31T23:59:59Z</date>
  </lst>
  <lst name="dr">
    <long name="count">100</long>
    <null name="mc"/>
    <null name="mean"/>
    <null name="su"/>
    <null name="sum"/>
    <null name="unique"/>
  </lst>
  <lst name="cdr">
    <date name="cd1">1800-12-31T23:59:59Z</date>
    <date name="cd2">1804-06-30T23:59:59Z</date>
    <str name="cs1">1800-12-31T23:59:59Z</str>
    <str name="cs2">1804-06-30T23:59:59Z</str>
  </lst>
</lst>
</response>

	at __randomizedtesting.SeedInfo.seed([83CA0A58087F9A3F:A2662A4DC5E2C259]:0)
	at org.junit.Assert.fail(Assert.java:93)
	at org.apache.solr.analytics.AbstractAnalyticsStatsTest.getStatResult(AbstractAnalyticsStatsTest.java:113)
	at org.apache.solr.analytics.expression.ExpressionTest.absoluteValueTest(ExpressionTest.java:143)
	at sun.reflect.NativeMethodAccessorImpl.invoke0(Native Method)
	at sun.reflect.NativeMethodAccessorImpl.invoke(NativeMethodAccessorImpl.java:88)
	at sun.reflect.DelegatingMethodAccessorImpl.invoke(DelegatingMethodAccessorImpl.java:55)
	at java.lang.reflect.Method.invoke(Method.java:613)
	at com.carrotsearch.randomizedtesting.RandomizedRunner.invoke(RandomizedRunner.java:1559)
	at com.carrotsearch.randomizedtesting.RandomizedRunner.access$600(RandomizedRunner.java:79)
	at com.carrotsearch.randomizedtesting.RandomizedRunner$6.evaluate(RandomizedRunner.java:737)
	at com.carrotsearch.randomizedtesting.RandomizedRunner$7.evaluate(RandomizedRunner.java:773)
	at com.carrotsearch.randomizedtesting.RandomizedRunner$8.evaluate(RandomizedRunner.java:787)
	at com.carrotsearch.randomizedtesting.rules.SystemPropertiesRestoreRule$1.evaluate(SystemPropertiesRestoreRule.java:53)
	at org.apache.lucene.util.TestRuleSetupTeardownChained$1.evaluate(TestRuleSetupTeardownChained.java:50)
	at org.apache.lucene.util.TestRuleFieldCacheSanity$1.evaluate(TestRuleFieldCacheSanity.java:51)
	at org.apache.lucene.util.AbstractBeforeAfterRule$1.evaluate(AbstractBeforeAfterRule.java:46)
	at com.carrotsearch.randomizedtesting.rules.SystemPropertiesInvariantRule$1.evaluate(SystemPropertiesInvariantRule.java:55)
	at org.apache.lucene.util.TestRuleThreadAndTestName$1.evaluate(TestRuleThreadAndTestName.java:49)
	at org.apache.lucene.util.TestRuleIgnoreAfterMaxFailures$1.evaluate(TestRuleIgnoreAfterMaxFailures.java:70)
	at org.apache.lucene.util.TestRuleMarkFailure$1.evaluate(TestRuleMarkFailure.java:48)
	at com.carrotsearch.randomizedtesting.rules.StatementAdapter.evaluate(StatementAdapter.java:36)
	at com.carrotsearch.randomizedtesting.ThreadLeakControl$StatementRunner.run(ThreadLeakControl.java:358)
	at com.carrotsearch.randomizedtesting.ThreadLeakControl.forkTimeoutingTask(ThreadLeakControl.java:782)
	at com.carrotsearch.randomizedtesting.ThreadLeakControl$3.evaluate(ThreadLeakControl.java:442)
	at com.carrotsearch.randomizedtesting.RandomizedRunner.runSingleTest(RandomizedRunner.java:746)
	at com.carrotsearch.randomizedtesting.RandomizedRunner$3.evaluate(RandomizedRunner.java:648)
	at com.carrotsearch.randomizedtesting.RandomizedRunner$4.evaluate(RandomizedRunner.java:682)
	at com.carrotsearch.randomizedtesting.RandomizedRunner$5.evaluate(RandomizedRunner.java:693)
	at com.carrotsearch.randomizedtesting.rules.StatementAdapter.evaluate(StatementAdapter.java:36)
	at com.carrotsearch.randomizedtesting.rules.SystemPropertiesRestoreRule$1.evaluate(SystemPropertiesRestoreRule.java:53)
	at org.apache.lucene.util.AbstractBeforeAfterRule$1.evaluate(AbstractBeforeAfterRule.java:46)
	at org.apache.lucene.util.TestRuleStoreClassName$1.evaluate(TestRuleStoreClassName.java:42)
	at com.carrotsearch.randomizedtesting.rules.SystemPropertiesInvariantRule$1.evaluate(SystemPropertiesInvariantRule.java:55)
	at com.carrotsearch.randomizedtesting.rules.NoShadowingOrOverridesOnMethodsRule$1.evaluate(NoShadowingOrOverridesOnMethodsRule.java:39)
	at com.carrotsearch.randomizedtesting.rules.NoShadowingOrOverridesOnMethodsRule$1.evaluate(NoShadowingOrOverridesOnMethodsRule.java:39)
	at com.carrotsearch.randomizedtesting.rules.StatementAdapter.evaluate(StatementAdapter.java:36)
	at org.apache.lucene.util.TestRuleAssertionsRequired$1.evaluate(TestRuleAssertionsRequired.java:43)
	at org.apache.lucene.util.TestRuleMarkFailure$1.evaluate(TestRuleMarkFailure.java:48)
	at org.apache.lucene.util.TestRuleIgnoreAfterMaxFailures$1.evaluate(TestRuleIgnoreAfterMaxFailures.java:70)
	at org.apache.lucene.util.TestRuleIgnoreTestSuites$1.evaluate(TestRuleIgnoreTestSuites.java:55)
	at com.carrotsearch.randomizedtesting.rules.StatementAdapter.evaluate(StatementAdapter.java:36)
	at com.carrotsearch.randomizedtesting.ThreadLeakControl$StatementRunner.run(ThreadLeakControl.java:358)
	at java.lang.Thread.run(Thread.java:780)


REGRESSION:  org.apache.solr.analytics.expression.ExpressionTest.multiplyTest

Error Message:
Caught exception in getStatResult, xPath = /response/lst[@name='stats']/lst[@name='mr']/double[@name='sum']  raw data: <?xml version="1.0" encoding="UTF-8"?> <response>  <lst name="responseHeader">   <int name="status">0</int>   <int name="QTime">4</int> </lst> <result name="response" numFound="100" start="0"> </result> <lst name="stats">   <lst name="stats_fields"/> </lst> <lst name="stats">   <lst name="avr">     <double name="c">100.0</double>     <long name="count">100</long>     <null name="s"/>     <null name="sum"/>   </lst>   <lst name="rr">     <str name="max">str9</str>     <str name="min">str0</str>     <str name="rmax">9rts</str>     <str name="rmin">0rts</str>   </lst>   <lst name="ar">     <long name="count">100</long>     <null name="mcm"/>     <null name="mean"/>     <null name="median"/>     <null name="su"/>     <null name="sum"/>     <null name="unique"/>   </lst>   <lst name="cnr">     <double name="c10">10.0</double>     <double name="c8">8.0</double>   </lst>   <lst name="pr">     <long name="count">100</long>     <double name="mc">1.2729436151389237E146</double>     <double name="mean">28.91</double>     <double name="su">3.9603293116911423E124</double>     <double name="sum">2891.0</double>     <long name="unique">36</long>   </lst>   <lst name="nr">     <double name="c">-100.0</double>     <long name="count">100</long>     <double name="s">-2891.0</double>     <double name="sum">2891.0</double>   </lst>   <lst name="csr">     <str name="cs1">this is the first</str>     <str name="cs2">this is the second</str>     <str name="cs3">this is the third</str>   </lst>   <lst name="cr">     <str name="ccmax">this is the secondstr9</str>     <str name="ccmin">this is the firststr0</str>     <str name="csmax">this is the second</str>     <str name="csmin">this is the first</str>     <str name="max">str9</str>     <str name="min">str0</str>   </lst>   <lst name="mr">     <long name="count">100</long>     <null name="mcm"/>     <null name="mean"/>     <null name="median"/>     <null name="su"/>     <null name="sum"/>     <null name="unique"/>   </lst>   <lst name="dmr">     <str name="cma">+2MONTHS</str>     <str name="cme">+2YEARS</str>     <date name="dmma">1812-02-29T23:59:59Z</date>     <date name="dmme">1807-12-31T23:59:59Z</date>     <date name="max">1811-12-31T23:59:59Z</date>     <date name="median">1805-12-31T23:59:59Z</date>   </lst>   <lst name="dr">     <long name="count">100</long>     <null name="mc"/>     <null name="mean"/>     <null name="su"/>     <null name="sum"/>     <null name="unique"/>   </lst>   <lst name="cdr">     <date name="cd1">1800-12-31T23:59:59Z</date>     <date name="cd2">1804-06-30T23:59:59Z</date>     <str name="cs1">1800-12-31T23:59:59Z</str>     <str name="cs2">1804-06-30T23:59:59Z</str>   </lst> </lst> </response> 

Stack Trace:
java.lang.AssertionError: Caught exception in getStatResult, xPath = /response/lst[@name='stats']/lst[@name='mr']/double[@name='sum'] 
raw data: <?xml version="1.0" encoding="UTF-8"?>
<response>

<lst name="responseHeader">
  <int name="status">0</int>
  <int name="QTime">4</int>
</lst>
<result name="response" numFound="100" start="0">
</result>
<lst name="stats">
  <lst name="stats_fields"/>
</lst>
<lst name="stats">
  <lst name="avr">
    <double name="c">100.0</double>
    <long name="count">100</long>
    <null name="s"/>
    <null name="sum"/>
  </lst>
  <lst name="rr">
    <str name="max">str9</str>
    <str name="min">str0</str>
    <str name="rmax">9rts</str>
    <str name="rmin">0rts</str>
  </lst>
  <lst name="ar">
    <long name="count">100</long>
    <null name="mcm"/>
    <null name="mean"/>
    <null name="median"/>
    <null name="su"/>
    <null name="sum"/>
    <null name="unique"/>
  </lst>
  <lst name="cnr">
    <double name="c10">10.0</double>
    <double name="c8">8.0</double>
  </lst>
  <lst name="pr">
    <long name="count">100</long>
    <double name="mc">1.2729436151389237E146</double>
    <double name="mean">28.91</double>
    <double name="su">3.9603293116911423E124</double>
    <double name="sum">2891.0</double>
    <long name="unique">36</long>
  </lst>
  <lst name="nr">
    <double name="c">-100.0</double>
    <long name="count">100</long>
    <double name="s">-2891.0</double>
    <double name="sum">2891.0</double>
  </lst>
  <lst name="csr">
    <str name="cs1">this is the first</str>
    <str name="cs2">this is the second</str>
    <str name="cs3">this is the third</str>
  </lst>
  <lst name="cr">
    <str name="ccmax">this is the secondstr9</str>
    <str name="ccmin">this is the firststr0</str>
    <str name="csmax">this is the second</str>
    <str name="csmin">this is the first</str>
    <str name="max">str9</str>
    <str name="min">str0</str>
  </lst>
  <lst name="mr">
    <long name="count">100</long>
    <null name="mcm"/>
    <null name="mean"/>
    <null name="median"/>
    <null name="su"/>
    <null name="sum"/>
    <null name="unique"/>
  </lst>
  <lst name="dmr">
    <str name="cma">+2MONTHS</str>
    <str name="cme">+2YEARS</str>
    <date name="dmma">1812-02-29T23:59:59Z</date>
    <date name="dmme">1807-12-31T23:59:59Z</date>
    <date name="max">1811-12-31T23:59:59Z</date>
    <date name="median">1805-12-31T23:59:59Z</date>
  </lst>
  <lst name="dr">
    <long name="count">100</long>
    <null name="mc"/>
    <null name="mean"/>
    <null name="su"/>
    <null name="sum"/>
    <null name="unique"/>
  </lst>
  <lst name="cdr">
    <date name="cd1">1800-12-31T23:59:59Z</date>
    <date name="cd2">1804-06-30T23:59:59Z</date>
    <str name="cs1">1800-12-31T23:59:59Z</str>
    <str name="cs2">1804-06-30T23:59:59Z</str>
  </lst>
</lst>
</response>

	at __randomizedtesting.SeedInfo.seed([83CA0A58087F9A3F:E84B14263D71AC51]:0)
	at org.junit.Assert.fail(Assert.java:93)
	at org.apache.solr.analytics.AbstractAnalyticsStatsTest.getStatResult(AbstractAnalyticsStatsTest.java:113)
	at org.apache.solr.analytics.expression.ExpressionTest.multiplyTest(ExpressionTest.java:92)
	at sun.reflect.NativeMethodAccessorImpl.invoke0(Native Method)
	at sun.reflect.NativeMethodAccessorImpl.invoke(NativeMethodAccessorImpl.java:88)
	at sun.reflect.DelegatingMethodAccessorImpl.invoke(DelegatingMethodAccessorImpl.java:55)
	at java.lang.reflect.Method.invoke(Method.java:613)
	at com.carrotsearch.randomizedtesting.RandomizedRunner.invoke(RandomizedRunner.java:1559)
	at com.carrotsearch.randomizedtesting.RandomizedRunner.access$600(RandomizedRunner.java:79)
	at com.carrotsearch.randomizedtesting.RandomizedRunner$6.evaluate(RandomizedRunner.java:737)
	at com.carrotsearch.randomizedtesting.RandomizedRunner$7.evaluate(RandomizedRunner.java:773)
	at com.carrotsearch.randomizedtesting.RandomizedRunner$8.evaluate(RandomizedRunner.java:787)
	at com.carrotsearch.randomizedtesting.rules.SystemPropertiesRestoreRule$1.evaluate(SystemPropertiesRestoreRule.java:53)
	at org.apache.lucene.util.TestRuleSetupTeardownChained$1.evaluate(TestRuleSetupTeardownChained.java:50)
	at org.apache.lucene.util.TestRuleFieldCacheSanity$1.evaluate(TestRuleFieldCacheSanity.java:51)
	at org.apache.lucene.util.AbstractBeforeAfterRule$1.evaluate(AbstractBeforeAfterRule.java:46)
	at com.carrotsearch.randomizedtesting.rules.SystemPropertiesInvariantRule$1.evaluate(SystemPropertiesInvariantRule.java:55)
	at org.apache.lucene.util.TestRuleThreadAndTestName$1.evaluate(TestRuleThreadAndTestName.java:49)
	at org.apache.lucene.util.TestRuleIgnoreAfterMaxFailures$1.evaluate(TestRuleIgnoreAfterMaxFailures.java:70)
	at org.apache.lucene.util.TestRuleMarkFailure$1.evaluate(TestRuleMarkFailure.java:48)
	at com.carrotsearch.randomizedtesting.rules.StatementAdapter.evaluate(StatementAdapter.java:36)
	at com.carrotsearch.randomizedtesting.ThreadLeakControl$StatementRunner.run(ThreadLeakControl.java:358)
	at com.carrotsearch.randomizedtesting.ThreadLeakControl.forkTimeoutingTask(ThreadLeakControl.java:782)
	at com.carrotsearch.randomizedtesting.ThreadLeakControl$3.evaluate(ThreadLeakControl.java:442)
	at com.carrotsearch.randomizedtesting.RandomizedRunner.runSingleTest(RandomizedRunner.java:746)
	at com.carrotsearch.randomizedtesting.RandomizedRunner$3.evaluate(RandomizedRunner.java:648)
	at com.carrotsearch.randomizedtesting.RandomizedRunner$4.evaluate(RandomizedRunner.java:682)
	at com.carrotsearch.randomizedtesting.RandomizedRunner$5.evaluate(RandomizedRunner.java:693)
	at com.carrotsearch.randomizedtesting.rules.StatementAdapter.evaluate(StatementAdapter.java:36)
	at com.carrotsearch.randomizedtesting.rules.SystemPropertiesRestoreRule$1.evaluate(SystemPropertiesRestoreRule.java:53)
	at org.apache.lucene.util.AbstractBeforeAfterRule$1.evaluate(AbstractBeforeAfterRule.java:46)
	at org.apache.lucene.util.TestRuleStoreClassName$1.evaluate(TestRuleStoreClassName.java:42)
	at com.carrotsearch.randomizedtesting.rules.SystemPropertiesInvariantRule$1.evaluate(SystemPropertiesInvariantRule.java:55)
	at com.carrotsearch.randomizedtesting.rules.NoShadowingOrOverridesOnMethodsRule$1.evaluate(NoShadowingOrOverridesOnMethodsRule.java:39)
	at com.carrotsearch.randomizedtesting.rules.NoShadowingOrOverridesOnMethodsRule$1.evaluate(NoShadowingOrOverridesOnMethodsRule.java:39)
	at com.carrotsearch.randomizedtesting.rules.StatementAdapter.evaluate(StatementAdapter.java:36)
	at org.apache.lucene.util.TestRuleAssertionsRequired$1.evaluate(TestRuleAssertionsRequired.java:43)
	at org.apache.lucene.util.TestRuleMarkFailure$1.evaluate(TestRuleMarkFailure.java:48)
	at org.apache.lucene.util.TestRuleIgnoreAfterMaxFailures$1.evaluate(TestRuleIgnoreAfterMaxFailures.java:70)
	at org.apache.lucene.util.TestRuleIgnoreTestSuites$1.evaluate(TestRuleIgnoreTestSuites.java:55)
	at com.carrotsearch.randomizedtesting.rules.StatementAdapter.evaluate(StatementAdapter.java:36)
	at com.carrotsearch.randomizedtesting.ThreadLeakControl$StatementRunner.run(ThreadLeakControl.java:358)
	at java.lang.Thread.run(Thread.java:780)


REGRESSION:  org.apache.solr.analytics.expression.ExpressionTest.divideTest

Error Message:
Caught exception in getStatResult, xPath = /response/lst[@name='stats']/lst[@name='dr']/double[@name='sum']  raw data: <?xml version="1.0" encoding="UTF-8"?> <response>  <lst name="responseHeader">   <int name="status">0</int>   <int name="QTime">4</int> </lst> <result name="response" numFound="100" start="0"> </result> <lst name="stats">   <lst name="stats_fields"/> </lst> <lst name="stats">   <lst name="avr">     <double name="c">100.0</double>     <long name="count">100</long>     <null name="s"/>     <null name="sum"/>   </lst>   <lst name="rr">     <str name="max">str9</str>     <str name="min">str0</str>     <str name="rmax">9rts</str>     <str name="rmin">0rts</str>   </lst>   <lst name="ar">     <long name="count">100</long>     <null name="mcm"/>     <null name="mean"/>     <null name="median"/>     <null name="su"/>     <null name="sum"/>     <null name="unique"/>   </lst>   <lst name="cnr">     <double name="c10">10.0</double>     <double name="c8">8.0</double>   </lst>   <lst name="pr">     <long name="count">100</long>     <double name="mc">1.2729436151389237E146</double>     <double name="mean">28.91</double>     <double name="su">3.9603293116911423E124</double>     <double name="sum">2891.0</double>     <long name="unique">36</long>   </lst>   <lst name="nr">     <double name="c">-100.0</double>     <long name="count">100</long>     <double name="s">-2891.0</double>     <double name="sum">2891.0</double>   </lst>   <lst name="csr">     <str name="cs1">this is the first</str>     <str name="cs2">this is the second</str>     <str name="cs3">this is the third</str>   </lst>   <lst name="cr">     <str name="ccmax">this is the secondstr9</str>     <str name="ccmin">this is the firststr0</str>     <str name="csmax">this is the second</str>     <str name="csmin">this is the first</str>     <str name="max">str9</str>     <str name="min">str0</str>   </lst>   <lst name="mr">     <long name="count">100</long>     <null name="mcm"/>     <null name="mean"/>     <null name="median"/>     <null name="su"/>     <null name="sum"/>     <null name="unique"/>   </lst>   <lst name="dmr">     <str name="cma">+2MONTHS</str>     <str name="cme">+2YEARS</str>     <date name="dmma">1812-02-29T23:59:59Z</date>     <date name="dmme">1807-12-31T23:59:59Z</date>     <date name="max">1811-12-31T23:59:59Z</date>     <date name="median">1805-12-31T23:59:59Z</date>   </lst>   <lst name="dr">     <long name="count">100</long>     <null name="mc"/>     <null name="mean"/>     <null name="su"/>     <null name="sum"/>     <null name="unique"/>   </lst>   <lst name="cdr">     <date name="cd1">1800-12-31T23:59:59Z</date>     <date name="cd2">1804-06-30T23:59:59Z</date>     <str name="cs1">1800-12-31T23:59:59Z</str>     <str name="cs2">1804-06-30T23:59:59Z</str>   </lst> </lst> </response> 

Stack Trace:
java.lang.AssertionError: Caught exception in getStatResult, xPath = /response/lst[@name='stats']/lst[@name='dr']/double[@name='sum'] 
raw data: <?xml version="1.0" encoding="UTF-8"?>
<response>

<lst name="responseHeader">
  <int name="status">0</int>
  <int name="QTime">4</int>
</lst>
<result name="response" numFound="100" start="0">
</result>
<lst name="stats">
  <lst name="stats_fields"/>
</lst>
<lst name="stats">
  <lst name="avr">
    <double name="c">100.0</double>
    <long name="count">100</long>
    <null name="s"/>
    <null name="sum"/>
  </lst>
  <lst name="rr">
    <str name="max">str9</str>
    <str name="min">str0</str>
    <str name="rmax">9rts</str>
    <str name="rmin">0rts</str>
  </lst>
  <lst name="ar">
    <long name="count">100</long>
    <null name="mcm"/>
    <null name="mean"/>
    <null name="median"/>
    <null name="su"/>
    <null name="sum"/>
    <null name="unique"/>
  </lst>
  <lst name="cnr">
    <double name="c10">10.0</double>
    <double name="c8">8.0</double>
  </lst>
  <lst name="pr">
    <long name="count">100</long>
    <double name="mc">1.2729436151389237E146</double>
    <double name="mean">28.91</double>
    <double name="su">3.9603293116911423E124</double>
    <double name="sum">2891.0</double>
    <long name="unique">36</long>
  </lst>
  <lst name="nr">
    <double name="c">-100.0</double>
    <long name="count">100</long>
    <double name="s">-2891.0</double>
    <double name="sum">2891.0</double>
  </lst>
  <lst name="csr">
    <str name="cs1">this is the first</str>
    <str name="cs2">this is the second</str>
    <str name="cs3">this is the third</str>
  </lst>
  <lst name="cr">
    <str name="ccmax">this is the secondstr9</str>
    <str name="ccmin">this is the firststr0</str>
    <str name="csmax">this is the second</str>
    <str name="csmin">this is the first</str>
    <str name="max">str9</str>
    <str name="min">str0</str>
  </lst>
  <lst name="mr">
    <long name="count">100</long>
    <null name="mcm"/>
    <null name="mean"/>
    <null name="median"/>
    <null name="su"/>
    <null name="sum"/>
    <null name="unique"/>
  </lst>
  <lst name="dmr">
    <str name="cma">+2MONTHS</str>
    <str name="cme">+2YEARS</str>
    <date name="dmma">1812-02-29T23:59:59Z</date>
    <date name="dmme">1807-12-31T23:59:59Z</date>
    <date name="max">1811-12-31T23:59:59Z</date>
    <date name="median">1805-12-31T23:59:59Z</date>
  </lst>
  <lst name="dr">
    <long name="count">100</long>
    <null name="mc"/>
    <null name="mean"/>
    <null name="su"/>
    <null name="sum"/>
    <null name="unique"/>
  </lst>
  <lst name="cdr">
    <date name="cd1">1800-12-31T23:59:59Z</date>
    <date name="cd2">1804-06-30T23:59:59Z</date>
    <str name="cs1">1800-12-31T23:59:59Z</str>
    <str name="cs2">1804-06-30T23:59:59Z</str>
  </lst>
</lst>
</response>

	at __randomizedtesting.SeedInfo.seed([83CA0A58087F9A3F:DBC7E1AE2CBDF8E9]:0)
	at org.junit.Assert.fail(Assert.java:93)
	at org.apache.solr.analytics.AbstractAnalyticsStatsTest.getStatResult(AbstractAnalyticsStatsTest.java:113)
	at org.apache.solr.analytics.expression.ExpressionTest.divideTest(ExpressionTest.java:106)
	at sun.reflect.NativeMethodAccessorImpl.invoke0(Native Method)
	at sun.reflect.NativeMethodAccessorImpl.invoke(NativeMethodAccessorImpl.java:88)
	at sun.reflect.DelegatingMethodAccessorImpl.invoke(DelegatingMethodAccessorImpl.java:55)
	at java.lang.reflect.Method.invoke(Method.java:613)
	at com.carrotsearch.randomizedtesting.RandomizedRunner.invoke(RandomizedRunner.java:1559)
	at com.carrotsearch.randomizedtesting.RandomizedRunner.access$600(RandomizedRunner.java:79)
	at com.carrotsearch.randomizedtesting.RandomizedRunner$6.evaluate(RandomizedRunner.java:737)
	at com.carrotsearch.randomizedtesting.RandomizedRunner$7.evaluate(RandomizedRunner.java:773)
	at com.carrotsearch.randomizedtesting.RandomizedRunner$8.evaluate(RandomizedRunner.java:787)
	at com.carrotsearch.randomizedtesting.rules.SystemPropertiesRestoreRule$1.evaluate(SystemPropertiesRestoreRule.java:53)
	at org.apache.lucene.util.TestRuleSetupTeardownChained$1.evaluate(TestRuleSetupTeardownChained.java:50)
	at org.apache.lucene.util.TestRuleFieldCacheSanity$1.evaluate(TestRuleFieldCacheSanity.java:51)
	at org.apache.lucene.util.AbstractBeforeAfterRule$1.evaluate(AbstractBeforeAfterRule.java:46)
	at com.carrotsearch.randomizedtesting.rules.SystemPropertiesInvariantRule$1.evaluate(SystemPropertiesInvariantRule.java:55)
	at org.apache.lucene.util.TestRuleThreadAndTestName$1.evaluate(TestRuleThreadAndTestName.java:49)
	at org.apache.lucene.util.TestRuleIgnoreAfterMaxFailures$1.evaluate(TestRuleIgnoreAfterMaxFailures.java:70)
	at org.apache.lucene.util.TestRuleMarkFailure$1.evaluate(TestRuleMarkFailure.java:48)
	at com.carrotsearch.randomizedtesting.rules.StatementAdapter.evaluate(StatementAdapter.java:36)
	at com.carrotsearch.randomizedtesting.ThreadLeakControl$StatementRunner.run(ThreadLeakControl.java:358)
	at com.carrotsearch.randomizedtesting.ThreadLeakControl.forkTimeoutingTask(ThreadLeakControl.java:782)
	at com.carrotsearch.randomizedtesting.ThreadLeakControl$3.evaluate(ThreadLeakControl.java:442)
	at com.carrotsearch.randomizedtesting.RandomizedRunner.runSingleTest(RandomizedRunner.java:746)
	at com.carrotsearch.randomizedtesting.RandomizedRunner$3.evaluate(RandomizedRunner.java:648)
	at com.carrotsearch.randomizedtesting.RandomizedRunner$4.evaluate(RandomizedRunner.java:682)
	at com.carrotsearch.randomizedtesting.RandomizedRunner$5.evaluate(RandomizedRunner.java:693)
	at com.carrotsearch.randomizedtesting.rules.StatementAdapter.evaluate(StatementAdapter.java:36)
	at com.carrotsearch.randomizedtesting.rules.SystemPropertiesRestoreRule$1.evaluate(SystemPropertiesRestoreRule.java:53)
	at org.apache.lucene.util.AbstractBeforeAfterRule$1.evaluate(AbstractBeforeAfterRule.java:46)
	at org.apache.lucene.util.TestRuleStoreClassName$1.evaluate(TestRuleStoreClassName.java:42)
	at com.carrotsearch.randomizedtesting.rules.SystemPropertiesInvariantRule$1.evaluate(SystemPropertiesInvariantRule.java:55)
	at com.carrotsearch.randomizedtesting.rules.NoShadowingOrOverridesOnMethodsRule$1.evaluate(NoShadowingOrOverridesOnMethodsRule.java:39)
	at com.carrotsearch.randomizedtesting.rules.NoShadowingOrOverridesOnMethodsRule$1.evaluate(NoShadowingOrOverridesOnMethodsRule.java:39)
	at com.carrotsearch.randomizedtesting.rules.StatementAdapter.evaluate(StatementAdapter.java:36)
	at org.apache.lucene.util.TestRuleAssertionsRequired$1.evaluate(TestRuleAssertionsRequired.java:43)
	at org.apache.lucene.util.TestRuleMarkFailure$1.evaluate(TestRuleMarkFailure.java:48)
	at org.apache.lucene.util.TestRuleIgnoreAfterMaxFailures$1.evaluate(TestRuleIgnoreAfterMaxFailures.java:70)
	at org.apache.lucene.util.TestRuleIgnoreTestSuites$1.evaluate(TestRuleIgnoreTestSuites.java:55)
	at com.carrotsearch.randomizedtesting.rules.StatementAdapter.evaluate(StatementAdapter.java:36)
	at com.carrotsearch.randomizedtesting.ThreadLeakControl$StatementRunner.run(ThreadLeakControl.java:358)
	at java.lang.Thread.run(Thread.java:780)


REGRESSION:  org.apache.solr.handler.component.DistributedQueryElevationComponentTest.testDistribSearch

Error Message:
.responseHeader.params.fl!=version (unordered or missing)

Stack Trace:
junit.framework.AssertionFailedError: .responseHeader.params.fl!=version (unordered or missing)
	at __randomizedtesting.SeedInfo.seed([83CA0A58087F9A3F:22C84407F20FA03]:0)
	at junit.framework.Assert.fail(Assert.java:50)
	at org.apache.solr.BaseDistributedSearchTestCase.compareSolrResponses(BaseDistributedSearchTestCase.java:816)
	at org.apache.solr.BaseDistributedSearchTestCase.compareResponses(BaseDistributedSearchTestCase.java:835)
	at org.apache.solr.BaseDistributedSearchTestCase.query(BaseDistributedSearchTestCase.java:538)
	at org.apache.solr.BaseDistributedSearchTestCase.query(BaseDistributedSearchTestCase.java:515)
	at org.apache.solr.handler.component.DistributedQueryElevationComponentTest.doTest(DistributedQueryElevationComponentTest.java:81)
	at org.apache.solr.BaseDistributedSearchTestCase.testDistribSearch(BaseDistributedSearchTestCase.java:843)
	at sun.reflect.NativeMethodAccessorImpl.invoke0(Native Method)
	at sun.reflect.NativeMethodAccessorImpl.invoke(NativeMethodAccessorImpl.java:88)
	at sun.reflect.DelegatingMethodAccessorImpl.invoke(DelegatingMethodAccessorImpl.java:55)
	at java.lang.reflect.Method.invoke(Method.java:613)
	at com.carrotsearch.randomizedtesting.RandomizedRunner.invoke(RandomizedRunner.java:1559)
	at com.carrotsearch.randomizedtesting.RandomizedRunner.access$600(RandomizedRunner.java:79)
	at com.carrotsearch.randomizedtesting.RandomizedRunner$6.evaluate(RandomizedRunner.java:737)
	at com.carrotsearch.randomizedtesting.RandomizedRunner$7.evaluate(RandomizedRunner.java:773)
	at com.carrotsearch.randomizedtesting.RandomizedRunner$8.evaluate(RandomizedRunner.java:787)
	at com.carrotsearch.randomizedtesting.rules.SystemPropertiesRestoreRule$1.evaluate(SystemPropertiesRestoreRule.java:53)
	at org.apache.lucene.util.TestRuleSetupTeardownChained$1.evaluate(TestRuleSetupTeardownChained.java:50)
	at org.apache.lucene.util.TestRuleFieldCacheSanity$1.evaluate(TestRuleFieldCacheSanity.java:51)
	at org.apache.lucene.util.AbstractBeforeAfterRule$1.evaluate(AbstractBeforeAfterRule.java:46)
	at com.carrotsearch.randomizedtesting.rules.SystemPropertiesInvariantRule$1.evaluate(SystemPropertiesInvariantRule.java:55)
	at org.apache.lucene.util.TestRuleThreadAndTestName$1.evaluate(TestRuleThreadAndTestName.java:49)
	at org.apache.lucene.util.TestRuleIgnoreAfterMaxFailures$1.evaluate(TestRuleIgnoreAfterMaxFailures.java:70)
	at org.apache.lucene.util.TestRuleMarkFailure$1.evaluate(TestRuleMarkFailure.java:48)
	at com.carrotsearch.randomizedtesting.rules.StatementAdapter.evaluate(StatementAdapter.java:36)
	at com.carrotsearch.randomizedtesting.ThreadLeakControl$StatementRunner.run(ThreadLeakControl.java:358)
	at com.carrotsearch.randomizedtesting.ThreadLeakControl.forkTimeoutingTask(ThreadLeakControl.java:782)
	at com.carrotsearch.randomizedtesting.ThreadLeakControl$3.evaluate(ThreadLeakControl.java:442)
	at com.carrotsearch.randomizedtesting.RandomizedRunner.runSingleTest(RandomizedRunner.java:746)
	at com.carrotsearch.randomizedtesting.RandomizedRunner$3.evaluate(RandomizedRunner.java:648)
	at com.carrotsearch.randomizedtesting.RandomizedRunner$4.evaluate(RandomizedRunner.java:682)
	at com.carrotsearch.randomizedtesting.RandomizedRunner$5.evaluate(RandomizedRunner.java:693)
	at com.carrotsearch.randomizedtesting.rules.StatementAdapter.evaluate(StatementAdapter.java:36)
	at com.carrotsearch.randomizedtesting.rules.SystemPropertiesRestoreRule$1.evaluate(SystemPropertiesRestoreRule.java:53)
	at org.apache.lucene.util.AbstractBeforeAfterRule$1.evaluate(AbstractBeforeAfterRule.java:46)
	at org.apache.lucene.util.TestRuleStoreClassName$1.evaluate(TestRuleStoreClassName.java:42)
	at com.carrotsearch.randomizedtesting.rules.SystemPropertiesInvariantRule$1.evaluate(SystemPropertiesInvariantRule.java:55)
	at com.carrotsearch.randomizedtesting.rules.NoShadowingOrOverridesOnMethodsRule$1.evaluate(NoShadowingOrOverridesOnMethodsRule.java:39)
	at com.carrotsearch.randomizedtesting.rules.NoShadowingOrOverridesOnMethodsRule$1.evaluate(NoShadowingOrOverridesOnMethodsRule.java:39)
	at com.carrotsearch.randomizedtesting.rules.StatementAdapter.evaluate(StatementAdapter.java:36)
	at org.apache.lucene.util.TestRuleAssertionsRequired$1.evaluate(TestRuleAssertionsRequired.java:43)
	at org.apache.lucene.util.TestRuleMarkFailure$1.evaluate(TestRuleMarkFailure.java:48)
	at org.apache.lucene.util.TestRuleIgnoreAfterMaxFailures$1.evaluate(TestRuleIgnoreAfterMaxFailures.java:70)
	at org.apache.lucene.util.TestRuleIgnoreTestSuites$1.evaluate(TestRuleIgnoreTestSuites.java:55)
	at com.carrotsearch.randomizedtesting.rules.StatementAdapter.evaluate(StatementAdapter.java:36)
	at com.carrotsearch.randomizedtesting.ThreadLeakControl$StatementRunner.run(ThreadLeakControl.java:358)
	at java.lang.Thread.run(Thread.java:780)


REGRESSION:  org.apache.solr.handler.component.TermVectorComponentDistributedTest.testDistribSearch

Error Message:
.termVectors.0.test_basictv!=test_offtv (unordered or missing)

Stack Trace:
junit.framework.AssertionFailedError: .termVectors.0.test_basictv!=test_offtv (unordered or missing)
	at __randomizedtesting.SeedInfo.seed([83CA0A58087F9A3F:22C84407F20FA03]:0)
	at junit.framework.Assert.fail(Assert.java:50)
	at org.apache.solr.BaseDistributedSearchTestCase.compareSolrResponses(BaseDistributedSearchTestCase.java:816)
	at org.apache.solr.BaseDistributedSearchTestCase.compareResponses(BaseDistributedSearchTestCase.java:835)
	at org.apache.solr.BaseDistributedSearchTestCase.query(BaseDistributedSearchTestCase.java:538)
	at org.apache.solr.BaseDistributedSearchTestCase.query(BaseDistributedSearchTestCase.java:515)
	at org.apache.solr.handler.component.TermVectorComponentDistributedTest.doTest(TermVectorComponentDistributedTest.java:137)
	at org.apache.solr.BaseDistributedSearchTestCase.testDistribSearch(BaseDistributedSearchTestCase.java:849)
	at sun.reflect.NativeMethodAccessorImpl.invoke0(Native Method)
	at sun.reflect.NativeMethodAccessorImpl.invoke(NativeMethodAccessorImpl.java:88)
	at sun.reflect.DelegatingMethodAccessorImpl.invoke(DelegatingMethodAccessorImpl.java:55)
	at java.lang.reflect.Method.invoke(Method.java:613)
	at com.carrotsearch.randomizedtesting.RandomizedRunner.invoke(RandomizedRunner.java:1559)
	at com.carrotsearch.randomizedtesting.RandomizedRunner.access$600(RandomizedRunner.java:79)
	at com.carrotsearch.randomizedtesting.RandomizedRunner$6.evaluate(RandomizedRunner.java:737)
	at com.carrotsearch.randomizedtesting.RandomizedRunner$7.evaluate(RandomizedRunner.java:773)
	at com.carrotsearch.randomizedtesting.RandomizedRunner$8.evaluate(RandomizedRunner.java:787)
	at com.carrotsearch.randomizedtesting.rules.SystemPropertiesRestoreRule$1.evaluate(SystemPropertiesRestoreRule.java:53)
	at org.apache.lucene.util.TestRuleSetupTeardownChained$1.evaluate(TestRuleSetupTeardownChained.java:50)
	at org.apache.lucene.util.TestRuleFieldCacheSanity$1.evaluate(TestRuleFieldCacheSanity.java:51)
	at org.apache.lucene.util.AbstractBeforeAfterRule$1.evaluate(AbstractBeforeAfterRule.java:46)
	at com.carrotsearch.randomizedtesting.rules.SystemPropertiesInvariantRule$1.evaluate(SystemPropertiesInvariantRule.java:55)
	at org.apache.lucene.util.TestRuleThreadAndTestName$1.evaluate(TestRuleThreadAndTestName.java:49)
	at org.apache.lucene.util.TestRuleIgnoreAfterMaxFailures$1.evaluate(TestRuleIgnoreAfterMaxFailures.java:70)
	at org.apache.lucene.util.TestRuleMarkFailure$1.evaluate(TestRuleMarkFailure.java:48)
	at com.carrotsearch.randomizedtesting.rules.StatementAdapter.evaluate(StatementAdapter.java:36)
	at com.carrotsearch.randomizedtesting.ThreadLeakControl$StatementRunner.run(ThreadLeakControl.java:358)
	at com.carrotsearch.randomizedtesting.ThreadLeakControl.forkTimeoutingTask(ThreadLeakControl.java:782)
	at com.carrotsearch.randomizedtesting.ThreadLeakControl$3.evaluate(ThreadLeakControl.java:442)
	at com.carrotsearch.randomizedtesting.RandomizedRunner.runSingleTest(RandomizedRunner.java:746)
	at com.carrotsearch.randomizedtesting.RandomizedRunner$3.evaluate(RandomizedRunner.java:648)
	at com.carrotsearch.randomizedtesting.RandomizedRunner$4.evaluate(RandomizedRunner.java:682)
	at com.carrotsearch.randomizedtesting.RandomizedRunner$5.evaluate(RandomizedRunner.java:693)
	at com.carrotsearch.randomizedtesting.rules.StatementAdapter.evaluate(StatementAdapter.java:36)
	at com.carrotsearch.randomizedtesting.rules.SystemPropertiesRestoreRule$1.evaluate(SystemPropertiesRestoreRule.java:53)
	at org.apache.lucene.util.AbstractBeforeAfterRule$1.evaluate(AbstractBeforeAfterRule.java:46)
	at org.apache.lucene.util.TestRuleStoreClassName$1.evaluate(TestRuleStoreClassName.java:42)
	at com.carrotsearch.randomizedtesting.rules.SystemPropertiesInvariantRule$1.evaluate(SystemPropertiesInvariantRule.java:55)
	at com.carrotsearch.randomizedtesting.rules.NoShadowingOrOverridesOnMethodsRule$1.evaluate(NoShadowingOrOverridesOnMethodsRule.java:39)
	at com.carrotsearch.randomizedtesting.rules.NoShadowingOrOverridesOnMethodsRule$1.evaluate(NoShadowingOrOverridesOnMethodsRule.java:39)
	at com.carrotsearch.randomizedtesting.rules.StatementAdapter.evaluate(StatementAdapter.java:36)
	at org.apache.lucene.util.TestRuleAssertionsRequired$1.evaluate(TestRuleAssertionsRequired.java:43)
	at org.apache.lucene.util.TestRuleMarkFailure$1.evaluate(TestRuleMarkFailure.java:48)
	at org.apache.lucene.util.TestRuleIgnoreAfterMaxFailures$1.evaluate(TestRuleIgnoreAfterMaxFailures.java:70)
	at org.apache.lucene.util.TestRuleIgnoreTestSuites$1.evaluate(TestRuleIgnoreTestSuites.java:55)
	at com.carrotsearch.randomizedtesting.rules.StatementAdapter.evaluate(StatementAdapter.java:36)
	at com.carrotsearch.randomizedtesting.ThreadLeakControl$StatementRunner.run(ThreadLeakControl.java:358)
	at java.lang.Thread.run(Thread.java:780)


REGRESSION:  org.apache.solr.update.processor.SignatureUpdateProcessorFactoryTest.testMultiThreaded

Error Message:
expected:<1> but was:<2>

Stack Trace:
java.lang.AssertionError: expected:<1> but was:<2>
	at __randomizedtesting.SeedInfo.seed([83CA0A58087F9A3F:E25FD0B8E0AE90C9]:0)
	at org.junit.Assert.fail(Assert.java:93)
	at org.junit.Assert.failNotEquals(Assert.java:647)
	at org.junit.Assert.assertEquals(Assert.java:128)
	at org.junit.Assert.assertEquals(Assert.java:472)
	at org.junit.Assert.assertEquals(Assert.java:456)
	at org.apache.solr.update.processor.SignatureUpdateProcessorFactoryTest.checkNumDocs(SignatureUpdateProcessorFactoryTest.java:71)
	at org.apache.solr.update.processor.SignatureUpdateProcessorFactoryTest.testMultiThreaded(SignatureUpdateProcessorFactoryTest.java:222)
	at sun.reflect.NativeMethodAccessorImpl.invoke0(Native Method)
	at sun.reflect.NativeMethodAccessorImpl.invoke(NativeMethodAccessorImpl.java:88)
	at sun.reflect.DelegatingMethodAccessorImpl.invoke(DelegatingMethodAccessorImpl.java:55)
	at java.lang.reflect.Method.invoke(Method.java:613)
	at com.carrotsearch.randomizedtesting.RandomizedRunner.invoke(RandomizedRunner.java:1559)
	at com.carrotsearch.randomizedtesting.RandomizedRunner.access$600(RandomizedRunner.java:79)
	at com.carrotsearch.randomizedtesting.RandomizedRunner$6.evaluate(RandomizedRunner.java:737)
	at com.carrotsearch.randomizedtesting.RandomizedRunner$7.evaluate(RandomizedRunner.java:773)
	at com.carrotsearch.randomizedtesting.RandomizedRunner$8.evaluate(RandomizedRunner.java:787)
	at com.carrotsearch.randomizedtesting.rules.SystemPropertiesRestoreRule$1.evaluate(SystemPropertiesRestoreRule.java:53)
	at org.apache.lucene.util.TestRuleSetupTeardownChained$1.evaluate(TestRuleSetupTeardownChained.java:50)
	at org.apache.lucene.util.TestRuleFieldCacheSanity$1.evaluate(TestRuleFieldCacheSanity.java:51)
	at org.apache.lucene.util.AbstractBeforeAfterRule$1.evaluate(AbstractBeforeAfterRule.java:46)
	at com.carrotsearch.randomizedtesting.rules.SystemPropertiesInvariantRule$1.evaluate(SystemPropertiesInvariantRule.java:55)
	at org.apache.lucene.util.TestRuleThreadAndTestName$1.evaluate(TestRuleThreadAndTestName.java:49)
	at org.apache.lucene.util.TestRuleIgnoreAfterMaxFailures$1.evaluate(TestRuleIgnoreAfterMaxFailures.java:70)
	at org.apache.lucene.util.TestRuleMarkFailure$1.evaluate(TestRuleMarkFailure.java:48)
	at com.carrotsearch.randomizedtesting.rules.StatementAdapter.evaluate(StatementAdapter.java:36)
	at com.carrotsearch.randomizedtesting.ThreadLeakControl$StatementRunner.run(ThreadLeakControl.java:358)
	at com.carrotsearch.randomizedtesting.ThreadLeakControl.forkTimeoutingTask(ThreadLeakControl.java:782)
	at com.carrotsearch.randomizedtesting.ThreadLeakControl$3.evaluate(ThreadLeakControl.java:442)
	at com.carrotsearch.randomizedtesting.RandomizedRunner.runSingleTest(RandomizedRunner.java:746)
	at com.carrotsearch.randomizedtesting.RandomizedRunner$3.evaluate(RandomizedRunner.java:648)
	at com.carrotsearch.randomizedtesting.RandomizedRunner$4.evaluate(RandomizedRunner.java:682)
	at com.carrotsearch.randomizedtesting.RandomizedRunner$5.evaluate(RandomizedRunner.java:693)
	at com.carrotsearch.randomizedtesting.rules.StatementAdapter.evaluate(StatementAdapter.java:36)
	at com.carrotsearch.randomizedtesting.rules.SystemPropertiesRestoreRule$1.evaluate(SystemPropertiesRestoreRule.java:53)
	at org.apache.lucene.util.AbstractBeforeAfterRule$1.evaluate(AbstractBeforeAfterRule.java:46)
	at org.apache.lucene.util.TestRuleStoreClassName$1.evaluate(TestRuleStoreClassName.java:42)
	at com.carrotsearch.randomizedtesting.rules.SystemPropertiesInvariantRule$1.evaluate(SystemPropertiesInvariantRule.java:55)
	at com.carrotsearch.randomizedtesting.rules.NoShadowingOrOverridesOnMethodsRule$1.evaluate(NoShadowingOrOverridesOnMethodsRule.java:39)
	at com.carrotsearch.randomizedtesting.rules.NoShadowingOrOverridesOnMethodsRule$1.evaluate(NoShadowingOrOverridesOnMethodsRule.java:39)
	at com.carrotsearch.randomizedtesting.rules.StatementAdapter.evaluate(StatementAdapter.java:36)
	at org.apache.lucene.util.TestRuleAssertionsRequired$1.evaluate(TestRuleAssertionsRequired.java:43)
	at org.apache.lucene.util.TestRuleMarkFailure$1.evaluate(TestRuleMarkFailure.java:48)
	at org.apache.lucene.util.TestRuleIgnoreAfterMaxFailures$1.evaluate(TestRuleIgnoreAfterMaxFailures.java:70)
	at org.apache.lucene.util.TestRuleIgnoreTestSuites$1.evaluate(TestRuleIgnoreTestSuites.java:55)
	at com.carrotsearch.randomizedtesting.rules.StatementAdapter.evaluate(StatementAdapter.java:36)
	at com.carrotsearch.randomizedtesting.ThreadLeakControl$StatementRunner.run(ThreadLeakControl.java:358)
	at java.lang.Thread.run(Thread.java:780)


REGRESSION:  org.apache.solr.update.processor.SignatureUpdateProcessorFactoryTest.testDupeDetection

Error Message:
expected:<1> but was:<2>

Stack Trace:
java.lang.AssertionError: expected:<1> but was:<2>
	at __randomizedtesting.SeedInfo.seed([83CA0A58087F9A3F:D8FAF1900B383943]:0)
	at org.junit.Assert.fail(Assert.java:93)
	at org.junit.Assert.failNotEquals(Assert.java:647)
	at org.junit.Assert.assertEquals(Assert.java:128)
	at org.junit.Assert.assertEquals(Assert.java:472)
	at org.junit.Assert.assertEquals(Assert.java:456)
	at org.apache.solr.update.processor.SignatureUpdateProcessorFactoryTest.checkNumDocs(SignatureUpdateProcessorFactoryTest.java:71)
	at org.apache.solr.update.processor.SignatureUpdateProcessorFactoryTest.testDupeDetection(SignatureUpdateProcessorFactoryTest.java:119)
	at sun.reflect.NativeMethodAccessorImpl.invoke0(Native Method)
	at sun.reflect.NativeMethodAccessorImpl.invoke(NativeMethodAccessorImpl.java:88)
	at sun.reflect.DelegatingMethodAccessorImpl.invoke(DelegatingMethodAccessorImpl.java:55)
	at java.lang.reflect.Method.invoke(Method.java:613)
	at com.carrotsearch.randomizedtesting.RandomizedRunner.invoke(RandomizedRunner.java:1559)
	at com.carrotsearch.randomizedtesting.RandomizedRunner.access$600(RandomizedRunner.java:79)
	at com.carrotsearch.randomizedtesting.RandomizedRunner$6.evaluate(RandomizedRunner.java:737)
	at com.carrotsearch.randomizedtesting.RandomizedRunner$7.evaluate(RandomizedRunner.java:773)
	at com.carrotsearch.randomizedtesting.RandomizedRunner$8.evaluate(RandomizedRunner.java:787)
	at com.carrotsearch.randomizedtesting.rules.SystemPropertiesRestoreRule$1.evaluate(SystemPropertiesRestoreRule.java:53)
	at org.apache.lucene.util.TestRuleSetupTeardownChained$1.evaluate(TestRuleSetupTeardownChained.java:50)
	at org.apache.lucene.util.TestRuleFieldCacheSanity$1.evaluate(TestRuleFieldCacheSanity.java:51)
	at org.apache.lucene.util.AbstractBeforeAfterRule$1.evaluate(AbstractBeforeAfterRule.java:46)
	at com.carrotsearch.randomizedtesting.rules.SystemPropertiesInvariantRule$1.evaluate(SystemPropertiesInvariantRule.java:55)
	at org.apache.lucene.util.TestRuleThreadAndTestName$1.evaluate(TestRuleThreadAndTestName.java:49)
	at org.apache.lucene.util.TestRuleIgnoreAfterMaxFailures$1.evaluate(TestRuleIgnoreAfterMaxFailures.java:70)
	at org.apache.lucene.util.TestRuleMarkFailure$1.evaluate(TestRuleMarkFailure.java:48)
	at com.carrotsearch.randomizedtesting.rules.StatementAdapter.evaluate(StatementAdapter.java:36)
	at com.carrotsearch.randomizedtesting.ThreadLeakControl$StatementRunner.run(ThreadLeakControl.java:358)
	at com.carrotsearch.randomizedtesting.ThreadLeakControl.forkTimeoutingTask(ThreadLeakControl.java:782)
	at com.carrotsearch.randomizedtesting.ThreadLeakControl$3.evaluate(ThreadLeakControl.java:442)
	at com.carrotsearch.randomizedtesting.RandomizedRunner.runSingleTest(RandomizedRunner.java:746)
	at com.carrotsearch.randomizedtesting.RandomizedRunner$3.evaluate(RandomizedRunner.java:648)
	at com.carrotsearch.randomizedtesting.RandomizedRunner$4.evaluate(RandomizedRunner.java:682)
	at com.carrotsearch.randomizedtesting.RandomizedRunner$5.evaluate(RandomizedRunner.java:693)
	at com.carrotsearch.randomizedtesting.rules.StatementAdapter.evaluate(StatementAdapter.java:36)
	at com.carrotsearch.randomizedtesting.rules.SystemPropertiesRestoreRule$1.evaluate(SystemPropertiesRestoreRule.java:53)
	at org.apache.lucene.util.AbstractBeforeAfterRule$1.evaluate(AbstractBeforeAfterRule.java:46)
	at org.apache.lucene.util.TestRuleStoreClassName$1.evaluate(TestRuleStoreClassName.java:42)
	at com.carrotsearch.randomizedtesting.rules.SystemPropertiesInvariantRule$1.evaluate(SystemPropertiesInvariantRule.java:55)
	at com.carrotsearch.randomizedtesting.rules.NoShadowingOrOverridesOnMethodsRule$1.evaluate(NoShadowingOrOverridesOnMethodsRule.java:39)
	at com.carrotsearch.randomizedtesting.rules.NoShadowingOrOverridesOnMethodsRule$1.evaluate(NoShadowingOrOverridesOnMethodsRule.java:39)
	at com.carrotsearch.randomizedtesting.rules.StatementAdapter.evaluate(StatementAdapter.java:36)
	at org.apache.lucene.util.TestRuleAssertionsRequired$1.evaluate(TestRuleAssertionsRequired.java:43)
	at org.apache.lucene.util.TestRuleMarkFailure$1.evaluate(TestRuleMarkFailure.java:48)
	at org.apache.lucene.util.TestRuleIgnoreAfterMaxFailures$1.evaluate(TestRuleIgnoreAfterMaxFailures.java:70)
	at org.apache.lucene.util.TestRuleIgnoreTestSuites$1.evaluate(TestRuleIgnoreTestSuites.java:55)
	at com.carrotsearch.randomizedtesting.rules.StatementAdapter.evaluate(StatementAdapter.java:36)
	at com.carrotsearch.randomizedtesting.ThreadLeakControl$StatementRunner.run(ThreadLeakControl.java:358)
	at java.lang.Thread.run(Thread.java:780)




Build Log:
[...truncated 10034 lines...]
   [junit4] Suite: org.apache.solr.handler.component.TermVectorComponentDistributedTest
   [junit4]   2> 32537 T76 oas.BaseDistributedSearchTestCase.initHostContext Setting hostContext system property: /lg_e/gm
   [junit4]   2> 32546 T76 oas.SolrTestCaseJ4.setUp ###Starting testDistribSearch
   [junit4]   2> 32630 T76 oejs.Server.doStart jetty-8.1.10.v20130312
   [junit4]   2> 32720 T76 oejs.AbstractConnector.doStart Started SelectChannelConnector@127.0.0.1:34067
   [junit4]   2> 33070 T76 oass.SolrDispatchFilter.init SolrDispatchFilter.init()
   [junit4]   2> 33070 T76 oasc.SolrResourceLoader.locateSolrHome JNDI not configured for solr (NoInitialContextEx)
   [junit4]   2> 33071 T76 oasc.SolrResourceLoader.locateSolrHome using system property solr.solr.home: /mnt/ssd/jenkins/workspace/Lucene-Solr-trunk-Linux/solr/build/solr-core/test-files/solr
   [junit4]   2> 33072 T76 oasc.SolrResourceLoader.<init> new SolrResourceLoader for directory: '/mnt/ssd/jenkins/workspace/Lucene-Solr-trunk-Linux/solr/build/solr-core/test-files/solr/'
   [junit4]   2> 33080 T76 oasc.ConfigSolr.fromFile Loading container configuration from /mnt/ssd/jenkins/workspace/Lucene-Solr-trunk-Linux/solr/build/solr-core/test-files/solr/solr.xml
   [junit4]   2> 33114 T76 oasc.CoreContainer.<init> New CoreContainer 241540889
   [junit4]   2> 33115 T76 oasc.CoreContainer.load Loading cores into CoreContainer [instanceDir=/mnt/ssd/jenkins/workspace/Lucene-Solr-trunk-Linux/solr/build/solr-core/test-files/solr/]
   [junit4]   2> 33121 T76 oashc.HttpShardHandlerFactory.getParameter Setting socketTimeout to: 90000
   [junit4]   2> 33122 T76 oashc.HttpShardHandlerFactory.getParameter Setting urlScheme to: http://
   [junit4]   2> 33122 T76 oashc.HttpShardHandlerFactory.getParameter Setting connTimeout to: 15000
   [junit4]   2> 33123 T76 oashc.HttpShardHandlerFactory.getParameter Setting maxConnectionsPerHost to: 20
   [junit4]   2> 33124 T76 oashc.HttpShardHandlerFactory.getParameter Setting corePoolSize to: 0
   [junit4]   2> 33124 T76 oashc.HttpShardHandlerFactory.getParameter Setting maximumPoolSize to: 2147483647
   [junit4]   2> 33125 T76 oashc.HttpShardHandlerFactory.getParameter Setting maxThreadIdleTime to: 5
   [junit4]   2> 33126 T76 oashc.HttpShardHandlerFactory.getParameter Setting sizeOfQueue to: -1
   [junit4]   2> 33126 T76 oashc.HttpShardHandlerFactory.getParameter Setting fairnessPolicy to: false
   [junit4]   2> 33141 T76 oasl.LogWatcher.createWatcher SLF4J impl is org.slf4j.impl.Log4jLoggerFactory
   [junit4]   2> 33142 T76 oasl.LogWatcher.newRegisteredLogWatcher Registering Log Listener [Log4j (org.slf4j.impl.Log4jLoggerFactory)]
   [junit4]   2> 33143 T76 oasc.CoreContainer.load Host Name: 127.0.0.1
   [junit4]   2> 33146 T88 oasc.CoreContainer.create Creating SolrCore 'collection1' using instanceDir: /mnt/ssd/jenkins/workspace/Lucene-Solr-trunk-Linux/solr/build/solr-core/test-files/solr/collection1
   [junit4]   2> 33147 T88 oasc.SolrResourceLoader.<init> new SolrResourceLoader for directory: '/mnt/ssd/jenkins/workspace/Lucene-Solr-trunk-Linux/solr/build/solr-core/test-files/solr/collection1/'
   [junit4]   2> 33147 T88 oasc.SolrResourceLoader.replaceClassLoader Adding 'file:/mnt/ssd/jenkins/workspace/Lucene-Solr-trunk-Linux/solr/build/solr-core/test-files/solr/collection1/lib/classes/' to classloader
   [junit4]   2> 33148 T88 oasc.SolrResourceLoader.replaceClassLoader Adding 'file:/mnt/ssd/jenkins/workspace/Lucene-Solr-trunk-Linux/solr/build/solr-core/test-files/solr/collection1/lib/README' to classloader
   [junit4]   2> 33191 T88 oasc.SolrConfig.<init> Using Lucene MatchVersion: LUCENE_50
   [junit4]   2> 33239 T88 oasc.SolrConfig.<init> Loaded SolrConfig: solrconfig.xml
   [junit4]   2> 33240 T88 oass.IndexSchema.readSchema Reading Solr Schema from schema.xml
   [junit4]   2> 33247 T88 oass.IndexSchema.readSchema [collection1] Schema name=test
   [junit4]   2> 33589 T88 oass.OpenExchangeRatesOrgProvider.init Initialized with rates=open-exchange-rates.json, refreshInterval=1440.
   [junit4]   2> 33596 T88 oass.IndexSchema.readSchema default search field in schema is text
   [junit4]   2> 33598 T88 oass.IndexSchema.readSchema unique key field: id
   [junit4]   2> 33612 T88 oass.FileExchangeRateProvider.reload Reloading exchange rates from file currency.xml
   [junit4]   2> 33618 T88 oass.FileExchangeRateProvider.reload Reloading exchange rates from file currency.xml
   [junit4]   2> 33624 T88 oass.OpenExchangeRatesOrgProvider.reload Reloading exchange rates from open-exchange-rates.json
   [junit4]   2> 33625 T88 oass.OpenExchangeRatesOrgProvider$OpenExchangeRates.<init> WARN Unknown key IMPORTANT NOTE
   [junit4]   2> 33625 T88 oass.OpenExchangeRatesOrgProvider$OpenExchangeRates.<init> WARN Expected key, got STRING
   [junit4]   2> 33626 T88 oass.OpenExchangeRatesOrgProvider.reload Reloading exchange rates from open-exchange-rates.json
   [junit4]   2> 33627 T88 oass.OpenExchangeRatesOrgProvider$OpenExchangeRates.<init> WARN Unknown key IMPORTANT NOTE
   [junit4]   2> 33627 T88 oass.OpenExchangeRatesOrgProvider$OpenExchangeRates.<init> WARN Expected key, got STRING
   [junit4]   2> 33627 T88 oasc.SolrCore.initDirectoryFactory org.apache.solr.core.MockDirectoryFactory
   [junit4]   2> 33628 T88 oasc.SolrCore.<init> [collection1] Opening new SolrCore at /mnt/ssd/jenkins/workspace/Lucene-Solr-trunk-Linux/solr/build/solr-core/test-files/solr/collection1/, dataDir=./org.apache.solr.handler.component.TermVectorComponentDistributedTest-1386645428285/control/data/
   [junit4]   2> 33628 T88 oasc.JmxMonitoredMap.<init> No JMX servers found, not exposing Solr information with JMX.
   [junit4]   2> 33631 T88 oasc.CachingDirectoryFactory.get return new directory for ./org.apache.solr.handler.component.TermVectorComponentDistributedTest-1386645428285/control/data
   [junit4]   2> 33632 T88 oasc.SolrCore.getNewIndexDir New index directory detected: old=null new=./org.apache.solr.handler.component.TermVectorComponentDistributedTest-1386645428285/control/data/index/
   [junit4]   2> 33632 T88 oasc.SolrCore.initIndex WARN [collection1] Solr index directory './org.apache.solr.handler.component.TermVectorComponentDistributedTest-1386645428285/control/data/index' doesn't exist. Creating new index...
   [junit4]   2> 33633 T88 oasc.CachingDirectoryFactory.get return new directory for ./org.apache.solr.handler.component.TermVectorComponentDistributedTest-1386645428285/control/data/index
   [junit4]   2> 33634 T88 oasu.RandomMergePolicy.<init> RandomMergePolicy wrapping class org.apache.lucene.index.TieredMergePolicy: [TieredMergePolicy: maxMergeAtOnce=47, maxMergeAtOnceExplicit=44, maxMergedSegmentMB=85.6953125, floorSegmentMB=1.6513671875, forceMergeDeletesPctAllowed=18.7708209959809, segmentsPerTier=32.0, maxCFSSegmentSizeMB=8.796093022207999E12, noCFSRatio=0.23579184463505654
   [junit4]   2> 33636 T88 oasc.SolrDeletionPolicy.onCommit SolrDeletionPolicy.onCommit: commits: num=1
   [junit4]   2> 		commit{dir=RateLimitedDirectoryWrapper(MockDirectoryWrapper(org.apache.lucene.store.RAMDirectory@50a52948 lockFactory=org.apache.lucene.store.SingleInstanceLockFactory@fff5b82b)),segFN=segments_1,generation=1}
   [junit4]   2> 33637 T88 oasc.SolrDeletionPolicy.updateCommits newest commit generation = 1
   [junit4]   2> 33641 T88 oasc.SolrCore.initWriters created xml: solr.XMLResponseWriter
   [junit4]   2> 33660 T88 oasup.UpdateRequestProcessorChain.init creating updateRequestProcessorChain "dedupe"
   [junit4]   2> 33661 T88 oasup.UpdateRequestProcessorChain.init inserting DistributedUpdateProcessorFactory into updateRequestProcessorChain "dedupe"
   [junit4]   2> 33662 T88 oasup.UpdateRequestProcessorChain.init creating updateRequestProcessorChain "dedupe-allfields"
   [junit4]   2> 33662 T88 oasup.UpdateRequestProcessorChain.init inserting DistributedUpdateProcessorFactory into updateRequestProcessorChain "dedupe-allfields"
   [junit4]   2> 33663 T88 oasup.UpdateRequestProcessorChain.init creating updateRequestProcessorChain "stored_sig"
   [junit4]   2> 33664 T88 oasup.UpdateRequestProcessorChain.init inserting DistributedUpdateProcessorFactory into updateRequestProcessorChain "stored_sig"
   [junit4]   2> 33664 T88 oasup.UpdateRequestProcessorChain.init creating updateRequestProcessorChain "uniq-fields"
   [junit4]   2> 33667 T88 oasup.UpdateRequestProcessorChain.init inserting DistributedUpdateProcessorFactory into updateRequestProcessorChain "uniq-fields"
   [junit4]   2> 33668 T88 oasup.UpdateRequestProcessorChain.init creating updateRequestProcessorChain "distrib-dup-test-chain-explicit"
   [junit4]   2> 33669 T88 oasup.UpdateRequestProcessorChain.init creating updateRequestProcessorChain "distrib-dup-test-chain-implicit"
   [junit4]   2> 33669 T88 oasup.UpdateRequestProcessorChain.init inserting DistributedUpdateProcessorFactory into updateRequestProcessorChain "distrib-dup-test-chain-implicit"
   [junit4]   2> 33670 T88 oasc.SolrCore.loadUpdateProcessorChains no updateRequestProcessorChain defined as default, creating implicit default
   [junit4]   2> 33670 T88 oasc.RequestHandlers.initHandlersFromConfig adding lazy requestHandler: solr.ReplicationHandler
   [junit4]   2> 33671 T88 oasc.RequestHandlers.initHandlersFromConfig created /replication: solr.ReplicationHandler
   [junit4]   2> 33672 T88 oasc.RequestHandlers.initHandlersFromConfig created standard: solr.StandardRequestHandler
   [junit4]   2> 33672 T88 oasc.RequestHandlers.initHandlersFromConfig created /get: solr.RealTimeGetHandler
   [junit4]   2> 33679 T88 oasc.RequestHandlers.initHandlersFromConfig created dismax: solr.SearchHandler
   [junit4]   2> 33681 T88 oasc.RequestHandlers.initHandlersFromConfig created mock: org.apache.solr.core.MockQuerySenderListenerReqHandler
   [junit4]   2> 33681 T88 oasc.RequestHandlers.initHandlersFromConfig created /admin/: org.apache.solr.handler.admin.AdminHandlers
   [junit4]   2> 33682 T88 oasc.RequestHandlers.initHandlersFromConfig created /admin/file: solr.admin.ShowFileRequestHandler
   [junit4]   2> 33683 T88 oasc.RequestHandlers.initHandlersFromConfig created /admin/fileedit: solr.admin.EditFileRequestHandler
   [junit4]   2> 33683 T88 oasc.RequestHandlers.initHandlersFromConfig created defaults: solr.StandardRequestHandler
   [junit4]   2> 33684 T88 oasc.RequestHandlers.initHandlersFromConfig adding lazy requestHandler: solr.StandardRequestHandler
   [junit4]   2> 33684 T88 oasc.RequestHandlers.initHandlersFromConfig created lazy: solr.StandardRequestHandler
   [junit4]   2> 33685 T88 oasc.RequestHandlers.initHandlersFromConfig created /update: solr.UpdateRequestHandler
   [junit4]   2> 33686 T88 oasc.RequestHandlers.initHandlersFromConfig created /terms: org.apache.solr.handler.component.SearchHandler
   [junit4]   2> 33686 T88 oasc.RequestHandlers.initHandlersFromConfig created spellCheckCompRH: org.apache.solr.handler.component.SearchHandler
   [junit4]   2> 33687 T88 oasc.RequestHandlers.initHandlersFromConfig created spellCheckCompRH_Direct: org.apache.solr.handler.component.SearchHandler
   [junit4]   2> 33688 T88 oasc.RequestHandlers.initHandlersFromConfig created spellCheckWithWordbreak: org.apache.solr.handler.component.SearchHandler
   [junit4]   2> 33688 T88 oasc.RequestHandlers.initHandlersFromConfig created spellCheckWithWordbreak_Direct: org.apache.solr.handler.component.SearchHandler
   [junit4]   2> 33689 T88 oasc.RequestHandlers.initHandlersFromConfig created spellCheckCompRH1: org.apache.solr.handler.component.SearchHandler
   [junit4]   2> 33690 T88 oasc.RequestHandlers.initHandlersFromConfig created mltrh: org.apache.solr.handler.component.SearchHandler
   [junit4]   2> 33690 T88 oasc.RequestHandlers.initHandlersFromConfig created tvrh: org.apache.solr.handler.component.SearchHandler
   [junit4]   2> 33694 T88 oasc.RequestHandlers.initHandlersFromConfig created /mlt: solr.MoreLikeThisHandler
   [junit4]   2> 33698 T88 oasc.RequestHandlers.initHandlersFromConfig created /debug/dump: solr.DumpRequestHandler
   [junit4]   2> 33700 T88 oashl.XMLLoader.init xsltCacheLifetimeSeconds=60
   [junit4]   2> 33702 T88 oasc.SolrCore.initDeprecatedSupport WARN solrconfig.xml uses deprecated <admin/gettableFiles>, Please update your config to use the ShowFileRequestHandler.
   [junit4]   2> 33706 T88 oasu.CommitTracker.<init> Hard AutoCommit: disabled
   [junit4]   2> 33707 T88 oasu.CommitTracker.<init> Soft AutoCommit: disabled
   [junit4]   2> 33708 T88 oasu.RandomMergePolicy.<init> RandomMergePolicy wrapping class org.apache.lucene.index.MockRandomMergePolicy: org.apache.lucene.index.MockRandomMergePolicy@cfc97f43
   [junit4]   2> 33709 T88 oasc.SolrDeletionPolicy.onInit SolrDeletionPolicy.onInit: commits: num=1
   [junit4]   2> 		commit{dir=RateLimitedDirectoryWrapper(MockDirectoryWrapper(org.apache.lucene.store.RAMDirectory@50a52948 lockFactory=org.apache.lucene.store.SingleInstanceLockFactory@fff5b82b)),segFN=segments_1,generation=1}
   [junit4]   2> 33709 T88 oasc.SolrDeletionPolicy.updateCommits newest commit generation = 1
   [junit4]   2> 33710 T88 oass.SolrIndexSearcher.<init> Opening Searcher@4f43594d main
   [junit4]   2> 33712 T88 oashc.SpellCheckComponent.inform Initializing spell checkers
   [junit4]   2> 33832 T88 oass.DirectSolrSpellChecker.init init: {name=direct,classname=DirectSolrSpellChecker,field=lowerfilt,minQueryLength=3}
   [junit4]   2> 34034 T89 oasc.SolrCore.registerSearcher [collection1] Registered new searcher Searcher@4f43594d main{StandardDirectoryReader(segments_1:1:nrt)}
   [junit4]   2> 34034 T88 oasc.CoreContainer.registerCore registering core: collection1
   [junit4]   2> 34036 T76 oass.SolrDispatchFilter.init user.dir=/mnt/ssd/jenkins/workspace/Lucene-Solr-trunk-Linux/solr/build/solr-core/test/J1
   [junit4]   2> 34037 T76 oass.SolrDispatchFilter.init SolrDispatchFilter.init() done
   [junit4]   2> 34052 T76 oejs.Server.doStart jetty-8.1.10.v20130312
   [junit4]   2> 34061 T76 oejs.AbstractConnector.doStart Started SelectChannelConnector@127.0.0.1:60338
   [junit4]   2> 34063 T76 oass.SolrDispatchFilter.init SolrDispatchFilter.init()
   [junit4]   2> 34065 T76 oasc.SolrResourceLoader.locateSolrHome JNDI not configured for solr (NoInitialContextEx)
   [junit4]   2> 34067 T76 oasc.SolrResourceLoader.locateSolrHome using system property solr.solr.home: /mnt/ssd/jenkins/workspace/Lucene-Solr-trunk-Linux/solr/build/solr-core/test-files/solr
   [junit4]   2> 34069 T76 oasc.SolrResourceLoader.<init> new SolrResourceLoader for directory: '/mnt/ssd/jenkins/workspace/Lucene-Solr-trunk-Linux/solr/build/solr-core/test-files/solr/'
   [junit4]   2> 34095 T76 oasc.ConfigSolr.fromFile Loading container configuration from /mnt/ssd/jenkins/workspace/Lucene-Solr-trunk-Linux/solr/build/solr-core/test-files/solr/solr.xml
   [junit4]   2> 34178 T76 oasc.CoreContainer.<init> New CoreContainer 1278379619
   [junit4]   2> 34179 T76 oasc.CoreContainer.load Loading cores into CoreContainer [instanceDir=/mnt/ssd/jenkins/workspace/Lucene-Solr-trunk-Linux/solr/build/solr-core/test-files/solr/]
   [junit4]   2> 34182 T76 oashc.HttpShardHandlerFactory.getParameter Setting socketTimeout to: 90000
   [junit4]   2> 34183 T76 oashc.HttpShardHandlerFactory.getParameter Setting urlScheme to: http://
   [junit4]   2> 34185 T76 oashc.HttpShardHandlerFactory.getParameter Setting connTimeout to: 15000
   [junit4]   2> 34187 T76 oashc.HttpShardHandlerFactory.getParameter Setting maxConnectionsPerHost to: 20
   [junit4]   2> 34189 T76 oashc.HttpShardHandlerFactory.getParameter Setting corePoolSize to: 0
   [junit4]   2> 34191 T76 oashc.HttpShardHandlerFactory.getParameter Setting maximumPoolSize to: 2147483647
   [junit4]   2> 34192 T76 oashc.HttpShardHandlerFactory.getParameter Setting maxThreadIdleTime to: 5
   [junit4]   2> 34193 T76 oashc.HttpShardHandlerFactory.getParameter Setting sizeOfQueue to: -1
   [junit4]   2> 34193 T76 oashc.HttpShardHandlerFactory.getParameter Setting fairnessPolicy to: false
   [junit4]   2> 34214 T76 oasl.LogWatcher.createWatcher SLF4J impl is org.slf4j.impl.Log4jLoggerFactory
   [junit4]   2> 34215 T76 oasl.LogWatcher.newRegisteredLogWatcher Registering Log Listener [Log4j (org.slf4j.impl.Log4jLoggerFactory)]
   [junit4]   2> 34217 T76 oasc.CoreContainer.load Host Name: 127.0.0.1
   [junit4]   2> 34233 T100 oasc.CoreContainer.create Creating SolrCore 'collection1' using instanceDir: /mnt/ssd/jenkins/workspace/Lucene-Solr-trunk-Linux/solr/build/solr-core/test-files/solr/collection1
   [junit4]   2> 34234 T100 oasc.SolrResourceLoader.<init> new SolrResourceLoader for directory: '/mnt/ssd/jenkins/workspace/Lucene-Solr-trunk-Linux/solr/build/solr-core/test-files/solr/collection1/'
   [junit4]   2> 34235 T100 oasc.SolrResourceLoader.replaceClassLoader Adding 'file:/mnt/ssd/jenkins/workspace/Lucene-Solr-trunk-Linux/solr/build/solr-core/test-files/solr/collection1/lib/classes/' to classloader
   [junit4]   2> 34235 T100 oasc.SolrResourceLoader.replaceClassLoader Adding 'file:/mnt/ssd/jenkins/workspace/Lucene-Solr-trunk-Linux/solr/build/solr-core/test-files/solr/collection1/lib/README' to classloader
   [junit4]   2> 34316 T100 oasc.SolrConfig.<init> Using Lucene MatchVersion: LUCENE_50
   [junit4]   2> 34473 T100 oasc.SolrConfig.<init> Loaded SolrConfig: solrconfig.xml
   [junit4]   2> 34474 T100 oass.IndexSchema.readSchema Reading Solr Schema from schema.xml
   [junit4]   2> 34492 T100 oass.IndexSchema.readSchema [collection1] Schema name=test
   [junit4]   2> 35064 T100 oass.OpenExchangeRatesOrgProvider.init Initialized with rates=open-exchange-rates.json, refreshInterval=1440.
   [junit4]   2> 35073 T100 oass.IndexSchema.readSchema default search field in schema is text
   [junit4]   2> 35078 T100 oass.IndexSchema.readSchema unique key field: id
   [junit4]   2> 35091 T100 oass.FileExchangeRateProvider.reload Reloading exchange rates from file currency.xml
   [junit4]   2> 35097 T100 oass.FileExchangeRateProvider.reload Reloading exchange rates from file currency.xml
   [junit4]   2> 35103 T100 oass.OpenExchangeRatesOrgProvider.reload Reloading exchange rates from open-exchange-rates.json
   [junit4]   2> 35104 T100 oass.OpenExchangeRatesOrgProvider$OpenExchangeRates.<init> WARN Unknown key IMPORTANT NOTE
   [junit4]   2> 35104 T100 oass.OpenExchangeRatesOrgProvider$OpenExchangeRates.<init> WARN Expected key, got STRING
   [junit4]   2> 35105 T100 oass.OpenExchangeRatesOrgProvider.reload Reloading exchange rates from open-exchange-rates.json
   [junit4]   2> 35106 T100 oass.OpenExchangeRatesOrgProvider$OpenExchangeRates.<init> WARN Unknown key IMPORTANT NOTE
   [junit4]   2> 35106 T100 oass.OpenExchangeRatesOrgProvider$OpenExchangeRates.<init> WARN Expected key, got STRING
   [junit4]   2> 35107 T100 oasc.SolrCore.initDirectoryFactory org.apache.solr.core.MockDirectoryFactory
   [junit4]   2> 35108 T100 oasc.SolrCore.<init> [collection1] Opening new SolrCore at /mnt/ssd/jenkins/workspace/Lucene-Solr-trunk-Linux/solr/build/solr-core/test-files/solr/collection1/, dataDir=./org.apache.solr.handler.component.TermVectorComponentDistributedTest-1386645428285/shard0/data/
   [junit4]   2> 35108 T100 oasc.JmxMonitoredMap.<init> No JMX servers found, not exposing Solr information with JMX.
   [junit4]   2> 35109 T100 oasc.CachingDirectoryFactory.get return new directory for ./org.apache.solr.handler.component.TermVectorComponentDistributedTest-1386645428285/shard0/data
   [junit4]   2> 35110 T100 oasc.SolrCore.getNewIndexDir New index directory detected: old=null new=./org.apache.solr.handler.component.TermVectorComponentDistributedTest-1386645428285/shard0/data/index/
   [junit4]   2> 35110 T100 oasc.SolrCore.initIndex WARN [collection1] Solr index directory './org.apache.solr.handler.component.TermVectorComponentDistributedTest-1386645428285/shard0/data/index' doesn't exist. Creating new index...
   [junit4]   2> 35111 T100 oasc.CachingDirectoryFactory.get return new directory for ./org.apache.solr.handler.component.TermVectorComponentDistributedTest-1386645428285/shard0/data/index
   [junit4]   2> 35112 T100 oasu.RandomMergePolicy.<init> RandomMergePolicy wrapping class org.apache.lucene.index.TieredMergePolicy: [TieredMergePolicy: maxMergeAtOnce=47, maxMergeAtOnceExplicit=44, maxMergedSegmentMB=85.6953125, floorSegmentMB=1.6513671875, forceMergeDeletesPctAllowed=18.7708209959809, segmentsPerTier=32.0, maxCFSSegmentSizeMB=8.796093022207999E12, noCFSRatio=0.23579184463505654
   [junit4]   2> 35113 T100 oasc.SolrDeletionPolicy.onCommit SolrDeletionPolicy.onCommit: commits: num=1
   [junit4]   2> 		commit{dir=RateLimitedDirectoryWrapper(MockDirectoryWrapper(org.apache.lucene.store.RAMDirectory@8df13995 lockFactory=org.apache.lucene.store.SingleInstanceLockFactory@3d2a2f83)),segFN=segments_1,generation=1}
   [junit4]   2> 35114 T100 oasc.SolrDeletionPolicy.updateCommits newest commit generation = 1
   [junit4]   2> 35115 T100 oasc.SolrCore.initWriters created xml: solr.XMLResponseWriter
   [junit4]   2> 35116 T100 oasup.UpdateRequestProcessorChain.init creating updateRequestProcessorChain "dedupe"
   [junit4]   2> 35117 T100 oasup.UpdateRequestProcessorChain.init inserting DistributedUpdateProcessorFactory into updateRequestProcessorChain "dedupe"
   [junit4]   2> 35118 T100 oasup.UpdateRequestProcessorChain.init creating updateRequestProcessorChain "dedupe-allfields"
   [junit4]   2> 35118 T100 oasup.UpdateRequestProcessorChain.init inserting DistributedUpdateProcessorFactory into updateRequestProcessorChain "dedupe-allfields"
   [junit4]   2> 35119 T100 oasup.UpdateRequestProcessorChain.init creating updateRequestProcessorChain "stored_sig"
   [junit4]   2> 35119 T100 oasup.UpdateRequestProcessorChain.init inserting DistributedUpdateProcessorFactory into updateRequestProcessorChain "stored_sig"
   [junit4]   2> 35120 T100 oasup.UpdateRequestProcessorChain.init creating updateRequestProcessorChain "uniq-fields"
   [junit4]   2> 35121 T100 oasup.UpdateRequestProcessorChain.init inserting DistributedUpdateProcessorFactory into updateRequestProcessorChain "uniq-fields"
   [junit4]   2> 35121 T100 oasup.UpdateRequestProcessorChain.init creating updateRequestProcessorChain "distrib-dup-test-chain-explicit"
   [junit4]   2> 35122 T100 oasup.UpdateRequestProcessorChain.init creating updateRequestProcessorChain "distrib-dup-test-chain-implicit"
   [junit4]   2> 35123 T100 oasup.UpdateRequestProcessorChain.init inserting DistributedUpdateProcessorFactory into updateRequestProcessorChain "distrib-dup-test-chain-implicit"
   [junit4]   2> 35123 T100 oasc.SolrCore.loadUpdateProcessorChains no updateRequestProcessorChain defined as default, creating implicit default
   [junit4]   2> 35124 T100 oasc.RequestHandlers.initHandlersFromConfig adding lazy requestHandler: solr.ReplicationHandler
   [junit4]   2> 35124 T100 oasc.RequestHandlers.initHandlersFromConfig created /replication: solr.ReplicationHandler
   [junit4]   2> 35125 T100 oasc.RequestHandlers.initHandlersFromConfig created standard: solr.StandardRequestHandler
   [junit4]   2> 35125 T100 oasc.RequestHandlers.initHandlersFromConfig created /get: solr.RealTimeGetHandler
   [junit4]   2> 35126 T100 oasc.RequestHandlers.initHandlersFromConfig created dismax: solr.SearchHandler
   [junit4]   2> 35127 T100 oasc.RequestHandlers.initHandlersFromConfig created mock: org.apache.solr.core.MockQuerySenderListenerReqHandler
   [junit4]   2> 35127 T100 oasc.RequestHandlers.initHandlersFromConfig created /admin/: org.apache.solr.handler.admin.AdminHandlers
   [junit4]   2> 35128 T100 oasc.RequestHandlers.initHandlersFromConfig created /admin/file: solr.admin.ShowFileRequestHandler
   [junit4]   2> 35128 T100 oasc.RequestHandlers.initHandlersFromConfig created /admin/fileedit: solr.admin.EditFileRequestHandler
   [junit4]   2> 35129 T100 oasc.RequestHandlers.initHandlersFromConfig created defaults: solr.StandardRequestHandler
   [junit4]   2> 35129 T100 oasc.RequestHandlers.initHandlersFromConfig adding lazy requestHandler: solr.StandardRequestHandler
   [junit4]   2> 35130 T100 oasc.RequestHandlers.initHandlersFromConfig created lazy: solr.StandardRequestHandler
   [junit4]   2> 35130 T100 oasc.RequestHandlers.initHandlersFromConfig created /update: solr.UpdateRequestHandler
   [junit4]   2> 35131 T100 oasc.RequestHandlers.initHandlersFromConfig created /terms: org.apache.solr.handler.component.SearchHandler
   [junit4]   2> 35131 T100 oasc.RequestHandlers.initHandlersFromConfig created spellCheckCompRH: org.apache.solr.handler.component.SearchHandler
   [junit4]   2> 35132 T100 oasc.RequestHandlers.initHandlersFromConfig created spellCheckCompRH_Direct: org.apache.solr.handler.component.SearchHandler
   [junit4]   2> 35133 T100 oasc.RequestHandlers.initHandlersFromConfig created spellCheckWithWordbreak: org.apache.solr.handler.component.SearchHandler
   [junit4]   2> 35133 T100 oasc.RequestHandlers.initHandlersFromConfig created spellCheckWithWordbreak_Direct: org.apache.solr.handler.component.SearchHandler
   [junit4]   2> 35134 T100 oasc.RequestHandlers.initHandlersFromConfig created spellCheckCompRH1: org.apache.solr.handler.component.SearchHandler
   [junit4]   2> 35134 T100 oasc.RequestHandlers.initHandlersFromConfig created mltrh: org.apache.solr.handler.component.SearchHandler
   [junit4]   2> 35135 T100 oasc.RequestHandlers.initHandlersFromConfig created tvrh: org.apache.solr.handler.component.SearchHandler
   [junit4]   2> 35136 T100 oasc.RequestHandlers.initHandlersFromConfig created /mlt: solr.MoreLikeThisHandler
   [junit4]   2> 35136 T100 oasc.RequestHandlers.initHandlersFromConfig created /debug/dump: solr.DumpRequestHandler
   [junit4]   2> 35138 T100 oashl.XMLLoader.init xsltCacheLifetimeSeconds=60
   [junit4]   2> 35141 T100 oasc.SolrCore.initDeprecatedSupport WARN solrconfig.xml uses deprecated <admin/gettableFiles>, Please update your config to use the ShowFileRequestHandler.
   [junit4]   2> 35144 T100 oasu.CommitTracker.<init> Hard AutoCommit: disabled
   [junit4]   2> 35145 T100 oasu.CommitTracker.<init> Soft AutoCommit: disabled
   [junit4]   2> 35145 T100 oasu.RandomMergePolicy.<init> RandomMergePolicy wrapping class org.apache.lucene.index.MockRandomMergePolicy: org.apache.lucene.index.MockRandomMergePolicy@b19abd52
   [junit4]   2> 35146 T100 oasc.SolrDeletionPolicy.onInit SolrDeletionPolicy.onInit: commits: num=1
   [junit4]   2> 		commit{dir=RateLimitedDirectoryWrapper(MockDirectoryWrapper(org.apache.lucene.store.RAMDirectory@8df13995 lockFactory=org.apache.lucene.store.SingleInstanceLockFactory@3d2a2f83)),segFN=segments_1,generation=1}
   [junit4]   2> 35147 T100 oasc.SolrDeletionPolicy.updateCommits newest commit generation = 1
   [junit4]   2> 35148 T100 oass.SolrIndexSearcher.<init> Opening Searcher@b784f29c main
   [junit4]   2> 35148 T100 oashc.SpellCheckComponent.inform Initializing spell checkers
   [junit4]   2> 35165 T100 oass.DirectSolrSpellChecker.init init: {name=direct,classname=DirectSolrSpellChecker,field=lowerfilt,minQueryLength=3}
   [junit4]   2> 35217 T101 oasc.SolrCore.registerSearcher [collection1] Registered new searcher Searcher@b784f29c main{StandardDirectoryReader(segments_1:1:nrt)}
   [junit4]   2> 35219 T100 oasc.CoreContainer.registerCore registering core: collection1
   [junit4]   2> 35221 T76 oass.SolrDispatchFilter.init user.dir=/mnt/ssd/jenkins/workspace/Lucene-Solr-trunk-Linux/solr/build/solr-core/test/J1
   [junit4]   2> 35222 T76 oass.SolrDispatchFilter.init SolrDispatchFilter.init() done
   [junit4]   2> ASYNC  NEW_CORE C53 name=collection1 org.apache.solr.core.SolrCore@8f29a000
   [junit4]   2> 35564 T86 C53 oasup.LogUpdateProcessor.finish [collection1] webapp=/lg_e/gm path=/update params={version=2&wt=javabin} {add=[0 (1454003119741468672)]} 0 38
   [junit4]   2> ASYNC  NEW_CORE C54 name=collection1 org.apache.solr.core.SolrCore@592463d5
   [junit4]   2> 35644 T96 C54 oasup.LogUpdateProcessor.finish [collection1] webapp=/lg_e/gm path=/update params={version=2&wt=javabin} {add=[0 (1454003119851569152)]} 0 6
   [junit4]   2> 35658 T85 C53 oasup.LogUpdateProcessor.finish [collection1] webapp=/lg_e/gm path=/update params={version=2&wt=javabin} {add=[1 (1454003119863103488)]} 0 9
   [junit4]   2> 35670 T97 C54 oasup.LogUpdateProcessor.finish [collection1] webapp=/lg_e/gm path=/update params={version=2&wt=javabin} {add=[1 (1454003119878832128)]} 0 7
   [junit4]   2> 35682 T84 C53 oasup.LogUpdateProcessor.finish [collection1] webapp=/lg_e/gm path=/update params={version=2&wt=javabin} {add=[2 (1454003119891415040)]} 0 6
   [junit4]   2> 35690 T95 C54 oasup.LogUpdateProcessor.finish [collection1] webapp=/lg_e/gm path=/update params={version=2&wt=javabin} {add=[2 (1454003119901900800)]} 0 4
   [junit4]   2> 35699 T87 C53 oasup.LogUpdateProcessor.finish [collection1] webapp=/lg_e/gm path=/update params={version=2&wt=javabin} {add=[3 (1454003119911337984)]} 0 5
   [junit4]   2> 35707 T96 C54 oasup.LogUpdateProcessor.finish [collection1] webapp=/lg_e/gm path=/update params={version=2&wt=javabin} {add=[3 (1454003119920775168)]} 0 4
   [junit4]   2> 35716 T86 C53 oasup.LogUpdateProcessor.finish [collection1] webapp=/lg_e/gm path=/update params={version=2&wt=javabin} {add=[4 (1454003119930212352)]} 0 4
   [junit4]   2> 35725 T97 C54 oasup.LogUpdateProcessor.finish [collection1] webapp=/lg_e/gm path=/update params={version=2&wt=javabin} {add=[4 (1454003119939649536)]} 0 3
   [junit4]   2> 35732 T85 C53 oasup.LogUpdateProcessor.finish [collection1] webapp=/lg_e/gm path=/update params={version=2&wt=javabin} {add=[5 (1454003119948038144)]} 0 3
   [junit4]   2> 35741 T99 C54 oasup.LogUpdateProcessor.finish [collection1] webapp=/lg_e/gm path=/update params={version=2&wt=javabin} {add=[5 (1454003119955378176)]} 0 4
   [junit4]   2> 35752 T84 C53 oasup.LogUpdateProcessor.finish [collection1] webapp=/lg_e/gm path=/update params={version=2&wt=javabin} {add=[6 (1454003119966912512)]} 0 4
   [junit4]   2> 35760 T95 C54 oasup.LogUpdateProcessor.finish [collection1] webapp=/lg_e/gm path=/update params={version=2&wt=javabin} {add=[6 (1454003119976349696)]} 0 3
   [junit4]   2> 35770 T87 C53 oasup.LogUpdateProcessor.finish [collection1] webapp=/lg_e/gm path=/update params={version=2&wt=javabin} {add=[7 (1454003119985786880)]} 0 5
   [junit4]   2> 35786 T96 C54 oasup.LogUpdateProcessor.finish [collect

[...truncated too long message...]

  >     <null name="mc"/>
   [junit4]    >     <null name="mean"/>
   [junit4]    >     <null name="su"/>
   [junit4]    >     <null name="sum"/>
   [junit4]    >     <null name="unique"/>
   [junit4]    >   </lst>
   [junit4]    >   <lst name="cdr">
   [junit4]    >     <date name="cd1">1800-12-31T23:59:59Z</date>
   [junit4]    >     <date name="cd2">1804-06-30T23:59:59Z</date>
   [junit4]    >     <str name="cs1">1800-12-31T23:59:59Z</str>
   [junit4]    >     <str name="cs2">1804-06-30T23:59:59Z</str>
   [junit4]    >   </lst>
   [junit4]    > </lst>
   [junit4]    > </response>
   [junit4]    > 	at __randomizedtesting.SeedInfo.seed([83CA0A58087F9A3F:DBC7E1AE2CBDF8E9]:0)
   [junit4]    > 	at org.apache.solr.analytics.AbstractAnalyticsStatsTest.getStatResult(AbstractAnalyticsStatsTest.java:113)
   [junit4]    > 	at org.apache.solr.analytics.expression.ExpressionTest.divideTest(ExpressionTest.java:106)
   [junit4]    > 	at java.lang.Thread.run(Thread.java:780)
   [junit4]   2> 1382242 T4539 oas.SolrTestCaseJ4.setUp ###Starting reverseTest
   [junit4]   2> 1382245 T4539 oas.SolrTestCaseJ4.tearDown ###Ending reverseTest
   [junit4]   2> 1382249 T4539 oas.SolrTestCaseJ4.setUp ###Starting constantStringTest
   [junit4]   2> 1382252 T4539 oas.SolrTestCaseJ4.tearDown ###Ending constantStringTest
   [junit4]   2> 1382257 T4539 oas.SolrTestCaseJ4.setUp ###Starting powerTest
   [junit4]   2> 1382262 T4539 oas.SolrTestCaseJ4.tearDown ###Ending powerTest
   [junit4]   2> 1382267 T4539 oas.SolrTestCaseJ4.setUp ###Starting constantNumberTest
   [junit4]   2> 1382268 T4539 oas.SolrTestCaseJ4.tearDown ###Ending constantNumberTest
   [junit4]   2> 1382273 T4539 oas.SolrTestCaseJ4.setUp ###Starting concatenateTest
   [junit4]   2> 1382277 T4539 oas.SolrTestCaseJ4.tearDown ###Ending concatenateTest
   [junit4]   2> 1382280 T4539 oas.SolrTestCaseJ4.deleteCore ###deleteCore
   [junit4]   2> 1382280 T4539 oasc.CoreContainer.shutdown Shutting down CoreContainer instance=1189890022
   [junit4]   2> 1382280 T4539 oasc.SolrCore.close [collection1]  CLOSING SolrCore org.apache.solr.core.SolrCore@da16a301
   [junit4]   2> 1382281 T4539 oasu.DirectUpdateHandler2.close closing DirectUpdateHandler2{commits=1,autocommits=0,soft autocommits=0,optimizes=0,rollbacks=0,expungeDeletes=0,docsPending=0,adds=0,deletesById=0,deletesByQuery=0,errors=0,cumulative_adds=100,cumulative_deletesById=0,cumulative_deletesByQuery=1,cumulative_errors=0}
   [junit4]   2> 1382281 T4539 oasu.SolrCoreState.decrefSolrCoreState Closing SolrCoreState
   [junit4]   2> 1382281 T4539 oasu.DefaultSolrCoreState.closeIndexWriter SolrCoreState ref count has reached 0 - closing IndexWriter
   [junit4]   2> 1382282 T4539 oasu.DefaultSolrCoreState.closeIndexWriter closing IndexWriter with IndexWriterCloser
   [junit4]   2> 1382282 T4539 oasc.SolrCore.closeSearcher [collection1] Closing main searcher on request.
   [junit4]   2> 1382283 T4539 oasc.CachingDirectoryFactory.close Closing MockDirectoryFactory - 2 directories currently being tracked
   [junit4]   2> 1382283 T4539 oasc.CachingDirectoryFactory.closeCacheValue looking to close /mnt/ssd/jenkins/workspace/Lucene-Solr-trunk-Linux/solr/build/solr-core/test/J1/./solrtest-ExpressionTest-1386646777177/index [CachedDir<<refCount=0;path=/mnt/ssd/jenkins/workspace/Lucene-Solr-trunk-Linux/solr/build/solr-core/test/J1/./solrtest-ExpressionTest-1386646777177/index;done=false>>]
   [junit4]   2> 1382284 T4539 oasc.CachingDirectoryFactory.close Closing directory: /mnt/ssd/jenkins/workspace/Lucene-Solr-trunk-Linux/solr/build/solr-core/test/J1/./solrtest-ExpressionTest-1386646777177/index
   [junit4]   2> 1382284 T4539 oasc.CachingDirectoryFactory.closeCacheValue looking to close /mnt/ssd/jenkins/workspace/Lucene-Solr-trunk-Linux/solr/build/solr-core/test/J1/./solrtest-ExpressionTest-1386646777177 [CachedDir<<refCount=0;path=/mnt/ssd/jenkins/workspace/Lucene-Solr-trunk-Linux/solr/build/solr-core/test/J1/./solrtest-ExpressionTest-1386646777177;done=false>>]
   [junit4]   2> 1382284 T4539 oasc.CachingDirectoryFactory.close Closing directory: /mnt/ssd/jenkins/workspace/Lucene-Solr-trunk-Linux/solr/build/solr-core/test/J1/./solrtest-ExpressionTest-1386646777177
   [junit4]   2> NOTE: test params are: codec=Lucene46: {float_fd=Pulsing41(freqCutoff=7 minBlockSize=30 maxBlockSize=89), date_dtd=PostingsFormat(name=NestedPulsing), string_sd=PostingsFormat(name=NestedPulsing), double_dd=PostingsFormat(name=Lucene41VarGapFixedInterval), long_ld=PostingsFormat(name=NestedPulsing), int_id=PostingsFormat(name=NestedPulsing), id=PostingsFormat(name=NestedPulsing)}, docValues:{longdv=DocValuesFormat(name=SimpleText), long_ld=DocValuesFormat(name=Disk), double_dd=DocValuesFormat(name=Memory), floatdv=DocValuesFormat(name=SimpleText), datedv=DocValuesFormat(name=Memory), date_dtd=DocValuesFormat(name=Disk), intdv=DocValuesFormat(name=Lucene45), doubledv=DocValuesFormat(name=Disk), float_fd=DocValuesFormat(name=Lucene45), stringdv=DocValuesFormat(name=Disk), int_id=DocValuesFormat(name=Disk), string_sd=DocValuesFormat(name=Disk), stringdvm=DocValuesFormat(name=SimpleText)}, sim=DefaultSimilarity, locale=bg_BG, timezone=UCT
   [junit4]   2> NOTE: Linux 3.8.0-34-generic x86/IBM Corporation 1.7.0 (32-bit)/cpus=8,threads=1,free=70970440,total=212533248
   [junit4]   2> NOTE: All tests run in this JVM: [TestReload, TermVectorComponentDistributedTest, OpenExchangeRatesOrgProviderTest, TestCloudManagedSchema, DefaultValueUpdateProcessorTest, TestCodecSupport, SpellCheckComponentTest, TestDistributedGrouping, TestFastWriter, TestSolrCoreProperties, TestFoldingMultitermQuery, FieldAnalysisRequestHandlerTest, CoreContainerCoreInitFailuresTest, AliasIntegrationTest, OutputWriterTest, TestHighFrequencyDictionaryFactory, TestQuerySenderListener, AbstractAnalyticsFacetTest, TestSolrXmlPersistor, AlternateDirectoryTest, JSONWriterTest, TestFiltering, SignatureUpdateProcessorFactoryTest, TestBinaryResponseWriter, TestPhraseSuggestions, SolrCmdDistributorTest, ChaosMonkeyNothingIsSafeTest, BlockCacheTest, BasicZkTest, XsltUpdateRequestHandlerTest, TestCollationField, MinimalSchemaTest, TestJmxIntegration, NotRequiredUniqueKeyTest, BadCopyFieldTest, TestPartialUpdateDeduplication, TestStressLucene, TestRecovery, TestUpdate, TestSolrXml, TestDynamicFieldResource, SolrIndexConfigTest, EnumFieldTest, SolrPluginUtilsTest, TestDocBasedVersionConstraints, TestCSVResponseWriter, TestZkChroot, TestSolrDeletionPolicy2, SortByFunctionTest, TestDFRSimilarityFactory, HdfsBasicDistributedZk2Test, HdfsLockFactoryTest, TestIBSimilarityFactory, TestFuzzyAnalyzedSuggestions, TestRecoveryHdfs, FieldFacetTest, PrimUtilsTest, TestStressReorder, IndexSchemaRuntimeFieldTest, ZkSolrClientTest, TestHashPartitioner, DateFieldTest, HdfsCollectionsAPIDistributedZkTest, BasicDistributedZk2Test, TestFieldTypeResource, ShardSplitTest, TestBinaryField, TestIndexingPerformance, CurrencyFieldOpenExchangeTest, IndexBasedSpellCheckerTest, TestFieldTypeCollectionResource, TestFastLRUCache, FullSolrCloudDistribCmdsTest, TriLevelCompositeIdRoutingTest, TestDistribDocBasedVersion, RAMDirectoryFactoryTest, TimeZoneUtilsTest, TestFieldResource, PluginInfoTest, FieldFacetExtrasTest, TestSolrXmlPersistence, TestAtomicUpdateErrorCases, TestSolr4Spatial, LeaderElectionIntegrationTest, SuggesterWFSTTest, XmlUpdateRequestHandlerTest, TestQueryTypes, BadIndexSchemaTest, TestReplicationHandler, TestRandomFaceting, LeaderElectionTest, ZkCLITest, ShardRoutingCustomTest, SliceStateUpdateTest, TestDistributedSearch, TestFaceting, TestRealTimeGet, TestJoin, StatsComponentTest, ConvertedLegacyTest, TestFunctionQuery, BasicFunctionalityTest, TestLazyCores, DirectUpdateHandlerTest, TestIndexSearcher, HighlighterTest, CurrencyFieldXmlFileTest, SolrIndexSplitterTest, SimplePostToolTest, TestCoreDiscovery, AnalysisAfterCoreReloadTest, SpellCheckCollatorTest, SuggesterTSTTest, TestCSVLoader, NoCacheHeaderTest, SolrCoreCheckLockOnStartupTest, DirectUpdateHandlerOptimizeTest, DocValuesMultiTest, DebugComponentTest, TestSurroundQueryParser, StandardRequestHandlerTest, TestReversedWildcardFilterFactory, PrimitiveFieldTypeTest, FileBasedSpellCheckerTest, RequestHandlersTest, PathHierarchyTokenizerFactoryTest, RequiredFieldsTest, TestArbitraryIndexDir, IndexSchemaTest, MBeansHandlerTest, QueryParsingTest, BinaryUpdateRequestHandlerTest, PingRequestHandlerTest, TestLFUCache, SOLR749Test, TestStressRecovery, AbstractAnalyticsStatsTest, NoFacetTest, ExpressionTest]
   [junit4] Completed on J1 in 0.87s, 12 tests, 4 failures <<< FAILURES!

[...truncated 165 lines...]
BUILD FAILED
/mnt/ssd/jenkins/workspace/Lucene-Solr-trunk-Linux/build.xml:420: The following error occurred while executing this line:
/mnt/ssd/jenkins/workspace/Lucene-Solr-trunk-Linux/build.xml:413: The following error occurred while executing this line:
/mnt/ssd/jenkins/workspace/Lucene-Solr-trunk-Linux/build.xml:39: The following error occurred while executing this line:
/mnt/ssd/jenkins/workspace/Lucene-Solr-trunk-Linux/extra-targets.xml:37: The following error occurred while executing this line:
/mnt/ssd/jenkins/workspace/Lucene-Solr-trunk-Linux/solr/build.xml:189: The following error occurred while executing this line:
/mnt/ssd/jenkins/workspace/Lucene-Solr-trunk-Linux/solr/common-build.xml:491: The following error occurred while executing this line:
/mnt/ssd/jenkins/workspace/Lucene-Solr-trunk-Linux/lucene/common-build.xml:1304: The following error occurred while executing this line:
/mnt/ssd/jenkins/workspace/Lucene-Solr-trunk-Linux/lucene/common-build.xml:937: There were test failures: 357 suites, 1572 tests, 8 failures, 34 ignored (6 assumptions)

Total time: 51 minutes 11 seconds
Build step 'Invoke Ant' marked build as failure
Description set: Java: 32bit/ibm-j9-jdk7 -Xjit:exclude={org/apache/lucene/util/fst/FST.pack(IIF)Lorg/apache/lucene/util/fst/FST;}
Archiving artifacts
Recording test results
Email was triggered for: Failure
Sending email for trigger: Failure



Mime
View raw message