lucene-dev mailing list archives

Site index · List index
Message view « Date » · « Thread »
Top « Date » · « Thread »
From Policeman Jenkins Server <jenk...@thetaphi.de>
Subject [JENKINS] Lucene-Solr-trunk-Windows (64bit/jdk1.7.0_60-ea-b01) - Build # 3586 - Failure!
Date Fri, 20 Dec 2013 09:30:02 GMT
Build: http://jenkins.thetaphi.de/job/Lucene-Solr-trunk-Windows/3586/
Java: 64bit/jdk1.7.0_60-ea-b01 -XX:-UseCompressedOops -XX:+UseSerialGC

2 tests failed.
FAILED:  org.apache.solr.morphlines.cell.SolrCellMorphlineTest.testSolrCellDocumentTypes2

Error Message:
Cannot instantiate command for command: [detectMimeType] with builder: org.kitesdk.morphline.tika.DetectMimeTypeBuilder near: {     # C:\Users\JenkinsSlave\workspace\Lucene-Solr-trunk-Windows\solr\build\contrib\solr-morphlines-cell\test\J0\.\test-morphlines-1387531730071\test-morphlines\solrCellDocumentTypes.conf: 54     "includeDefaultMimeTypes" : true,     # C:\Users\JenkinsSlave\workspace\Lucene-Solr-trunk-Windows\solr\build\contrib\solr-morphlines-cell\test\J0\.\test-morphlines-1387531730071\test-morphlines\solrCellDocumentTypes.conf: 55     "mimeTypesFiles" : [         # C:\Users\JenkinsSlave\workspace\Lucene-Solr-trunk-Windows\solr\build\contrib\solr-morphlines-cell\test\J0\.\test-morphlines-1387531730071\test-morphlines\solrCellDocumentTypes.conf: 55         "C:UsersJenkinsSlaveworkspaceLucene-Solr-trunk-Windowssolrbuildcontribsolr-morphlines-celltestJ0.test-morphlines-1387531730071/custom-mimetypes.xml"     ] }

Stack Trace:
org.kitesdk.morphline.api.MorphlineCompilationException: Cannot instantiate command for command: [detectMimeType] with builder: org.kitesdk.morphline.tika.DetectMimeTypeBuilder near: {
    # C:\Users\JenkinsSlave\workspace\Lucene-Solr-trunk-Windows\solr\build\contrib\solr-morphlines-cell\test\J0\.\test-morphlines-1387531730071\test-morphlines\solrCellDocumentTypes.conf: 54
    "includeDefaultMimeTypes" : true,
    # C:\Users\JenkinsSlave\workspace\Lucene-Solr-trunk-Windows\solr\build\contrib\solr-morphlines-cell\test\J0\.\test-morphlines-1387531730071\test-morphlines\solrCellDocumentTypes.conf: 55
    "mimeTypesFiles" : [
        # C:\Users\JenkinsSlave\workspace\Lucene-Solr-trunk-Windows\solr\build\contrib\solr-morphlines-cell\test\J0\.\test-morphlines-1387531730071\test-morphlines\solrCellDocumentTypes.conf: 55
        "C:UsersJenkinsSlaveworkspaceLucene-Solr-trunk-Windowssolrbuildcontribsolr-morphlines-celltestJ0.test-morphlines-1387531730071/custom-mimetypes.xml"
    ]
}
	at __randomizedtesting.SeedInfo.seed([62CD2BFB5E10AEC5:E94D901B59E63D3B]:0)
	at org.kitesdk.morphline.tika.DetectMimeTypeBuilder.build(DetectMimeTypeBuilder.java:67)
	at org.kitesdk.morphline.base.AbstractCommand.buildCommand(AbstractCommand.java:292)
	at org.kitesdk.morphline.base.AbstractCommand.buildCommandChain(AbstractCommand.java:242)
	at org.kitesdk.morphline.stdlib.Pipe.<init>(Pipe.java:45)
	at org.kitesdk.morphline.stdlib.PipeBuilder.build(PipeBuilder.java:39)
	at org.apache.solr.morphlines.solr.AbstractSolrMorphlineTestBase.createMorphline(AbstractSolrMorphlineTestBase.java:205)
	at org.apache.solr.morphlines.cell.SolrCellMorphlineTest.testSolrCellDocumentTypes2(SolrCellMorphlineTest.java:200)
	at sun.reflect.NativeMethodAccessorImpl.invoke0(Native Method)
	at sun.reflect.NativeMethodAccessorImpl.invoke(NativeMethodAccessorImpl.java:57)
	at sun.reflect.DelegatingMethodAccessorImpl.invoke(DelegatingMethodAccessorImpl.java:43)
	at java.lang.reflect.Method.invoke(Method.java:606)
	at com.carrotsearch.randomizedtesting.RandomizedRunner.invoke(RandomizedRunner.java:1559)
	at com.carrotsearch.randomizedtesting.RandomizedRunner.access$600(RandomizedRunner.java:79)
	at com.carrotsearch.randomizedtesting.RandomizedRunner$6.evaluate(RandomizedRunner.java:737)
	at com.carrotsearch.randomizedtesting.RandomizedRunner$7.evaluate(RandomizedRunner.java:773)
	at com.carrotsearch.randomizedtesting.RandomizedRunner$8.evaluate(RandomizedRunner.java:787)
	at com.carrotsearch.randomizedtesting.rules.SystemPropertiesRestoreRule$1.evaluate(SystemPropertiesRestoreRule.java:53)
	at org.apache.lucene.util.TestRuleSetupTeardownChained$1.evaluate(TestRuleSetupTeardownChained.java:50)
	at org.apache.lucene.util.TestRuleFieldCacheSanity$1.evaluate(TestRuleFieldCacheSanity.java:51)
	at org.apache.lucene.util.AbstractBeforeAfterRule$1.evaluate(AbstractBeforeAfterRule.java:46)
	at com.carrotsearch.randomizedtesting.rules.SystemPropertiesInvariantRule$1.evaluate(SystemPropertiesInvariantRule.java:55)
	at org.apache.lucene.util.TestRuleThreadAndTestName$1.evaluate(TestRuleThreadAndTestName.java:49)
	at org.apache.lucene.util.TestRuleIgnoreAfterMaxFailures$1.evaluate(TestRuleIgnoreAfterMaxFailures.java:70)
	at org.apache.lucene.util.TestRuleMarkFailure$1.evaluate(TestRuleMarkFailure.java:48)
	at com.carrotsearch.randomizedtesting.rules.StatementAdapter.evaluate(StatementAdapter.java:36)
	at com.carrotsearch.randomizedtesting.ThreadLeakControl$StatementRunner.run(ThreadLeakControl.java:358)
	at com.carrotsearch.randomizedtesting.ThreadLeakControl.forkTimeoutingTask(ThreadLeakControl.java:782)
	at com.carrotsearch.randomizedtesting.ThreadLeakControl$3.evaluate(ThreadLeakControl.java:442)
	at com.carrotsearch.randomizedtesting.RandomizedRunner.runSingleTest(RandomizedRunner.java:746)
	at com.carrotsearch.randomizedtesting.RandomizedRunner$3.evaluate(RandomizedRunner.java:648)
	at com.carrotsearch.randomizedtesting.RandomizedRunner$4.evaluate(RandomizedRunner.java:682)
	at com.carrotsearch.randomizedtesting.RandomizedRunner$5.evaluate(RandomizedRunner.java:693)
	at com.carrotsearch.randomizedtesting.rules.StatementAdapter.evaluate(StatementAdapter.java:36)
	at com.carrotsearch.randomizedtesting.rules.SystemPropertiesRestoreRule$1.evaluate(SystemPropertiesRestoreRule.java:53)
	at org.apache.lucene.util.AbstractBeforeAfterRule$1.evaluate(AbstractBeforeAfterRule.java:46)
	at org.apache.lucene.util.TestRuleStoreClassName$1.evaluate(TestRuleStoreClassName.java:42)
	at com.carrotsearch.randomizedtesting.rules.SystemPropertiesInvariantRule$1.evaluate(SystemPropertiesInvariantRule.java:55)
	at com.carrotsearch.randomizedtesting.rules.NoShadowingOrOverridesOnMethodsRule$1.evaluate(NoShadowingOrOverridesOnMethodsRule.java:39)
	at com.carrotsearch.randomizedtesting.rules.NoShadowingOrOverridesOnMethodsRule$1.evaluate(NoShadowingOrOverridesOnMethodsRule.java:39)
	at com.carrotsearch.randomizedtesting.rules.StatementAdapter.evaluate(StatementAdapter.java:36)
	at org.apache.lucene.util.TestRuleAssertionsRequired$1.evaluate(TestRuleAssertionsRequired.java:43)
	at org.apache.lucene.util.TestRuleMarkFailure$1.evaluate(TestRuleMarkFailure.java:48)
	at org.apache.lucene.util.TestRuleIgnoreAfterMaxFailures$1.evaluate(TestRuleIgnoreAfterMaxFailures.java:70)
	at org.apache.lucene.util.TestRuleIgnoreTestSuites$1.evaluate(TestRuleIgnoreTestSuites.java:55)
	at com.carrotsearch.randomizedtesting.rules.StatementAdapter.evaluate(StatementAdapter.java:36)
	at com.carrotsearch.randomizedtesting.ThreadLeakControl$StatementRunner.run(ThreadLeakControl.java:358)
	at java.lang.Thread.run(Thread.java:744)
Caused by: java.io.FileNotFoundException: C:UsersJenkinsSlaveworkspaceLucene-Solr-trunk-Windowssolrbuildcontribsolr-morphlines-celltestJ0.test-morphlines-1387531730071\custom-mimetypes.xml (The system cannot find the path specified)
	at java.io.FileInputStream.open(Native Method)
	at java.io.FileInputStream.<init>(FileInputStream.java:146)
	at org.kitesdk.morphline.tika.DetectMimeTypeBuilder$DetectMimeType.<init>(DetectMimeTypeBuilder.java:101)
	at org.kitesdk.morphline.tika.DetectMimeTypeBuilder.build(DetectMimeTypeBuilder.java:65)
	... 46 more


FAILED:  org.apache.solr.morphlines.cell.SolrCellMorphlineTest.testSolrCellDocumentTypes

Error Message:
Cannot instantiate command for command: [detectMimeType] with builder: org.kitesdk.morphline.tika.DetectMimeTypeBuilder near: {     # C:\Users\JenkinsSlave\workspace\Lucene-Solr-trunk-Windows\solr\build\contrib\solr-morphlines-cell\test\J0\.\test-morphlines-1387531741628\test-morphlines\solrCellDocumentTypes.conf: 54     "includeDefaultMimeTypes" : true,     # C:\Users\JenkinsSlave\workspace\Lucene-Solr-trunk-Windows\solr\build\contrib\solr-morphlines-cell\test\J0\.\test-morphlines-1387531741628\test-morphlines\solrCellDocumentTypes.conf: 55     "mimeTypesFiles" : [         # C:\Users\JenkinsSlave\workspace\Lucene-Solr-trunk-Windows\solr\build\contrib\solr-morphlines-cell\test\J0\.\test-morphlines-1387531741628\test-morphlines\solrCellDocumentTypes.conf: 55         "C:UsersJenkinsSlaveworkspaceLucene-Solr-trunk-Windowssolrbuildcontribsolr-morphlines-celltestJ0.test-morphlines-1387531741628/custom-mimetypes.xml"     ] }

Stack Trace:
org.kitesdk.morphline.api.MorphlineCompilationException: Cannot instantiate command for command: [detectMimeType] with builder: org.kitesdk.morphline.tika.DetectMimeTypeBuilder near: {
    # C:\Users\JenkinsSlave\workspace\Lucene-Solr-trunk-Windows\solr\build\contrib\solr-morphlines-cell\test\J0\.\test-morphlines-1387531741628\test-morphlines\solrCellDocumentTypes.conf: 54
    "includeDefaultMimeTypes" : true,
    # C:\Users\JenkinsSlave\workspace\Lucene-Solr-trunk-Windows\solr\build\contrib\solr-morphlines-cell\test\J0\.\test-morphlines-1387531741628\test-morphlines\solrCellDocumentTypes.conf: 55
    "mimeTypesFiles" : [
        # C:\Users\JenkinsSlave\workspace\Lucene-Solr-trunk-Windows\solr\build\contrib\solr-morphlines-cell\test\J0\.\test-morphlines-1387531741628\test-morphlines\solrCellDocumentTypes.conf: 55
        "C:UsersJenkinsSlaveworkspaceLucene-Solr-trunk-Windowssolrbuildcontribsolr-morphlines-celltestJ0.test-morphlines-1387531741628/custom-mimetypes.xml"
    ]
}
	at __randomizedtesting.SeedInfo.seed([62CD2BFB5E10AEC5:F80E88653BCBF010]:0)
	at org.kitesdk.morphline.tika.DetectMimeTypeBuilder.build(DetectMimeTypeBuilder.java:67)
	at org.kitesdk.morphline.base.AbstractCommand.buildCommand(AbstractCommand.java:292)
	at org.kitesdk.morphline.base.AbstractCommand.buildCommandChain(AbstractCommand.java:242)
	at org.kitesdk.morphline.stdlib.Pipe.<init>(Pipe.java:45)
	at org.kitesdk.morphline.stdlib.PipeBuilder.build(PipeBuilder.java:39)
	at org.apache.solr.morphlines.solr.AbstractSolrMorphlineTestBase.createMorphline(AbstractSolrMorphlineTestBase.java:205)
	at org.apache.solr.morphlines.cell.SolrCellMorphlineTest.testSolrCellDocumentTypes(SolrCellMorphlineTest.java:169)
	at sun.reflect.NativeMethodAccessorImpl.invoke0(Native Method)
	at sun.reflect.NativeMethodAccessorImpl.invoke(NativeMethodAccessorImpl.java:57)
	at sun.reflect.DelegatingMethodAccessorImpl.invoke(DelegatingMethodAccessorImpl.java:43)
	at java.lang.reflect.Method.invoke(Method.java:606)
	at com.carrotsearch.randomizedtesting.RandomizedRunner.invoke(RandomizedRunner.java:1559)
	at com.carrotsearch.randomizedtesting.RandomizedRunner.access$600(RandomizedRunner.java:79)
	at com.carrotsearch.randomizedtesting.RandomizedRunner$6.evaluate(RandomizedRunner.java:737)
	at com.carrotsearch.randomizedtesting.RandomizedRunner$7.evaluate(RandomizedRunner.java:773)
	at com.carrotsearch.randomizedtesting.RandomizedRunner$8.evaluate(RandomizedRunner.java:787)
	at com.carrotsearch.randomizedtesting.rules.SystemPropertiesRestoreRule$1.evaluate(SystemPropertiesRestoreRule.java:53)
	at org.apache.lucene.util.TestRuleSetupTeardownChained$1.evaluate(TestRuleSetupTeardownChained.java:50)
	at org.apache.lucene.util.TestRuleFieldCacheSanity$1.evaluate(TestRuleFieldCacheSanity.java:51)
	at org.apache.lucene.util.AbstractBeforeAfterRule$1.evaluate(AbstractBeforeAfterRule.java:46)
	at com.carrotsearch.randomizedtesting.rules.SystemPropertiesInvariantRule$1.evaluate(SystemPropertiesInvariantRule.java:55)
	at org.apache.lucene.util.TestRuleThreadAndTestName$1.evaluate(TestRuleThreadAndTestName.java:49)
	at org.apache.lucene.util.TestRuleIgnoreAfterMaxFailures$1.evaluate(TestRuleIgnoreAfterMaxFailures.java:70)
	at org.apache.lucene.util.TestRuleMarkFailure$1.evaluate(TestRuleMarkFailure.java:48)
	at com.carrotsearch.randomizedtesting.rules.StatementAdapter.evaluate(StatementAdapter.java:36)
	at com.carrotsearch.randomizedtesting.ThreadLeakControl$StatementRunner.run(ThreadLeakControl.java:358)
	at com.carrotsearch.randomizedtesting.ThreadLeakControl.forkTimeoutingTask(ThreadLeakControl.java:782)
	at com.carrotsearch.randomizedtesting.ThreadLeakControl$3.evaluate(ThreadLeakControl.java:442)
	at com.carrotsearch.randomizedtesting.RandomizedRunner.runSingleTest(RandomizedRunner.java:746)
	at com.carrotsearch.randomizedtesting.RandomizedRunner$3.evaluate(RandomizedRunner.java:648)
	at com.carrotsearch.randomizedtesting.RandomizedRunner$4.evaluate(RandomizedRunner.java:682)
	at com.carrotsearch.randomizedtesting.RandomizedRunner$5.evaluate(RandomizedRunner.java:693)
	at com.carrotsearch.randomizedtesting.rules.StatementAdapter.evaluate(StatementAdapter.java:36)
	at com.carrotsearch.randomizedtesting.rules.SystemPropertiesRestoreRule$1.evaluate(SystemPropertiesRestoreRule.java:53)
	at org.apache.lucene.util.AbstractBeforeAfterRule$1.evaluate(AbstractBeforeAfterRule.java:46)
	at org.apache.lucene.util.TestRuleStoreClassName$1.evaluate(TestRuleStoreClassName.java:42)
	at com.carrotsearch.randomizedtesting.rules.SystemPropertiesInvariantRule$1.evaluate(SystemPropertiesInvariantRule.java:55)
	at com.carrotsearch.randomizedtesting.rules.NoShadowingOrOverridesOnMethodsRule$1.evaluate(NoShadowingOrOverridesOnMethodsRule.java:39)
	at com.carrotsearch.randomizedtesting.rules.NoShadowingOrOverridesOnMethodsRule$1.evaluate(NoShadowingOrOverridesOnMethodsRule.java:39)
	at com.carrotsearch.randomizedtesting.rules.StatementAdapter.evaluate(StatementAdapter.java:36)
	at org.apache.lucene.util.TestRuleAssertionsRequired$1.evaluate(TestRuleAssertionsRequired.java:43)
	at org.apache.lucene.util.TestRuleMarkFailure$1.evaluate(TestRuleMarkFailure.java:48)
	at org.apache.lucene.util.TestRuleIgnoreAfterMaxFailures$1.evaluate(TestRuleIgnoreAfterMaxFailures.java:70)
	at org.apache.lucene.util.TestRuleIgnoreTestSuites$1.evaluate(TestRuleIgnoreTestSuites.java:55)
	at com.carrotsearch.randomizedtesting.rules.StatementAdapter.evaluate(StatementAdapter.java:36)
	at com.carrotsearch.randomizedtesting.ThreadLeakControl$StatementRunner.run(ThreadLeakControl.java:358)
	at java.lang.Thread.run(Thread.java:744)
Caused by: java.io.FileNotFoundException: C:UsersJenkinsSlaveworkspaceLucene-Solr-trunk-Windowssolrbuildcontribsolr-morphlines-celltestJ0.test-morphlines-1387531741628\custom-mimetypes.xml (The system cannot find the path specified)
	at java.io.FileInputStream.open(Native Method)
	at java.io.FileInputStream.<init>(FileInputStream.java:146)
	at org.kitesdk.morphline.tika.DetectMimeTypeBuilder$DetectMimeType.<init>(DetectMimeTypeBuilder.java:101)
	at org.kitesdk.morphline.tika.DetectMimeTypeBuilder.build(DetectMimeTypeBuilder.java:65)
	... 46 more




Build Log:
[...truncated 18229 lines...]
   [junit4] Suite: org.apache.solr.morphlines.cell.SolrCellMorphlineTest
   [junit4]   1> 2013-12-20 09:28:38,795 INFO  [SUITE-SolrCellMorphlineTest-seed#[62CD2BFB5E10AEC5]-worker] solr.SolrTestCaseJ4 (SolrTestCaseJ4.java:initCore(454)) - ####initCore
   [junit4]   1> 2013-12-20 09:28:38,892 INFO  [SUITE-SolrCellMorphlineTest-seed#[62CD2BFB5E10AEC5]-worker] core.SolrResourceLoader (SolrResourceLoader.java:<init>(116)) - new SolrResourceLoader for directory: 'C:\Users\JenkinsSlave\workspace\Lucene-Solr-trunk-Windows\solr/contrib/map-reduce/src/test-files/solr\collection1\'
   [junit4]   1> 2013-12-20 09:28:40,242 INFO  [SUITE-SolrCellMorphlineTest-seed#[62CD2BFB5E10AEC5]-worker] core.SolrConfig (SolrConfig.java:initLibs(503)) - Adding specified lib dirs to ClassLoader
   [junit4]   1> 2013-12-20 09:28:40,245 WARN  [SUITE-SolrCellMorphlineTest-seed#[62CD2BFB5E10AEC5]-worker] core.SolrResourceLoader (SolrResourceLoader.java:addToClassLoader(170)) - Can't find (or read) directory to add to classloader: ../../../contrib/extraction/lib (resolved as: C:\Users\JenkinsSlave\workspace\Lucene-Solr-trunk-Windows\solr\contrib\map-reduce\src\test-files\solr\collection1\..\..\..\contrib\extraction\lib).
   [junit4]   1> 2013-12-20 09:28:40,245 WARN  [SUITE-SolrCellMorphlineTest-seed#[62CD2BFB5E10AEC5]-worker] core.SolrResourceLoader (SolrResourceLoader.java:addToClassLoader(170)) - Can't find (or read) directory to add to classloader: ../../../dist/ (resolved as: C:\Users\JenkinsSlave\workspace\Lucene-Solr-trunk-Windows\solr\contrib\map-reduce\src\test-files\solr\collection1\..\..\..\dist).
   [junit4]   1> 2013-12-20 09:28:40,247 WARN  [SUITE-SolrCellMorphlineTest-seed#[62CD2BFB5E10AEC5]-worker] core.SolrResourceLoader (SolrResourceLoader.java:addToClassLoader(170)) - Can't find (or read) directory to add to classloader: ../../../contrib/clustering/lib/ (resolved as: C:\Users\JenkinsSlave\workspace\Lucene-Solr-trunk-Windows\solr\contrib\map-reduce\src\test-files\solr\collection1\..\..\..\contrib\clustering\lib).
   [junit4]   1> 2013-12-20 09:28:40,247 WARN  [SUITE-SolrCellMorphlineTest-seed#[62CD2BFB5E10AEC5]-worker] core.SolrResourceLoader (SolrResourceLoader.java:addToClassLoader(170)) - Can't find (or read) directory to add to classloader: ../../../dist/ (resolved as: C:\Users\JenkinsSlave\workspace\Lucene-Solr-trunk-Windows\solr\contrib\map-reduce\src\test-files\solr\collection1\..\..\..\dist).
   [junit4]   1> 2013-12-20 09:28:40,248 WARN  [SUITE-SolrCellMorphlineTest-seed#[62CD2BFB5E10AEC5]-worker] core.SolrResourceLoader (SolrResourceLoader.java:addToClassLoader(170)) - Can't find (or read) directory to add to classloader: ../../../contrib/langid/lib/ (resolved as: C:\Users\JenkinsSlave\workspace\Lucene-Solr-trunk-Windows\solr\contrib\map-reduce\src\test-files\solr\collection1\..\..\..\contrib\langid\lib).
   [junit4]   1> 2013-12-20 09:28:40,249 WARN  [SUITE-SolrCellMorphlineTest-seed#[62CD2BFB5E10AEC5]-worker] core.SolrResourceLoader (SolrResourceLoader.java:addToClassLoader(170)) - Can't find (or read) directory to add to classloader: ../../../dist/ (resolved as: C:\Users\JenkinsSlave\workspace\Lucene-Solr-trunk-Windows\solr\contrib\map-reduce\src\test-files\solr\collection1\..\..\..\dist).
   [junit4]   1> 2013-12-20 09:28:40,250 WARN  [SUITE-SolrCellMorphlineTest-seed#[62CD2BFB5E10AEC5]-worker] core.SolrResourceLoader (SolrResourceLoader.java:addToClassLoader(170)) - Can't find (or read) directory to add to classloader: ../../../contrib/velocity/lib (resolved as: C:\Users\JenkinsSlave\workspace\Lucene-Solr-trunk-Windows\solr\contrib\map-reduce\src\test-files\solr\collection1\..\..\..\contrib\velocity\lib).
   [junit4]   1> 2013-12-20 09:28:40,251 WARN  [SUITE-SolrCellMorphlineTest-seed#[62CD2BFB5E10AEC5]-worker] core.SolrResourceLoader (SolrResourceLoader.java:addToClassLoader(170)) - Can't find (or read) directory to add to classloader: ../../../dist/ (resolved as: C:\Users\JenkinsSlave\workspace\Lucene-Solr-trunk-Windows\solr\contrib\map-reduce\src\test-files\solr\collection1\..\..\..\dist).
   [junit4]   1> 2013-12-20 09:28:40,251 WARN  [SUITE-SolrCellMorphlineTest-seed#[62CD2BFB5E10AEC5]-worker] core.SolrResourceLoader (SolrResourceLoader.java:addToClassLoader(170)) - Can't find (or read) directory to add to classloader: /non/existent/dir/yields/warning (resolved as: C:\Users\JenkinsSlave\workspace\Lucene-Solr-trunk-Windows\solr\contrib\map-reduce\src\test-files\solr\collection1\non\existent\dir\yields\warning).
   [junit4]   1> 2013-12-20 09:28:40,428 INFO  [SUITE-SolrCellMorphlineTest-seed#[62CD2BFB5E10AEC5]-worker] core.SolrConfig (SolrConfig.java:<init>(160)) - Using Lucene MatchVersion: LUCENE_43
   [junit4]   1> 2013-12-20 09:28:40,668 INFO  [SUITE-SolrCellMorphlineTest-seed#[62CD2BFB5E10AEC5]-worker] core.Config (SolrConfig.java:<init>(262)) - Loaded SolrConfig: C:\Users\JenkinsSlave\workspace\Lucene-Solr-trunk-Windows\solr/contrib/map-reduce/src/test-files/solr/collection1/conf/solrconfig.xml
   [junit4]   1> 2013-12-20 09:28:40,687 INFO  [SUITE-SolrCellMorphlineTest-seed#[62CD2BFB5E10AEC5]-worker] schema.IndexSchema (IndexSchema.java:readSchema(426)) - Reading Solr Schema from C:\Users\JenkinsSlave\workspace\Lucene-Solr-trunk-Windows\solr/contrib/map-reduce/src/test-files/solr/collection1/conf/schema.xml
   [junit4]   1> 2013-12-20 09:28:40,796 INFO  [SUITE-SolrCellMorphlineTest-seed#[62CD2BFB5E10AEC5]-worker] schema.IndexSchema (IndexSchema.java:readSchema(454)) - [null] Schema name=example
   [junit4]   1> 2013-12-20 09:28:42,512 INFO  [SUITE-SolrCellMorphlineTest-seed#[62CD2BFB5E10AEC5]-worker] schema.IndexSchema (IndexSchema.java:readSchema(552)) - unique key field: id
   [junit4]   1> 2013-12-20 09:28:43,051 INFO  [SUITE-SolrCellMorphlineTest-seed#[62CD2BFB5E10AEC5]-worker] schema.FileExchangeRateProvider (CurrencyField.java:reload(781)) - Reloading exchange rates from file currency.xml
   [junit4]   1> 2013-12-20 09:28:43,079 INFO  [SUITE-SolrCellMorphlineTest-seed#[62CD2BFB5E10AEC5]-worker] schema.FileExchangeRateProvider (CurrencyField.java:reload(781)) - Reloading exchange rates from file currency.xml
   [junit4]   1> 2013-12-20 09:28:43,310 INFO  [SUITE-SolrCellMorphlineTest-seed#[62CD2BFB5E10AEC5]-worker] core.SolrResourceLoader (SolrResourceLoader.java:locateSolrHome(711)) - JNDI not configured for solr (NoInitialContextEx)
   [junit4]   1> 2013-12-20 09:28:43,310 INFO  [SUITE-SolrCellMorphlineTest-seed#[62CD2BFB5E10AEC5]-worker] core.SolrResourceLoader (SolrResourceLoader.java:locateSolrHome(723)) - using system property solr.solr.home: C:\Users\JenkinsSlave\workspace\Lucene-Solr-trunk-Windows\solr/contrib/map-reduce/src/test-files/solr
   [junit4]   1> 2013-12-20 09:28:43,310 INFO  [SUITE-SolrCellMorphlineTest-seed#[62CD2BFB5E10AEC5]-worker] core.SolrResourceLoader (SolrResourceLoader.java:<init>(116)) - new SolrResourceLoader for directory: 'C:\Users\JenkinsSlave\workspace\Lucene-Solr-trunk-Windows\solr/contrib/map-reduce/src/test-files/solr\'
   [junit4]   1> 2013-12-20 09:28:43,419 INFO  [SUITE-SolrCellMorphlineTest-seed#[62CD2BFB5E10AEC5]-worker] core.SolrResourceLoader (SolrResourceLoader.java:locateSolrHome(711)) - JNDI not configured for solr (NoInitialContextEx)
   [junit4]   1> 2013-12-20 09:28:43,421 INFO  [SUITE-SolrCellMorphlineTest-seed#[62CD2BFB5E10AEC5]-worker] core.SolrResourceLoader (SolrResourceLoader.java:locateSolrHome(723)) - using system property solr.solr.home: C:\Users\JenkinsSlave\workspace\Lucene-Solr-trunk-Windows\solr/contrib/map-reduce/src/test-files/solr
   [junit4]   1> 2013-12-20 09:28:43,422 INFO  [SUITE-SolrCellMorphlineTest-seed#[62CD2BFB5E10AEC5]-worker] core.SolrResourceLoader (SolrResourceLoader.java:<init>(112)) - new SolrResourceLoader for deduced Solr Home: 'C:\Users\JenkinsSlave\workspace\Lucene-Solr-trunk-Windows\solr/contrib/map-reduce/src/test-files/solr\'
   [junit4]   1> 2013-12-20 09:28:43,643 INFO  [SUITE-SolrCellMorphlineTest-seed#[62CD2BFB5E10AEC5]-worker] core.CoreContainer (CoreContainer.java:<init>(107)) - New CoreContainer 1580955370
   [junit4]   1> 2013-12-20 09:28:43,644 INFO  [SUITE-SolrCellMorphlineTest-seed#[62CD2BFB5E10AEC5]-worker] core.CoreContainer (CoreContainer.java:load(187)) - Loading cores into CoreContainer [instanceDir=C:\Users\JenkinsSlave\workspace\Lucene-Solr-trunk-Windows\solr/contrib/map-reduce/src/test-files/solr\]
   [junit4]   1> 2013-12-20 09:28:43,701 INFO  [SUITE-SolrCellMorphlineTest-seed#[62CD2BFB5E10AEC5]-worker] component.HttpShardHandlerFactory (HttpShardHandlerFactory.java:getParameter(169)) - Setting socketTimeout to: 0
   [junit4]   1> 2013-12-20 09:28:43,701 INFO  [SUITE-SolrCellMorphlineTest-seed#[62CD2BFB5E10AEC5]-worker] component.HttpShardHandlerFactory (HttpShardHandlerFactory.java:getParameter(169)) - Setting urlScheme to: http://
   [junit4]   1> 2013-12-20 09:28:43,702 INFO  [SUITE-SolrCellMorphlineTest-seed#[62CD2BFB5E10AEC5]-worker] component.HttpShardHandlerFactory (HttpShardHandlerFactory.java:getParameter(169)) - Setting connTimeout to: 0
   [junit4]   1> 2013-12-20 09:28:43,702 INFO  [SUITE-SolrCellMorphlineTest-seed#[62CD2BFB5E10AEC5]-worker] component.HttpShardHandlerFactory (HttpShardHandlerFactory.java:getParameter(169)) - Setting maxConnectionsPerHost to: 20
   [junit4]   1> 2013-12-20 09:28:43,702 INFO  [SUITE-SolrCellMorphlineTest-seed#[62CD2BFB5E10AEC5]-worker] component.HttpShardHandlerFactory (HttpShardHandlerFactory.java:getParameter(169)) - Setting corePoolSize to: 0
   [junit4]   1> 2013-12-20 09:28:43,702 INFO  [SUITE-SolrCellMorphlineTest-seed#[62CD2BFB5E10AEC5]-worker] component.HttpShardHandlerFactory (HttpShardHandlerFactory.java:getParameter(169)) - Setting maximumPoolSize to: 2147483647
   [junit4]   1> 2013-12-20 09:28:43,702 INFO  [SUITE-SolrCellMorphlineTest-seed#[62CD2BFB5E10AEC5]-worker] component.HttpShardHandlerFactory (HttpShardHandlerFactory.java:getParameter(169)) - Setting maxThreadIdleTime to: 5
   [junit4]   1> 2013-12-20 09:28:43,705 INFO  [SUITE-SolrCellMorphlineTest-seed#[62CD2BFB5E10AEC5]-worker] component.HttpShardHandlerFactory (HttpShardHandlerFactory.java:getParameter(169)) - Setting sizeOfQueue to: -1
   [junit4]   1> 2013-12-20 09:28:43,706 INFO  [SUITE-SolrCellMorphlineTest-seed#[62CD2BFB5E10AEC5]-worker] component.HttpShardHandlerFactory (HttpShardHandlerFactory.java:getParameter(169)) - Setting fairnessPolicy to: false
   [junit4]   1> 2013-12-20 09:28:44,293 INFO  [SUITE-SolrCellMorphlineTest-seed#[62CD2BFB5E10AEC5]-worker] logging.LogWatcher (LogWatcher.java:createWatcher(153)) - SLF4J impl is org.slf4j.impl.Log4jLoggerFactory
   [junit4]   1> 2013-12-20 09:28:44,296 INFO  [SUITE-SolrCellMorphlineTest-seed#[62CD2BFB5E10AEC5]-worker] logging.LogWatcher (LogWatcher.java:newRegisteredLogWatcher(138)) - Registering Log Listener [Log4j (org.slf4j.impl.Log4jLoggerFactory)]
   [junit4]   1> 2013-12-20 09:28:44,302 INFO  [SUITE-SolrCellMorphlineTest-seed#[62CD2BFB5E10AEC5]-worker] core.CoreContainer (CoreContainer.java:load(213)) - Host Name: 
   [junit4]   1> 2013-12-20 09:28:44,629 INFO  [coreLoadExecutor-3-thread-1] core.CoreContainer (CoreContainer.java:create(574)) - Creating SolrCore 'collection1' using instanceDir: C:\Users\JenkinsSlave\workspace\Lucene-Solr-trunk-Windows\solr\contrib\map-reduce\src\test-files\solr\collection1
   [junit4]   1> 2013-12-20 09:28:44,631 INFO  [coreLoadExecutor-3-thread-1] core.SolrResourceLoader (SolrResourceLoader.java:<init>(116)) - new SolrResourceLoader for directory: 'C:\Users\JenkinsSlave\workspace\Lucene-Solr-trunk-Windows\solr\contrib\map-reduce\src\test-files\solr\collection1\'
   [junit4]   1> 2013-12-20 09:28:44,769 INFO  [coreLoadExecutor-3-thread-1] core.SolrConfig (SolrConfig.java:initLibs(503)) - Adding specified lib dirs to ClassLoader
   [junit4]   1> 2013-12-20 09:28:44,770 WARN  [coreLoadExecutor-3-thread-1] core.SolrResourceLoader (SolrResourceLoader.java:addToClassLoader(170)) - Can't find (or read) directory to add to classloader: ../../../contrib/extraction/lib (resolved as: C:\Users\JenkinsSlave\workspace\Lucene-Solr-trunk-Windows\solr\contrib\map-reduce\src\test-files\solr\collection1\..\..\..\contrib\extraction\lib).
   [junit4]   1> 2013-12-20 09:28:44,772 WARN  [coreLoadExecutor-3-thread-1] core.SolrResourceLoader (SolrResourceLoader.java:addToClassLoader(170)) - Can't find (or read) directory to add to classloader: ../../../dist/ (resolved as: C:\Users\JenkinsSlave\workspace\Lucene-Solr-trunk-Windows\solr\contrib\map-reduce\src\test-files\solr\collection1\..\..\..\dist).
   [junit4]   1> 2013-12-20 09:28:44,772 WARN  [coreLoadExecutor-3-thread-1] core.SolrResourceLoader (SolrResourceLoader.java:addToClassLoader(170)) - Can't find (or read) directory to add to classloader: ../../../contrib/clustering/lib/ (resolved as: C:\Users\JenkinsSlave\workspace\Lucene-Solr-trunk-Windows\solr\contrib\map-reduce\src\test-files\solr\collection1\..\..\..\contrib\clustering\lib).
   [junit4]   1> 2013-12-20 09:28:44,773 WARN  [coreLoadExecutor-3-thread-1] core.SolrResourceLoader (SolrResourceLoader.java:addToClassLoader(170)) - Can't find (or read) directory to add to classloader: ../../../dist/ (resolved as: C:\Users\JenkinsSlave\workspace\Lucene-Solr-trunk-Windows\solr\contrib\map-reduce\src\test-files\solr\collection1\..\..\..\dist).
   [junit4]   1> 2013-12-20 09:28:44,774 WARN  [coreLoadExecutor-3-thread-1] core.SolrResourceLoader (SolrResourceLoader.java:addToClassLoader(170)) - Can't find (or read) directory to add to classloader: ../../../contrib/langid/lib/ (resolved as: C:\Users\JenkinsSlave\workspace\Lucene-Solr-trunk-Windows\solr\contrib\map-reduce\src\test-files\solr\collection1\..\..\..\contrib\langid\lib).
   [junit4]   1> 2013-12-20 09:28:44,775 WARN  [coreLoadExecutor-3-thread-1] core.SolrResourceLoader (SolrResourceLoader.java:addToClassLoader(170)) - Can't find (or read) directory to add to classloader: ../../../dist/ (resolved as: C:\Users\JenkinsSlave\workspace\Lucene-Solr-trunk-Windows\solr\contrib\map-reduce\src\test-files\solr\collection1\..\..\..\dist).
   [junit4]   1> 2013-12-20 09:28:44,776 WARN  [coreLoadExecutor-3-thread-1] core.SolrResourceLoader (SolrResourceLoader.java:addToClassLoader(170)) - Can't find (or read) directory to add to classloader: ../../../contrib/velocity/lib (resolved as: C:\Users\JenkinsSlave\workspace\Lucene-Solr-trunk-Windows\solr\contrib\map-reduce\src\test-files\solr\collection1\..\..\..\contrib\velocity\lib).
   [junit4]   1> 2013-12-20 09:28:44,777 WARN  [coreLoadExecutor-3-thread-1] core.SolrResourceLoader (SolrResourceLoader.java:addToClassLoader(170)) - Can't find (or read) directory to add to classloader: ../../../dist/ (resolved as: C:\Users\JenkinsSlave\workspace\Lucene-Solr-trunk-Windows\solr\contrib\map-reduce\src\test-files\solr\collection1\..\..\..\dist).
   [junit4]   1> 2013-12-20 09:28:44,777 WARN  [coreLoadExecutor-3-thread-1] core.SolrResourceLoader (SolrResourceLoader.java:addToClassLoader(170)) - Can't find (or read) directory to add to classloader: /non/existent/dir/yields/warning (resolved as: C:\Users\JenkinsSlave\workspace\Lucene-Solr-trunk-Windows\solr\contrib\map-reduce\src\test-files\solr\collection1\non\existent\dir\yields\warning).
   [junit4]   1> 2013-12-20 09:28:44,877 INFO  [coreLoadExecutor-3-thread-1] core.SolrConfig (SolrConfig.java:<init>(160)) - Using Lucene MatchVersion: LUCENE_43
   [junit4]   1> 2013-12-20 09:28:44,973 INFO  [coreLoadExecutor-3-thread-1] core.Config (SolrConfig.java:<init>(262)) - Loaded SolrConfig: C:\Users\JenkinsSlave\workspace\Lucene-Solr-trunk-Windows\solr/contrib/map-reduce/src/test-files/solr/collection1/conf/solrconfig.xml
   [junit4]   1> 2013-12-20 09:28:44,975 INFO  [coreLoadExecutor-3-thread-1] schema.IndexSchema (IndexSchema.java:readSchema(426)) - Reading Solr Schema from C:\Users\JenkinsSlave\workspace\Lucene-Solr-trunk-Windows\solr/contrib/map-reduce/src/test-files/solr/collection1/conf/schema.xml
   [junit4]   1> 2013-12-20 09:28:45,070 INFO  [coreLoadExecutor-3-thread-1] schema.IndexSchema (IndexSchema.java:readSchema(454)) - [collection1] Schema name=example
   [junit4]   1> 2013-12-20 09:28:45,999 INFO  [coreLoadExecutor-3-thread-1] schema.IndexSchema (IndexSchema.java:readSchema(552)) - unique key field: id
   [junit4]   1> 2013-12-20 09:28:46,047 INFO  [coreLoadExecutor-3-thread-1] schema.FileExchangeRateProvider (CurrencyField.java:reload(781)) - Reloading exchange rates from file currency.xml
   [junit4]   1> 2013-12-20 09:28:46,062 INFO  [coreLoadExecutor-3-thread-1] schema.FileExchangeRateProvider (CurrencyField.java:reload(781)) - Reloading exchange rates from file currency.xml
   [junit4]   1> 2013-12-20 09:28:46,358 INFO  [coreLoadExecutor-3-thread-1] core.SolrCore (SolrCore.java:initDirectoryFactory(440)) - org.apache.solr.core.MockDirectoryFactory
   [junit4]   1> 2013-12-20 09:28:46,402 INFO  [coreLoadExecutor-3-thread-1] core.SolrCore (SolrCore.java:<init>(690)) - [collection1] Opening new SolrCore at C:\Users\JenkinsSlave\workspace\Lucene-Solr-trunk-Windows\solr\contrib\map-reduce\src\test-files\solr\collection1\, dataDir=C:\Users\JenkinsSlave\workspace\Lucene-Solr-trunk-Windows\solr\build\contrib\solr-morphlines-cell\test\J0\.\solrtest-SolrCellMorphlineTest-1387531718805\
   [junit4]   1> 2013-12-20 09:28:46,407 INFO  [coreLoadExecutor-3-thread-1] core.JmxMonitoredMap (JmxMonitoredMap.java:<init>(85)) - No JMX servers found, not exposing Solr information with JMX.
   [junit4]   1> 2013-12-20 09:28:46,486 INFO  [coreLoadExecutor-3-thread-1] core.SolrCore (SolrCore.java:initListeners(355)) - [collection1] Added SolrEventListener for newSearcher: org.apache.solr.core.QuerySenderListener{queries=[]}
   [junit4]   1> 2013-12-20 09:28:46,487 INFO  [coreLoadExecutor-3-thread-1] core.SolrCore (SolrCore.java:initListeners(351)) - [collection1] Added SolrEventListener for firstSearcher: org.apache.solr.core.QuerySenderListener{queries=[{q=static firstSearcher warming in solrconfig.xml}]}
   [junit4]   1> 2013-12-20 09:28:46,587 INFO  [coreLoadExecutor-3-thread-1] core.CachingDirectoryFactory (CachingDirectoryFactory.java:get(360)) - return new directory for C:\Users\JenkinsSlave\workspace\Lucene-Solr-trunk-Windows\solr\build\contrib\solr-morphlines-cell\test\J0\.\solrtest-SolrCellMorphlineTest-1387531718805\
   [junit4]   1> 2013-12-20 09:28:46,588 INFO  [coreLoadExecutor-3-thread-1] core.SolrCore (SolrCore.java:getNewIndexDir(285)) - New index directory detected: old=null new=C:\Users\JenkinsSlave\workspace\Lucene-Solr-trunk-Windows\solr\build\contrib\solr-morphlines-cell\test\J0\.\solrtest-SolrCellMorphlineTest-1387531718805\index/
   [junit4]   1> 2013-12-20 09:28:46,588 WARN  [coreLoadExecutor-3-thread-1] core.SolrCore (SolrCore.java:initIndex(506)) - [collection1] Solr index directory 'C:\Users\JenkinsSlave\workspace\Lucene-Solr-trunk-Windows\solr\build\contrib\solr-morphlines-cell\test\J0\.\solrtest-SolrCellMorphlineTest-1387531718805\index' doesn't exist. Creating new index...
   [junit4]   1> 2013-12-20 09:28:46,604 INFO  [coreLoadExecutor-3-thread-1] core.CachingDirectoryFactory (CachingDirectoryFactory.java:get(360)) - return new directory for C:\Users\JenkinsSlave\workspace\Lucene-Solr-trunk-Windows\solr\build\contrib\solr-morphlines-cell\test\J0\.\solrtest-SolrCellMorphlineTest-1387531718805\index
   [junit4]   1> 2013-12-20 09:28:46,746 INFO  [coreLoadExecutor-3-thread-1] core.SolrCore (SolrDeletionPolicy.java:onCommit(98)) - SolrDeletionPolicy.onCommit: commits: num=1
   [junit4]   1> 	commit{dir=MockDirectoryWrapper(org.apache.lucene.store.RAMDirectory@5a61b819 lockFactory=org.apache.lucene.store.NativeFSLockFactory@2afd506),segFN=segments_1,generation=1}
   [junit4]   1> 2013-12-20 09:28:46,752 INFO  [coreLoadExecutor-3-thread-1] core.SolrCore (SolrDeletionPolicy.java:updateCommits(165)) - newest commit generation = 1
   [junit4]   1> 2013-12-20 09:28:46,821 INFO  [coreLoadExecutor-3-thread-1] core.SolrCore (SolrCore.java:initWriters(1995)) - created json: solr.JSONResponseWriter
   [junit4]   1> 2013-12-20 09:28:46,821 INFO  [coreLoadExecutor-3-thread-1] core.SolrCore (SolrCore.java:initWriters(1977)) - adding lazy queryResponseWriter: solr.VelocityResponseWriter
   [junit4]   1> 2013-12-20 09:28:46,825 INFO  [coreLoadExecutor-3-thread-1] core.SolrCore (SolrCore.java:initWriters(1995)) - created velocity: solr.VelocityResponseWriter
   [junit4]   1> 2013-12-20 09:28:46,958 INFO  [coreLoadExecutor-3-thread-1] core.SolrCore (SolrCore.java:initWriters(1995)) - created xslt: solr.XSLTResponseWriter
   [junit4]   1> 2013-12-20 09:28:46,959 INFO  [coreLoadExecutor-3-thread-1] response.XSLTResponseWriter (XSLTResponseWriter.java:init(63)) - xsltCacheLifetimeSeconds=5
   [junit4]   1> 2013-12-20 09:28:47,976 INFO  [coreLoadExecutor-3-thread-1] core.SolrCore (SolrCore.java:loadUpdateProcessorChains(925)) - no updateRequestProcessorChain defined as default, creating implicit default
   [junit4]   1> 2013-12-20 09:28:48,073 INFO  [coreLoadExecutor-3-thread-1] core.RequestHandlers (RequestHandlers.java:initHandlersFromConfig(165)) - created /select: solr.SearchHandler
   [junit4]   1> 2013-12-20 09:28:48,074 INFO  [coreLoadExecutor-3-thread-1] core.RequestHandlers (RequestHandlers.java:initHandlersFromConfig(165)) - created /query: solr.SearchHandler
   [junit4]   1> 2013-12-20 09:28:48,097 INFO  [coreLoadExecutor-3-thread-1] core.RequestHandlers (RequestHandlers.java:initHandlersFromConfig(165)) - created /get: solr.RealTimeGetHandler
   [junit4]   1> 2013-12-20 09:28:48,097 INFO  [coreLoadExecutor-3-thread-1] core.RequestHandlers (RequestHandlers.java:initHandlersFromConfig(165)) - created /browse: solr.SearchHandler
   [junit4]   1> 2013-12-20 09:28:48,133 INFO  [coreLoadExecutor-3-thread-1] core.RequestHandlers (RequestHandlers.java:initHandlersFromConfig(165)) - created /update: solr.UpdateRequestHandler
   [junit4]   1> 2013-12-20 09:28:48,157 WARN  [coreLoadExecutor-3-thread-1] core.SolrResourceLoader (SolrResourceLoader.java:findClass(486)) - Solr loaded a deprecated plugin/analysis class [solr.JsonUpdateRequestHandler]. Please consult documentation how to replace it accordingly.
   [junit4]   1> 2013-12-20 09:28:48,157 INFO  [coreLoadExecutor-3-thread-1] core.RequestHandlers (RequestHandlers.java:initHandlersFromConfig(165)) - created /update/json: solr.JsonUpdateRequestHandler
   [junit4]   1> 2013-12-20 09:28:48,182 WARN  [coreLoadExecutor-3-thread-1] core.SolrResourceLoader (SolrResourceLoader.java:findClass(486)) - Solr loaded a deprecated plugin/analysis class [solr.CSVRequestHandler]. Please consult documentation how to replace it accordingly.
   [junit4]   1> 2013-12-20 09:28:48,183 INFO  [coreLoadExecutor-3-thread-1] core.RequestHandlers (RequestHandlers.java:initHandlersFromConfig(165)) - created /update/csv: solr.CSVRequestHandler
   [junit4]   1> 2013-12-20 09:28:48,184 INFO  [coreLoadExecutor-3-thread-1] core.RequestHandlers (RequestHandlers.java:initHandlersFromConfig(147)) - adding lazy requestHandler: solr.FieldAnalysisRequestHandler
   [junit4]   1> 2013-12-20 09:28:48,188 INFO  [coreLoadExecutor-3-thread-1] core.RequestHandlers (RequestHandlers.java:initHandlersFromConfig(165)) - created /analysis/field: solr.FieldAnalysisRequestHandler
   [junit4]   1> 2013-12-20 09:28:48,188 INFO  [coreLoadExecutor-3-thread-1] core.RequestHandlers (RequestHandlers.java:initHandlersFromConfig(147)) - adding lazy requestHandler: solr.DocumentAnalysisRequestHandler
   [junit4]   1> 2013-12-20 09:28:48,188 INFO  [coreLoadExecutor-3-thread-1] core.RequestHandlers (RequestHandlers.java:initHandlersFromConfig(165)) - created /analysis/document: solr.DocumentAnalysisRequestHandler
   [junit4]   1> 2013-12-20 09:28:48,214 INFO  [coreLoadExecutor-3-thread-1] core.RequestHandlers (RequestHandlers.java:initHandlersFromConfig(165)) - created /admin/: solr.admin.AdminHandlers
   [junit4]   1> 2013-12-20 09:28:48,239 INFO  [coreLoadExecutor-3-thread-1] core.RequestHandlers (RequestHandlers.java:initHandlersFromConfig(165)) - created /admin/ping: solr.PingRequestHandler
   [junit4]   1> 2013-12-20 09:28:48,262 INFO  [coreLoadExecutor-3-thread-1] core.RequestHandlers (RequestHandlers.java:initHandlersFromConfig(165)) - created /debug/dump: solr.DumpRequestHandler
   [junit4]   1> 2013-12-20 09:28:48,308 INFO  [coreLoadExecutor-3-thread-1] core.RequestHandlers (RequestHandlers.java:initHandlersFromConfig(165)) - created /replication: solr.ReplicationHandler
   [junit4]   1> 2013-12-20 09:28:48,309 INFO  [coreLoadExecutor-3-thread-1] core.RequestHandlers (RequestHandlers.java:initHandlersFromConfig(147)) - adding lazy requestHandler: solr.SearchHandler
   [junit4]   1> 2013-12-20 09:28:48,309 INFO  [coreLoadExecutor-3-thread-1] core.RequestHandlers (RequestHandlers.java:initHandlersFromConfig(165)) - created /spell: solr.SearchHandler
   [junit4]   1> 2013-12-20 09:28:48,310 INFO  [coreLoadExecutor-3-thread-1] core.RequestHandlers (RequestHandlers.java:initHandlersFromConfig(147)) - adding lazy requestHandler: solr.SearchHandler
   [junit4]   1> 2013-12-20 09:28:48,310 INFO  [coreLoadExecutor-3-thread-1] core.RequestHandlers (RequestHandlers.java:initHandlersFromConfig(165)) - created /tvrh: solr.SearchHandler
   [junit4]   1> 2013-12-20 09:28:48,311 INFO  [coreLoadExecutor-3-thread-1] core.RequestHandlers (RequestHandlers.java:initHandlersFromConfig(147)) - adding lazy requestHandler: solr.SearchHandler
   [junit4]   1> 2013-12-20 09:28:48,311 INFO  [coreLoadExecutor-3-thread-1] core.RequestHandlers (RequestHandlers.java:initHandlersFromConfig(165)) - created /terms: solr.SearchHandler
   [junit4]   1> 2013-12-20 09:28:48,311 INFO  [coreLoadExecutor-3-thread-1] core.RequestHandlers (RequestHandlers.java:initHandlersFromConfig(147)) - adding lazy requestHandler: solr.SearchHandler
   [junit4]   1> 2013-12-20 09:28:48,311 INFO  [coreLoadExecutor-3-thread-1] core.RequestHandlers (RequestHandlers.java:initHandlersFromConfig(165)) - created /elevate: solr.SearchHandler
   [junit4]   1> 2013-12-20 09:28:48,430 INFO  [coreLoadExecutor-3-thread-1] loader.XMLLoader (XMLLoader.java:init(111)) - xsltCacheLifetimeSeconds=60
   [junit4]   1> 2013-12-20 09:28:48,450 INFO  [coreLoadExecutor-3-thread-1] loader.XMLLoader (XMLLoader.java:init(111)) - xsltCacheLifetimeSeconds=60
   [junit4]   1> 2013-12-20 09:28:48,452 INFO  [coreLoadExecutor-3-thread-1] loader.XMLLoader (XMLLoader.java:init(111)) - xsltCacheLifetimeSeconds=60
   [junit4]   1> 2013-12-20 09:28:48,551 INFO  [coreLoadExecutor-3-thread-1] core.SolrCore (CommitTracker.java:<init>(83)) - Hard AutoCommit: if uncommited for 60000ms; 
   [junit4]   1> 2013-12-20 09:28:48,551 INFO  [coreLoadExecutor-3-thread-1] core.SolrCore (CommitTracker.java:<init>(83)) - Soft AutoCommit: if uncommited for 1000ms; 
   [junit4]   1> 2013-12-20 09:28:48,559 INFO  [coreLoadExecutor-3-thread-1] core.SolrCore (SolrDeletionPolicy.java:onInit(85)) - SolrDeletionPolicy.onInit: commits: num=1
   [junit4]   1> 	commit{dir=MockDirectoryWrapper(org.apache.lucene.store.RAMDirectory@5a61b819 lockFactory=org.apache.lucene.store.NativeFSLockFactory@2afd506),segFN=segments_1,generation=1}
   [junit4]   1> 2013-12-20 09:28:48,560 INFO  [coreLoadExecutor-3-thread-1] core.SolrCore (SolrDeletionPolicy.java:updateCommits(165)) - newest commit generation = 1
   [junit4]   1> 2013-12-20 09:28:48,607 INFO  [coreLoadExecutor-3-thread-1] search.SolrIndexSearcher (SolrIndexSearcher.java:<init>(198)) - Opening Searcher@25eca408 main
   [junit4]   1> 2013-12-20 09:28:48,643 INFO  [coreLoadExecutor-3-thread-1] component.SpellCheckComponent (SpellCheckComponent.java:inform(619)) - Initializing spell checkers
   [junit4]   1> 2013-12-20 09:28:48,725 INFO  [coreLoadExecutor-3-thread-1] spelling.DirectSolrSpellChecker (DirectSolrSpellChecker.java:init(102)) - init: {name=default,field=name,classname=solr.DirectSolrSpellChecker,distanceMeasure=internal,accuracy=0.5,maxEdits=2,minPrefix=1,maxInspections=5,minQueryLength=4,maxQueryFrequency=0.01}
   [junit4]   1> 2013-12-20 09:28:48,804 INFO  [coreLoadExecutor-3-thread-1] component.SpellCheckComponent (SpellCheckComponent.java:inform(668)) - No queryConverter defined, using default converter
   [junit4]   1> 2013-12-20 09:28:48,819 INFO  [coreLoadExecutor-3-thread-1] component.QueryElevationComponent (QueryElevationComponent.java:inform(222)) - Loading QueryElevation from: C:\Users\JenkinsSlave\workspace\Lucene-Solr-trunk-Windows\solr\contrib\map-reduce\src\test-files\solr\collection1\conf\elevate.xml
   [junit4]   1> 2013-12-20 09:28:49,065 INFO  [coreLoadExecutor-3-thread-1] handler.ReplicationHandler (ReplicationHandler.java:inform(965)) - Commits will be reserved for  10000
   [junit4]   1> 2013-12-20 09:28:49,067 INFO  [searcherExecutor-4-thread-1] core.SolrCore (QuerySenderListener.java:newSearcher(44)) - QuerySenderListener sending requests to Searcher@25eca408 main{StandardDirectoryReader(segments_1:1:nrt)}
   [junit4]   1> 2013-12-20 09:28:49,072 INFO  [coreLoadExecutor-3-thread-1] core.CoreContainer (CoreContainer.java:registerCore(478)) - registering core: collection1
   [junit4]   1> 2013-12-20 09:28:49,146 INFO  [SUITE-SolrCellMorphlineTest-seed#[62CD2BFB5E10AEC5]-worker] solr.SolrTestCaseJ4 (SolrTestCaseJ4.java:initCore(473)) - ####initCore end
   [junit4]   2> Creating dataDir: C:\Users\JenkinsSlave\workspace\Lucene-Solr-trunk-Windows\solr\build\contrib\solr-morphlines-cell\test\J0\.\solrtest-SolrCellMorphlineTest-1387531718805
   [junit4]   1> 2013-12-20 09:28:49,222 INFO  [TEST-SolrCellMorphlineTest.testSolrCellDocumentTypes2-seed#[62CD2BFB5E10AEC5]] solr.SolrTestCaseJ4 (SolrTestCaseJ4.java:setUp(222)) - ###Starting testSolrCellDocumentTypes2
   [junit4]   1> 2013-12-20 09:28:49,486 INFO  [searcherExecutor-4-thread-1] core.SolrCore (SolrCore.java:execute(1879)) - [collection1] webapp=null path=null params={event=firstSearcher&distrib=false&q=static+firstSearcher+warming+in+solrconfig.xml} hits=0 status=0 QTime=399 
   [junit4]   1> 2013-12-20 09:28:49,493 INFO  [searcherExecutor-4-thread-1] core.SolrCore (QuerySenderListener.java:newSearcher(91)) - QuerySenderListener done.
   [junit4]   1> 2013-12-20 09:28:49,494 INFO  [searcherExecutor-4-thread-1] component.SpellCheckComponent (SpellCheckComponent.java:newSearcher(709)) - Loading spell index for spellchecker: default
   [junit4]   1> 2013-12-20 09:28:49,494 INFO  [searcherExecutor-4-thread-1] component.SpellCheckComponent (SpellCheckComponent.java:newSearcher(709)) - Loading spell index for spellchecker: wordbreak
   [junit4]   1> 2013-12-20 09:28:49,495 INFO  [searcherExecutor-4-thread-1] core.SolrCore (SolrCore.java:registerSearcher(1827)) - [collection1] Registered new searcher Searcher@25eca408 main{StandardDirectoryReader(segments_1:1:nrt)}
   [junit4]   1> 2013-12-20 09:28:50,049 INFO  [TEST-SolrCellMorphlineTest.testSolrCellDocumentTypes2-seed#[62CD2BFB5E10AEC5]] processor.LogUpdateProcessor (LogUpdateProcessorFactory.java:finish(198)) - [collection1] webapp=null path=/update params={} {deleteByQuery=*:* (-1454932471084744704)} 0 652
   [junit4]   1> 2013-12-20 09:28:50,055 INFO  [TEST-SolrCellMorphlineTest.testSolrCellDocumentTypes2-seed#[62CD2BFB5E10AEC5]] update.UpdateHandler (DirectUpdateHandler2.java:commit(521)) - start commit{,optimize=false,openSearcher=true,waitSearcher=true,expungeDeletes=false,softCommit=false,prepareCommit=false}
   [junit4]   1> 2013-12-20 09:28:50,055 INFO  [TEST-SolrCellMorphlineTest.testSolrCellDocumentTypes2-seed#[62CD2BFB5E10AEC5]] update.UpdateHandler (DirectUpdateHandler2.java:commit(561)) - No uncommitted changes. Skipping IW.commit.
   [junit4]   1> 2013-12-20 09:28:50,057 INFO  [TEST-SolrCellMorphlineTest.testSolrCellDocumentTypes2-seed#[62CD2BFB5E10AEC5]] search.SolrIndexSearcher (SolrIndexSearcher.java:<init>(198)) - Opening Searcher@52ae002e main
   [junit4]   1> 2013-12-20 09:28:50,063 INFO  [TEST-SolrCellMorphlineTest.testSolrCellDocumentTypes2-seed#[62CD2BFB5E10AEC5]] update.UpdateHandler (DirectUpdateHandler2.java:commit(612)) - end_commit_flush
   [junit4]   1> 2013-12-20 09:28:50,067 INFO  [searcherExecutor-4-thread-1] core.SolrCore (QuerySenderListener.java:newSearcher(44)) - QuerySenderListener sending requests to Searcher@52ae002e main{StandardDirectoryReader(segments_1:1:nrt)}
   [junit4]   1> 2013-12-20 09:28:50,067 INFO  [searcherExecutor-4-thread-1] core.SolrCore (QuerySenderListener.java:newSearcher(91)) - QuerySenderListener done.
   [junit4]   1> 2013-12-20 09:28:50,067 INFO  [searcherExecutor-4-thread-1] core.SolrCore (SolrCore.java:registerSearcher(1827)) - [collection1] Registered new searcher Searcher@52ae002e main{StandardDirectoryReader(segments_1:1:nrt)}
   [junit4]   1> 2013-12-20 09:28:50,070 INFO  [TEST-SolrCellMorphlineTest.testSolrCellDocumentTypes2-seed#[62CD2BFB5E10AEC5]] processor.LogUpdateProcessor (LogUpdateProcessorFactory.java:finish(198)) - [collection1] webapp=null path=/update params={commit=true&softCommit=false&waitSearcher=true} {commit=} 0 16
   [junit4]   1> 2013-12-20 09:28:50,825 INFO  [TEST-SolrCellMorphlineTest.testSolrCellDocumentTypes2-seed#[62CD2BFB5E10AEC5]] api.MorphlineContext (MorphlineContext.java:importCommandBuilders(75)) - Importing commands
   [junit4]   1> 2013-12-20 09:29:01,463 INFO  [TEST-SolrCellMorphlineTest.testSolrCellDocumentTypes2-seed#[62CD2BFB5E10AEC5]] solr.SolrTestCaseJ4 (SolrTestCaseJ4.java:tearDown(227)) - ###Ending testSolrCellDocumentTypes2
   [junit4]   2> NOTE: reproduce with: ant test  -Dtestcase=SolrCellMorphlineTest -Dtests.method=testSolrCellDocumentTypes2 -Dtests.seed=62CD2BFB5E10AEC5 -Dtests.slow=true -Dtests.locale=ar_EG -Dtests.timezone=Mideast/Riyadh87 -Dtests.file.encoding=UTF-8
   [junit4] ERROR   12.4s | SolrCellMorphlineTest.testSolrCellDocumentTypes2 <<<
   [junit4]    > Throwable #1: org.kitesdk.morphline.api.MorphlineCompilationException: Cannot instantiate command for command: [detectMimeType] with builder: org.kitesdk.morphline.tika.DetectMimeTypeBuilder near: {
   [junit4]    >     # C:\Users\JenkinsSlave\workspace\Lucene-Solr-trunk-Windows\solr\build\contrib\solr-morphlines-cell\test\J0\.\test-morphlines-1387531730071\test-morphlines\solrCellDocumentTypes.conf: 54
   [junit4]    >     "includeDefaultMimeTypes" : true,
   [junit4]    >     # C:\Users\JenkinsSlave\workspace\Lucene-Solr-trunk-Windows\solr\build\contrib\solr-morphlines-cell\test\J0\.\test-morphlines-1387531730071\test-morphlines\solrCellDocumentTypes.conf: 55
   [junit4]    >     "mimeTypesFiles" : [
   [junit4]    >         # C:\Users\JenkinsSlave\workspace\Lucene-Solr-trunk-Windows\solr\build\contrib\solr-morphlines-cell\test\J0\.\test-morphlines-1387531730071\test-morphlines\solrCellDocumentTypes.conf: 55
   [junit4]    >         "C:UsersJenkinsSlaveworkspaceLucene-Solr-trunk-Windowssolrbuildcontribsolr-morphlines-celltestJ0.test-morphlines-1387531730071/custom-mimetypes.xml"
   [junit4]    >     ]
   [junit4]    > }
   [junit4]    > 	at __randomizedtesting.SeedInfo.seed([62CD2BFB5E10AEC5:E94D901B59E63D3B]:0)
   [junit4]    > 	at org.kitesdk.morphline.tika.DetectMimeTypeBuilder.build(DetectMimeTypeBuilder.java:67)
   [junit4]    > 	at org.kitesdk.morphline.base.AbstractCommand.buildCommand(AbstractCommand.java:292)
   [junit4]    > 	at org.kitesdk.morphline.base.AbstractCommand.buildCommandChain(AbstractCommand.java:242)
   [junit4]    > 	at org.kitesdk.morphline.stdlib.Pipe.<init>(Pipe.java:45)
   [junit4]    > 	at org.kitesdk.morphline.stdlib.PipeBuilder.build(PipeBuilder.java:39)
   [junit4]    > 	at org.apache.solr.morphlines.solr.AbstractSolrMorphlineTestBase.createMorphline(AbstractSolrMorphlineTestBase.java:205)
   [junit4]    > 	at org.apache.solr.morphlines.cell.SolrCellMorphlineTest.testSolrCellDocumentTypes2(SolrCellMorphlineTest.java:200)
   [junit4]    > 	at java.lang.Thread.run(Thread.java:744)
   [junit4]    > Caused by: java.io.FileNotFoundException: C:UsersJenkinsSlaveworkspaceLucene-Solr-trunk-Windowssolrbuildcontribsolr-morphlines-celltestJ0.test-morphlines-1387531730071\custom-mimetypes.xml (The system cannot find the path specified)
   [junit4]    > 	at java.io.FileInputStream.open(Native Method)
   [junit4]    > 	at java.io.FileInputStream.<init>(FileInputStream.java:146)
   [junit4]    > 	at org.kitesdk.morphline.tika.DetectMimeTypeBuilder$DetectMimeType.<init>(DetectMimeTypeBuilder.java:101)
   [junit4]    > 	at org.kitesdk.morphline.tika.DetectMimeTypeBuilder.build(DetectMimeTypeBuilder.java:65)
   [junit4]    > 	... 46 more
   [junit4]   1> 2013-12-20 09:29:01,612 INFO  [TEST-SolrCellMorphlineTest.testSolrCellDocumentTypes-seed#[62CD2BFB5E10AEC5]] solr.SolrTestCaseJ4 (SolrTestCaseJ4.java:setUp(222)) - ###Starting testSolrCellDocumentTypes
   [junit4]   1> 2013-12-20 09:29:01,618 INFO  [TEST-SolrCellMorphlineTest.testSolrCellDocumentTypes-seed#[62CD2BFB5E10AEC5]] processor.LogUpdateProcessor (LogUpdateProcessorFactory.java:finish(198)) - [collection1] webapp=null path=/update params={} {deleteByQuery=*:* (-1454932483494641664)} 0 4
   [junit4]   1> 2013-12-20 09:29:01,620 INFO  [TEST-SolrCellMorphlineTest.testSolrCellDocumentTypes-seed#[62CD2BFB5E10AEC5]] update.UpdateHandler (DirectUpdateHandler2.java:commit(521)) - start commit{,optimize=false,openSearcher=true,waitSearcher=true,expungeDeletes=false,softCommit=false,prepareCommit=false}
   [junit4]   1> 2013-12-20 09:29:01,620 INFO  [TEST-SolrCellMorphlineTest.testSolrCellDocumentTypes-seed#[62CD2BFB5E10AEC5]] update.UpdateHandler (DirectUpdateHandler2.java:commit(561)) - No uncommitted changes. Skipping IW.commit.
   [junit4]   1> 2013-12-20 09:29:01,622 INFO  [TEST-SolrCellMorphlineTest.testSolrCellDocumentTypes-seed#[62CD2BFB5E10AEC5]] search.SolrIndexSearcher (SolrIndexSearcher.java:<init>(198)) - Opening Searcher@3fadb901 main
   [junit4]   1> 2013-12-20 09:29:01,623 INFO  [TEST-SolrCellMorphlineTest.testSolrCellDocumentTypes-seed#[62CD2BFB5E10AEC5]] update.UpdateHandler (DirectUpdateHandler2.java:commit(612)) - end_commit_flush
   [junit4]   1> 2013-12-20 09:29:01,623 INFO  [searcherExecutor-4-thread-1] core.SolrCore (QuerySenderListener.java:newSearcher(44)) - QuerySenderListener sending requests to Searcher@3fadb901 main{StandardDirectoryReader(segments_1:1:nrt)}
   [junit4]   1> 2013-12-20 09:29:01,625 INFO  [searcherExecutor-4-thread-1] core.SolrCore (QuerySenderListener.java:newSearcher(91)) - QuerySenderListener done.
   [junit4]   1> 2013-12-20 09:29:01,626 INFO  [searcherExecutor-4-thread-1] core.SolrCore (SolrCore.java:registerSearcher(1827)) - [collection1] Registered new searcher Searcher@3fadb901 main{StandardDirectoryReader(segments_1:1:nrt)}
   [junit4]   1> 2013-12-20 09:29:01,627 INFO  [TEST-SolrCellMorphlineTest.testSolrCellDocumentTypes-seed#[62CD2BFB5E10AEC5]] processor.LogUpdateProcessor (LogUpdateProcessorFactory.java:finish(198)) - [collection1] webapp=null path=/update params={commit=true&softCommit=false&waitSearcher=true} {commit=} 0 7
   [junit4]   1> 2013-12-20 09:29:01,688 INFO  [TEST-SolrCellMorphlineTest.testSolrCellDocumentTypes-seed#[62CD2BFB5E10AEC5]] api.MorphlineContext (MorphlineContext.java:importCommandBuilders(75)) - Importing commands
   [junit4]   1> 2013-12-20 09:29:04,245 INFO  [TEST-SolrCellMorphlineTest.testSolrCellDocumentTypes-seed#[62CD2BFB5E10AEC5]] solr.SolrTestCaseJ4 (SolrTestCaseJ4.java:tearDown(227)) - ###Ending testSolrCellDocumentTypes
   [junit4]   2> NOTE: reproduce with: ant test  -Dtestcase=SolrCellMorphlineTest -Dtests.method=testSolrCellDocumentTypes -Dtests.seed=62CD2BFB5E10AEC5 -Dtests.slow=true -Dtests.locale=ar_EG -Dtests.timezone=Mideast/Riyadh87 -Dtests.file.encoding=UTF-8
   [junit4] ERROR   2.66s | SolrCellMorphlineTest.testSolrCellDocumentTypes <<<
   [junit4]    > Throwable #1: org.kitesdk.morphline.api.MorphlineCompilationException: Cannot instantiate command for command: [detectMimeType] with builder: org.kitesdk.morphline.tika.DetectMimeTypeBuilder near: {
   [junit4]    >     # C:\Users\JenkinsSlave\workspace\Lucene-Solr-trunk-Windows\solr\build\contrib\solr-morphlines-cell\test\J0\.\test-morphlines-1387531741628\test-morphlines\solrCellDocumentTypes.conf: 54
   [junit4]    >     "includeDefaultMimeTypes" : true,
   [junit4]    >     # C:\Users\JenkinsSlave\workspace\Lucene-Solr-trunk-Windows\solr\build\contrib\solr-morphlines-cell\test\J0\.\test-morphlines-1387531741628\test-morphlines\solrCellDocumentTypes.conf: 55
   [junit4]    >     "mimeTypesFiles" : [
   [junit4]    >         # C:\Users\JenkinsSlave\workspace\Lucene-Solr-trunk-Windows\solr\build\contrib\solr-morphlines-cell\test\J0\.\test-morphlines-1387531741628\test-morphlines\solrCellDocumentTypes.conf: 55
   [junit4]    >         "C:UsersJenkinsSlaveworkspaceLucene-Solr-trunk-Windowssolrbuildcontribsolr-morphlines-celltestJ0.test-morphlines-1387531741628/custom-mimetypes.xml"
   [junit4]    >     ]
   [junit4]    > }
   [junit4]    > 	at __randomizedtesting.SeedInfo.seed([62CD2BFB5E10AEC5:F80E88653BCBF010]:0)
   [junit4]    > 	at org.kitesdk.morphline.tika.DetectMimeTypeBuilder.build(DetectMimeTypeBuilder.java:67)
   [junit4]    > 	at org.kitesdk.morphline.base.AbstractCommand.buildCommand(AbstractCommand.java:292)
   [junit4]    > 	at org.kitesdk.morphline.base.AbstractCommand.buildCommandChain(AbstractCommand.java:242)
   [junit4]    > 	at org.kitesdk.morphline.stdlib.Pipe.<init>(Pipe.java:45)
   [junit4]    > 	at org.kitesdk.morphline.stdlib.PipeBuilder.build(PipeBuilder.java:39)
   [junit4]    > 	at org.apache.solr.morphlines.solr.AbstractSolrMorphlineTestBase.createMorphline(AbstractSolrMorphlineTestBase.java:205)
   [junit4]    > 	at org.apache.solr.morphlines.cell.SolrCellMorphlineTest.testSolrCellDocumentTypes(SolrCellMorphlineTest.java:169)
   [junit4]    > 	at java.lang.Thread.run(Thread.java:744)
   [junit4]    > Caused by: java.io.FileNotFoundException: C:UsersJenkinsSlaveworkspaceLucene-Solr-trunk-Windowssolrbuildcontribsolr-morphlines-celltestJ0.test-morphlines-1387531741628\custom-mimetypes.xml (The system cannot find the path specified)
   [junit4]    > 	at java.io.FileInputStream.open(Native Method)
   [junit4]    > 	at java.io.FileInputStream.<init>(FileInputStream.java:146)
   [junit4]    > 	at org.kitesdk.morphline.tika.DetectMimeTypeBuilder$DetectMimeType.<init>(DetectMimeTypeBuilder.java:101)
   [junit4]    > 	at org.kitesdk.morphline.tika.DetectMimeTypeBuilder.build(DetectMimeTypeBuilder.java:65)
   [junit4]    > 	... 46 more
   [junit4]   1> 2013-12-20 09:29:04,281 INFO  [TEST-SolrCellMorphlineTest.testTransformValue-seed#[62CD2BFB5E10AEC5]] solr.SolrTestCaseJ4 (SolrTestCaseJ4.java:setUp(222)) - ###Starting testTransformValue
   [junit4]   1> 2013-12-20 09:29:04,287 INFO  [TEST-SolrCellMorphlineTest.testTransformValue-seed#[62CD2BFB5E10AEC5]] processor.LogUpdateProcessor (LogUpdateProcessorFactory.java:finish(198)) - [collection1] webapp=null path=/update params={} {deleteByQuery=*:* (-1454932486293291008)} 0 5
   [junit4]   1> 2013-12-20 09:29:04,288 INFO  [TEST-SolrCellMorphlineTest.testTransformValue-seed#[62CD2BFB5E10AEC5]] update.UpdateHandler (DirectUpdateHandler2.java:commit(521)) - start commit{,optimize=false,openSearcher=true,waitSearcher=true,expungeDeletes=false,softCommit=false,prepareCommit=false}
   [junit4]   1> 2013-12-20 09:29:04,288 INFO  [TEST-SolrCellMorphlineTest.testTransformValue-seed#[62CD2BFB5E10AEC5]] update.UpdateHandler (DirectUpdateHandler2.java:commit(561)) - No uncommitted changes. Skipping IW.commit.
   [junit4]   1> 2013-12-20 09:29:04,288 INFO  [TEST-SolrCellMorphlineTest.testTransformValue-seed#[62CD2BFB5E10AEC5]] search.SolrIndexSearcher (SolrIndexSearcher.java:<init>(198)) - Opening Searcher@35915368 main
   [junit4]   1> 2013-12-20 09:29:04,292 INFO  [TEST-SolrCellMorphlineTest.testTransformValue-seed#[62CD2BFB5E10AEC5]] update.UpdateHandler (DirectUpdateHandler2.java:commit(612)) - end_commit_flush
   [junit4]   1> 2013-12-20 09:29:04,292 INFO  [searcherExecutor-4-thread-1] core.SolrCore (QuerySenderListener.java:newSearcher(44)) - QuerySenderListener sending requests to Searcher@35915368 main{StandardDirectoryReader(segments_1:1:nrt)}
   [junit4]   1> 2013-12-20 09:29:04,293 INFO  [searcherExecutor-4-thread-1] core.SolrCore (QuerySenderListener.java:newSearcher(91)) - QuerySenderListener done.
   [junit4]   1> 2013-12-20 09:29:04,294 INFO  [searcherExecutor-4-thread-1] core.SolrCore (SolrCore.java:registerSearcher(1827)) - [collection1] Registered new searcher Searcher@35915368 main{StandardDirectoryReader(segments_1:1:nrt)}
   [junit4]   1> 2013-12-20 09:29:04,294 INFO  [TEST-SolrCellMorphlineTest.testTransformValue-seed#[62CD2BFB5E10AEC5]] processor.LogUpdateProcessor (LogUpdateProcessorFactory.java:finish(198)) - [collection1] webapp=null path=/update params={commit=true&softCommit=false&waitSearcher=true} {commit=} 0 6
   [junit4]   1> 2013-12-20 09:29:04,379 INFO  [TEST-SolrCellMorphlineTest.testTransformValue-seed#[62CD2BFB5E10AEC5]] solr.SolrTestCaseJ4 (SolrTestCaseJ4.java:tearDown(227)) - ###Ending testTransformValue
   [junit4]   1> 2013-12-20 09:29:04,405 INFO  [TEST-SolrCellMorphlineTest.testSolrCellJPGCompressed-seed#[62CD2BFB5E10AEC5]] solr.SolrTestCaseJ4 (SolrTestCaseJ4.java:setUp(222)) - ###Starting testSolrCellJPGCompressed
   [junit4]   1> 2013-12-20 09:29:04,408 INFO  [TEST-SolrCellMorphlineTest.testSolrCellJPGCompressed-seed#[62CD2BFB5E10AEC5]] processor.LogUpdateProcessor (LogUpdateProcessorFactory.java:finish(198)) - [collection1] webapp=null path=/update params={} {deleteByQuery=*:* (-1454932486422265856)} 0 2
   [junit4]   1> 2013-12-20 09:29:04,409 INFO  [TEST-SolrCellMorphlineTest.testSolrCellJPGCompressed-seed#[62CD2BFB5E10AEC5]] update.UpdateHandler (DirectUpdateHandler2.java:commit(521)) - start commit{,optimize=false,openSearcher=true,waitSearcher=true,expungeDeletes=false,softCommit=false,prepareCommit=false}
   [junit4]   1> 2013-12-20 09:29:04,410 INFO  [TEST-SolrCellMorphlineTest.testSolrCellJPGCompressed-seed#[62CD2BFB5E10AEC5]] update.UpdateHandler (DirectUpdateHandler2.java:commit(561)) - No uncommitted changes. Skipping IW.commit.
   [junit4]   1> 2013-12-20 09:29:04,410 INFO  [TEST-SolrCellMorphlineTest.testSolrCellJPGCompressed-seed#[62CD2BFB5E10AEC5]] search.SolrIndexSearcher (SolrIndexSearcher.java:<init>(198)) - Opening Searcher@360e2cfb main
   [junit4]   1> 2013-12-20 09:29:04,411 INFO  [TEST-SolrCellMorphlineTest.testSolrCellJPGCompressed-seed#[62CD2BFB5E10AEC5]] update.UpdateHandler (DirectUpdateHandler2.java:commit(612)) - end_commit_flush
   [junit4]   1> 2013-12-20 09:29:04,411 INFO  [searcherExecutor-4-thread-1] core.SolrCore (QuerySenderListener.java:newSearcher(44)) - QuerySenderListener sending requests to Searcher@360e2cfb main{StandardDirectoryReader(segments_1:1:nrt)}
   [junit4]   1> 2013-12-20 09:29:04,413 INFO  [searcherExecutor-4-thread-1] core.SolrCore (QuerySenderListener.java:newSearcher(91)) - QuerySenderListener done.
   [junit4]   1> 2013-12-20 09:29:04,413 INFO  [searcherExecutor-4-thread-1] core.SolrCore (SolrCore.java:registerSearcher(1827)) - [collection1] Registered new searcher Searcher@360e2cfb main{StandardDirectoryReader(segments_1:1:nrt)}
   [junit4]   1> 2013-12-20 09:29:04,415 INFO  [TEST-SolrCellMorphlineTest.testSolrCellJPGCompressed-seed#[62CD2BFB5E10AEC5]] processor.LogUpdateProcessor (LogUpdateProcessorFactory.java:finish(198)) - [collection1] webapp=null path=/update params={commit=true&softCommit=false&waitSearcher=true} {commit=} 0 6
   [junit4]   1> 2013-12-20 09:29:04,436 INFO  [TEST-SolrCellMorphlineTest.testSolrCellJPGCompressed-seed#[62CD2BFB5E10AEC5]] api.MorphlineContext (MorphlineContext.java:importCommandBuilders(75)) - Importing commands
   [junit4]   1> 2013-12-20 09:29:07,318 INFO  [TEST-SolrCellMorphlineTest.testSolrCellJPGCompressed-seed#[62CD2BFB5E10AEC5]] core.SolrResourceLoader (SolrResourceLoader.java:<init>(116)) - new SolrResourceLoader for directory: 'C:\Users\JenkinsSlave\workspace\Lucene-Solr-trunk-Windows\solr/contrib/map-reduce/src/test-files/solr/collection1\'
   [junit4]   1> 2013-12-20 09:29:07,438 INFO  [TEST-SolrCellMorphlineTest.testSolrCellJPGCompressed-seed#[62CD2BFB5E10AEC5]] core.SolrConfig (SolrConfig.java:initLibs(503)) - Adding specified lib dirs to ClassLoader
   [junit4]   1> 2013-12-20 09:29:07,441 WARN  [TEST-SolrCellMorphlineTest.testSolrCellJPGCompressed-seed#[62CD2BFB5E10AEC5]] core.SolrResourceLoader (SolrResourceLoader.java:addToClassLoader(170)) - Can't find (or read) directory to add to classloader: ../../../contrib/extraction/lib (resolved as: C:\Users\JenkinsSlave\workspace\Lucene-Solr-trunk-Windows\solr\contrib\map-reduce\src\test-files\solr\collection1\..\..\..\contrib\extraction\lib).
   [junit4]   1> 2013-12-20 09:29:07,443 WARN  [TEST-SolrCellMorphlineTest.testSolrCellJPGCompressed-seed#[62CD2BFB5E10AEC5]] core.SolrResourceLoader (SolrResourceLoader.java:addToClassLoader(170)) - Can't find (or read) directory to add to classloader: ../../../dist/ (resolved as: C:\Users\JenkinsSlave\workspace\Lucene-Solr-trunk-Windows\solr\contrib\map-reduce\src\test-files\solr\collection1\..\..\..\dist).
   [junit4]   1> 2013-12-20 09:29:07,445 WARN  [TEST-SolrCellMorphlineTest.testSolrCellJPGCompressed-seed#[62CD2BFB5E10AEC5]] core.SolrResourceLoader (SolrResourceLoader.java:addToClassLoader(170)) - Can't find (or read) directory to add to classloader: ../../../contrib/clustering/lib/ (resolved as: C:\Users\JenkinsSlave\workspace\Lucene-Solr-trunk-Windows\solr\contrib\map-reduce\src\test-files\solr\collection1\..\..\..\contrib\clustering\lib).
   [junit4]   1> 2013-12-20 09:29:07,448 WARN  [TEST-SolrCellMorphlineTest.testSolrCellJPGCompressed-seed#[62CD2BFB5E10AEC5]] core.SolrResourceLoader (SolrResourceLoader.java:addToClassLoader(170)) - Can't find (or read) directory to add to classloader: ../../../dist/ (resolved as: C:\Users\JenkinsSlave\workspace\Lucene-Solr-trunk-Windows\solr\contrib\map-reduce\src\test-files\solr\collection1\..\..\..\dist).
   [junit4]   1> 2013-12-20 09:29:07,448 WARN  [TEST-SolrCellMorphlineTest.testSolrCellJPGCompressed-seed#[62CD2BFB5E10AEC5]] core.SolrResourceLoader (SolrResourceLoader.java:addToClassLoader(170)) - Can't find (or read) directory to add to classloader: ../../../contrib/langid/lib/ (resolved as: C:\Users\JenkinsSlave\workspace\Lucene-Solr-trunk-Windows\solr\contrib\map-reduce\src\test-files\solr\collection1\..\..\..\contrib\langid\lib).
   [junit4]   1> 2013-12-20 09:29:07,448 WARN  [TEST-SolrCellMorphlineTest.testSolrCellJPGCompressed-seed#[62CD2BFB5E10AEC5]] core.SolrResourceLoader (SolrResourceLoader.java:addToClassLoader(170)) - Can't find (or read) directory to add to classloader: ../../../dist/ (resolved as: C:\Users\JenkinsSlave\workspace\Lucene-Solr-trunk-Windows\solr\contrib\map-reduce\src\test-files\solr\collection1\..\..\..\dist).
   [junit4]   1> 2013-12-20 09:29:07,452 WARN  [TEST-SolrCellMorphlineTest.testSolrCellJPGCompressed-seed#[62CD2BFB5E10AEC5]] core.SolrResourceLoader (SolrResourceLoader.java:addToClassLoader(170)) - Can't find (or read) directory to add to classloader: ../../../contrib/velocity/lib (resolved as: C:\Users\JenkinsSlave\workspace\Lucene-Solr-trunk-Windows\solr\contrib\map-reduce\src\test-files\solr\collection1\..\..\..\contrib\velocity\lib).
   [junit4]   1> 2013-12-20 09:29:07,452 WARN  [TEST-SolrCellMorphlineTest.testSolrCellJPGCompressed-seed#[62CD2BFB5E10AEC5]] core.SolrResourceLoader (SolrResourceLoader.java:addToClassLoader(170)) - Can't find (or read) directory to add to classloader: ../../../dist/ (resolved as: C:\Users\JenkinsSlave\workspace\Lucene-Solr-trunk-Windows\solr\contrib\map-reduce\src\test-files\solr\collection1\..\..\..\dist).
   [junit4]   1> 2013-12-20 09:29:07,455 WARN  [TEST-SolrCellMorphlineTest.testSolrCellJPGCompressed-seed#[62CD2BFB5E10AEC5]] core.SolrResourceLoader (SolrResourceLoader.java:addToClassLoader(170)) - Can't find (or read) directory to add to classloader: /non/existent/dir/yields/warning (resolved as: C:\Users\JenkinsSlave\workspace\Lucene-Solr-trunk-Windows\solr\contrib\map-reduce\src\test-files\solr\collection1\non\existent\dir\yields\warning).
   [junit4]   1> 2013-12-20 09:29:07,538 INFO  [TEST-SolrCellMorphlineTest.testSolrCellJPGCompressed-seed#[62CD2BFB5E10AEC5]] core.SolrConfig (SolrConfig.java:<init>(160)) - Using Lucene MatchVersion: LUCENE_43
   [junit4]   1> 2013-12-20 09:29:07,867 INFO  [TEST-SolrCellMorphlineTest.testSolrCellJPGCompressed-seed#[62CD2BFB5E10AEC5]] core.Config (SolrConfig.java:<init>(262)) - Loaded SolrConfig: solrconfig.xml
   [junit4]   1> 2013-12-20 09:29:07,869 INFO  [TEST-SolrCellMorphlineTest.testSolrCellJPGCompressed-seed#[62CD2BFB5E10AEC5]] schema.IndexSchema (IndexSchema.java:readSchema(426)) - Reading Solr Schema from schema.xml
   [junit4]   1> 2013-12-20 09:29:08,224 INFO  [TEST-SolrCellMorphlineTest.testSolrCellJPGCompressed-seed#[62CD2BFB5E10AEC5]] schema.IndexSchema (IndexSchema.java:readSchema(454)) - [null] Schema name=example
   [junit4]   1> 2013-12-20 09:29:09,286 INFO  [TEST-SolrCellMorphlineTest.testSolrCellJPGCompressed-seed#[62CD2BFB5E10AEC5]] schema.IndexSchema (IndexSchema.java:readSchema(552)) - unique key field: id
   [junit4]   1> 2013-12-20 09:29:09,323 INFO  [TEST-SolrCellMorphlineTest.testSolrCellJPGCompressed-seed#[62CD2BFB5E10AEC5]] schema.FileExchangeRateProvider (CurrencyField.java:reload(781)) - Reloading exchange rates from file currency.xml
   [junit4]   1> 2013-12-20 09:29:09,334 INFO  [TEST-SolrCellMorphlineTest.testSolrCellJPGCompressed-seed#[62CD2BFB5E10AEC5]] schema.FileExchangeRateProvider (CurrencyField.java:reload(781)) - Reloading exchange rates from file currency.xml
   [junit4]   1> 2013-12-20 09:29:09,677 INFO  [TEST-SolrCellMorphlineTest.testSolrCellJPGCompressed-seed#[62CD2BFB5E10AEC5]] core.SolrResourceLoader (SolrResourceLoader.java:<init>(116)) - new SolrResourceLoader for directory: 'C:\Users\JenkinsSlave\workspace\Lucene-Solr-trunk-Windows\solr/contrib/map-reduce/src/test-files/solr/collection1\'
   [junit4]   1> 2013-12-20 09:29:09,827 INFO  [TEST-SolrCellMorphlineTest.testSolrCellJPGCompressed-seed#[62CD2BFB5E10AEC5]] core.SolrConfig (SolrConfig.java:initLibs(503)) - Adding specified lib dirs to ClassLoader
   [junit4]   1> 2013-12-20 09:29:09,830 WARN  [TEST-SolrCellMorphlineTest.testSolrCellJPGCompressed-seed#[62CD2BFB5E10AEC5]] core.SolrResourceLoader (SolrResourceLoader.java:addToClassLoader(170)) - Can't find (or read) directory to add to classloader: ../../../contrib/extraction/lib (resolved as: C:\Users\JenkinsSlave\workspace\Lucene-Solr-trunk-Windows\solr\contrib\map-reduce\src\test-files\solr\collection1\..\..\..\contrib\extraction\lib).
   [junit4]   1> 2013-12-20 09:29:09,832 WARN  [TEST-SolrCellMorphlineTest.testSolrCellJPGCompressed-seed#[62CD2BFB5E10AEC5]] core.SolrResourceLoader (SolrResourceLoader.java:addToClassLoader(170)) - Can't find (or read) directory to add to classloader: ../../../dist/ (resolved as: C:\Users\JenkinsSlave\workspace\Lucene-Solr-trunk-Windows\solr\contrib\map-reduce\src\test-files\solr\collection1\..\..\..\dist).
   [junit4]   1> 2013-12-20 09:29:09,833 WARN  [TEST-SolrCellMorphlineTest.testSolrCellJPGCompressed-seed#[62CD2BFB5E10AEC5]] core.SolrResourceLoader (SolrResourceLoader.java:addToClassLoader(170)) - Can't find (or read) directory to add to classloader: ../../../contrib/clustering/lib/ (resolved as: C:\Users\JenkinsSlave\workspace\Lucene-Solr-trunk-Windows\solr\contrib\map-reduce\src\test-files\solr\collection1\..\..\..\contrib\clustering\lib).
   [junit4]   1> 2013-12-20 09:29:09,833 WARN  [TEST-SolrCellMorphlineTest.testSolrCellJPGCompressed-seed#[62CD2BFB5E10AEC5]] core.SolrResourceLoader (SolrResourceLoader.java:addToClassLoader(170)) - Can't find (or read) directory to add to classloader: ../../../dist/ (resolved as: C:\Users\JenkinsSlave\workspace\Lucene-Solr-trunk-Windows\solr\contrib\map-reduce\src\test-files\solr\collection1\..\..\..\dist).
   [junit4]   1> 2013-12-20 09:29:09,836 WARN  [TEST-SolrCellMorphlineTest.testSolrCellJPGCompressed-seed#[62CD2BFB5E10AEC5]] core.SolrResourceLoader (SolrResourceLoader.java:addToClassLoader(170)) - Can't find (or read) directory to add to classloader: ../../../contrib/langid/lib/ (resolved as: C:\Users\JenkinsSlave\workspace\Lucene-Solr-trunk-Windows\solr\contrib\map-reduce\src\test-files\solr\collection1\..\..\..\contrib\langid\lib).
   [junit4]   1> 2013-12-20 09:29:09,836 WARN  [TEST-SolrCellMorphlineTest.testSolrCellJPGCompressed-seed#[62CD2BFB5E10AEC5]] core.SolrResourceLoader (SolrResourceLoader.java:addToClassLoader(170)) - Can't find (or read) directory to add to classloader: ../../../dist/ (resolved as: C:\Users\JenkinsSlave\workspace\Lucene-Solr-trunk-Windows\solr\contrib\map-reduce\src\test-files\solr\collection1\..\..\..\dist).
   [junit4]   1> 2013-12-20 09:29:09,840 WARN  [TEST-SolrCellMorphlineTest.testSolrCellJPGCompressed-seed#[62CD2BFB5E10AEC5]] core.SolrResourceLoader (SolrResourceLoader.java:addToClassLoader(170)) - Can't find (or read) directory to add to classloader: ../../../contrib/velocity/lib (resolved as: C:\Users\JenkinsSlave\workspace\Lucene-Solr-trunk-Windows\solr\contrib\map-reduce\src\test-files\solr\collection1\..\..\..\contrib\velocity\lib).
   [junit4]   1> 2013-12-20 09:29:09,840 WARN  [TEST-SolrCellMorphlineTest.testSolrCellJPGCompressed-seed#[62CD2BFB5E10AEC5]] core.SolrResourceLoader (SolrResourceLoader.java:addToClassLoader(170)) - Can't find (or read) directory to add to classloader: ../../../dist/ (resolved as: C:\Users\JenkinsSlave\workspace\Lucene-Solr-trunk-Windows\solr\contrib\map-reduce\src\test-files\solr\collection1\..\..\..\dist).
   [junit4]   1> 2013-12-20 09:29:09,840 WARN  [TEST-SolrCellMorphlineTest.testSolrCellJPGCompressed-seed#[62CD2BFB5E10AEC5]] core.SolrResourceLoader (SolrResourceLoader.java:addToClassLoader(170)) - Can't find (or read) directory to add to classloader: /non/existent/dir/yields/warning (resolved as: C:\Users\JenkinsSlave\workspace\Lucene-Solr-trunk-Windows\solr\contrib\map-reduce\src\test-files\solr\collection1\non\existent\dir\yields\warning).
   [junit4]   1> 2013-12-20 09:29:09,938 INFO  [TEST-SolrCellMorphlineTest.testSolrCellJPGCompressed-seed#[62CD2BFB5E10AEC5]] core.SolrConfig (SolrConfig.java:<init>(160)) - Using Lucene MatchVersion: LUCENE_43
   [junit4]   1> 2013-12-20 09:29:10,079 INFO  [TEST-SolrCellMorphlineTest.testSolrCellJPGCompressed-seed#[62CD2BFB5E10AEC5]] core.Config (SolrConfig.java:<init>(262)) - Loaded SolrConfig: solrconfig.xml
   [junit4]   1> 2013-12-20 09:29:10,081 INFO  [TEST-SolrCellMorphlineTest.testSolrCellJPGCompressed-seed#[62CD2BFB5E10AEC5]] schema.IndexSchema (IndexSchema.java:readSchema(426)) - Reading Solr Schema from schema.xml
   [junit4]   1> 2013-12-20 09:29:10,152 INFO  [TEST-SolrCellMorphlineTest.testSolrCellJPGCompressed-seed#[62CD2BFB5E10AEC5]] schema.IndexSchema (IndexSchema.java:readSchema(454)) - [null] Schema name=example
   [junit4]   1> 2013-12-20 09:29:11,044 INFO  [TEST-SolrCellMorphlineTest.testSolrCellJPGCompressed-seed#[62CD2BFB5E10AEC5]] schema.IndexSchema (IndexSchema.java:readSchema(552)) - unique key field: id
   [junit4]   1> 2013-12-20 09:29:11,083 INFO  [TEST-SolrCellMorphlineTest.testSolrCellJPGCompressed-seed#[62CD2BFB5E10AEC5]] schema.FileExchangeRateProvider (CurrencyField.java:reload(781)) - Reloading exchange rates from file currency.xml
   [junit4]   1> 2013-12-20 09:29:11,094 INFO  [TEST-SolrCellMorphlineTest.testSolrCellJPGCompressed-seed#[62CD2BFB5E10AEC5]] schema.FileExchangeRateProvider (CurrencyField.java:reload(781)) - Reloading exchange rates from file currency.xml
   [junit4]   1> 2013-12-20 09:29:11,268 INFO  [TEST-SolrCellMorphlineTest.testSolrCellJPGCompressed-seed#[62CD2BFB5E10AEC5]] processor.LogUpdateProcessor (LogUpdateProcessorFactory.java:finish(198)) - [collection1] webapp=null path=/update params={} {deleteByQuery=*:* (-1454932493615497216)} 0 2
   [junit4]   1> 2013-12-20 09:29:11,269 INFO  [TEST-SolrCellMorphlineTest.testSolrCellJPGCompressed-seed#[62CD2BFB5E10AEC5]] update.UpdateHandler (DirectUpdateHandler2.java:commit(521)) - start commit{,optimize=false,openSearcher=true,waitSearcher=true,expungeDeletes=false,softCommit=false,prepareCommit=false}
   [junit4]   1> 2013-12-20 09:29:11,271 INFO  [TEST-SolrCellMorphlineTest.testSolrCellJPGCompressed-seed#[62CD2BFB5E10AEC5]] update.UpdateHandler (DirectUpdateHandler2.java:commit(561)) - No uncommitted changes. Skipping IW.commit.
   [junit4]   1> 2013-12-20 09:29:11,272 INFO  [TEST-SolrCellMorphlineTest.testSolrCellJPGCompressed-seed#[62CD2BFB5E10AEC5]] search.SolrIndexSearcher (SolrIndexSearcher.java:<init>(198)) - Opening Searcher@f68f20d main
   [junit4]   1> 2013-12-20 09:29:11,273 INFO  [TEST-SolrCellMorphlineTest.testSolrCellJPGCompressed-seed#[62CD2BFB5E10AEC5]] update.UpdateHandler (DirectUpdateHandler2.java:commit(612)) - end_commit_flush
   [junit4]   1> 2013-12-20 09:29:11,273 INFO  [searcherExecutor-4-thread-1] core.SolrCore (QuerySenderListener.java:newSearcher(44)) - QuerySenderListener sending requests to Searcher@f68f20d main{StandardDirectoryReader(segments_1:1:nrt)}
   [junit4]   1> 2013-12-20 09:29:11,273 INFO  [searcherExecutor-4-thread-1] core.SolrCore (QuerySenderListener.java:newSearcher(91)) - QuerySenderListener done.
   [junit4]   1> 2013-12-20 09:29:11,273 INFO  [searcherExecutor-4-thread-1] core.SolrCore (SolrCore.java:registerSearcher(1827)) - [collection1] Registered new searcher Searcher@f68f20d main{StandardDirectoryReader(segments_1:1:nrt)}
   [junit4]   1> 2013-12-20 09:29:11,275 INFO  [TEST-SolrCellMorphlineTest.testSolrCellJPGCompressed-seed#[62CD2BFB5E10AEC5]] processor.LogUpdateProcessor (LogUpdateProcessorFactory.java:finish(198)) - [collection1] webapp=null path=/update params={commit=true&softCommit=false&waitSearcher=true} {commit=} 0 6
   [junit4]   1> 2013-12-20 09:29:12,502 INFO  [TEST-SolrCellMorphlineTest.testSolrCellJPGCompressed-seed#[62CD2BFB5E10AEC5]] processor.LogUpdateProcessor (LogUpdateProcessorFactory.java:finish(198)) - [collection1] webapp=null path=/update params={} {add=[testJPEG_EXIF.jpg#0 (1454932494613741568)]} 0 290
   [junit4]   1> 2013-12-20 09:29:12,503 INFO  [TEST-SolrCellMorphlineTest.testSolrCellJPGCompressed-seed#[62CD2BFB5E10AEC5]] update.UpdateHandler (DirectUpdateHandler2.java:commit(521)) - start commit{,optimize=false,openSearcher=true,waitSearcher=true,expungeDeletes=false,softCommit=true,prepareCommit=false}
   [junit4]   1> 2013-12-20 09:29:12,846 INFO  [TEST-SolrCellMorphlineTest.testSolrCellJPGCompressed-seed#[62CD2BFB5E10AEC5]] search.SolrIndexSearcher (SolrIndexSearcher.java:<init>(198)) - Opening Searcher@30dbcecf main
   [junit4]   1> 2013-12-20 09:29:12,848 INFO  [TEST-SolrCellMorphlineTest.testSolrCellJPGCompressed-seed#[62CD2BFB5E10AEC5]] update.UpdateHandler (DirectUpdateHandler2.java:commit(612)) - end_commit_flush
   [junit4]   1> 2013-12-20 09:29:12,848 INFO  [searcherExecutor-4-thread-1] core.SolrCore (QuerySenderListener.java:newSearcher(44)) - QuerySenderListener sending requests to Searcher@30dbcecf main{StandardDirectoryReader(segments_1:3:nrt _0(5.0):C1)}
   [junit4]   1> 2013-12-20 09:29:12,849 INFO  [searcherExecutor-4-thread-1] core.SolrCore (QuerySenderListener.java:newSearcher(91)) - QuerySenderListener done.
   [junit4]   1> 2013-12-20 09:29:12,850 INFO  [searcherExecutor-4-thread-1] core.SolrCore (SolrCore.java:registerSearcher(1827)) - [collection1] Registered new searcher Searcher@30dbcecf main{StandardDirectoryReader(segments_1:3:nrt _0(5.0):C1)}
   [junit4]   1> 2013-12-20 09:29:12,850 INFO  [TEST-SolrCellMorphlineTest.testSolrCellJPGCompressed-seed#[62CD2BFB5E10AEC5]] processor.LogUpdateProcessor (LogUpdateProcessorFactory.java:finish(198)) - [collection1] webapp=null path=/update params={commit=true&softCommit=true&waitSearcher=true} {commit=} 0 347
   [junit4]   1> 2013-12-20 09:29:12,901 INFO  [TEST-SolrCellMorphlineTest.testSolrCellJPGCompressed-seed#[62CD2BFB5E10AEC5]] core.SolrCore (SolrCore.java:execute(1879)) - [collection1] webapp=null path=/select params={q=*%3A*&rows=2147483647} hits=1 status=0 QTime=39 
   [junit4]   1> 2013-12-20 09:29:13,018 INFO  [TEST-SolrCellMorphlineTest.testSolrCellJPGCompressed-seed#[62CD2BFB5E10AEC5]] processor.LogUpdateProcessor (LogUpdateProcessorFactory.java:finish(198)) - [collection1] webapp=null path=/update params={} {add=[testJPEG_EXIF.jpg.gz#0 (1454932495448408064)]} 0 10
   [junit4]   1> 2013-12-20 09:29:13,020 INFO  [TEST-SolrCellMorphlineTest.testSolrCellJPGCompressed-seed#[62CD2BFB5E10AEC5]] update.UpdateHandler (DirectUpdateHandler2.java:commit(521)) - start commit{,optimize=false,openSearcher=true,waitSearcher=true,expungeDeletes=false,softCommit=true,prepareCommit=false}
   [junit4]   1> 2013-12-20 09:29:13,117 INFO  [TEST-SolrCellMorphlineTest.testSolrCellJPGCompressed-seed#[62CD2BFB5E10AEC5]] search.SolrIndexSearcher (SolrIndexSearcher.java:<init>(198)) - Opening Searcher@1ecd4f54 main
   [junit4]   1> 2013-12-20 09:29:13,120 INFO  [TEST-SolrCellMorphlineTest.testSolrCellJPGCompressed-seed#[62CD2BFB5E10AEC5]] update.UpdateHandler (DirectUpdateHandler2.java:commit(612)) - end_commit_flush
   [junit4]   1> 2013-12-20 09:29:13,120 INFO  [searcherExecutor-4-thread-1] core.SolrCore (QuerySenderListener.java:newSearcher(44)) - QuerySenderListener sending requests to Searcher@1ecd4f54 main{StandardDirectoryReader(segments_1:5:nrt _0(5.0):C1 _1(5.0):C1)}
   [junit4]   1> 2013-12-20 09:29:13,122 INFO  [searcherExecutor-4-thread-1] core.SolrCore (QuerySenderListener.java:newSearcher(91)) - QuerySenderListener done.
   [junit4]   1> 2013-12-20 09:29:13,122 INFO  [searcherExecutor-4-thread-1] core.SolrCore (SolrCore.java:registerSearcher(1827)) - [collection1] Registered new searcher Searcher@1ecd4f54 main{StandardDirectoryReader(segments_1:5:nrt _0(5.0):C1 _1(5.0):C1)}
   [junit4]   1> 2013-12-20 09:29:13,124 INFO  [TEST-SolrCellMorphlineTest.testSolrCellJPGCompressed-seed#[62CD2BFB5E10AEC5]] processor.LogUpdateProcessor (LogUpdateProcessorFactory.java:finish(198)) - [collection1] webapp=null path=/update params={commit=true&softCommit=true&waitSearcher=true} {commit=} 0 104
   [junit4]   1> 2013-12-20 09:29:13,125 INFO  [TEST-SolrCellMorphlineTest.testSolrCellJPGCompressed-seed#[62CD2BFB5E10AEC5]] core.SolrCore (SolrCore.java:execute(1879)) - [collection1] webapp=null path=/select params={q=*%3A*&rows=2147483647} hits=2 status=0 QTime=0 
   [junit4]   1> 2013-12-20 09:29:13,171 INFO  [TEST-SolrCellMorphlineTest.testSolrCellJPGCompressed-seed#[62CD2BFB5E10AEC5]] processor.LogUpdateProcessor (LogUpdateProcessorFactory.java:finish(198)) - [collection1] webapp=null path=/update params={} {add=[768be29f-3a80-48d5-a03d-26aff09a64b5#0 (1454932495610937344)]} 0 6
   [junit4]   1> 2013-12-20 09:29:13,173 INFO  [TEST-SolrCellMorphlineTest.testSolrCellJPGCompressed-seed#[62CD2BFB5E10AEC5]] update.UpdateHandler (DirectUpdateHandler2.java:commit(521)) - start commit{,optimize=false,openSearcher=true,waitSearcher=true,expungeDeletes=false,softCommit=true,prepareCommit=false}
   [junit4]   1> 2013-12-20 09:29:13,180 INFO  [TEST-SolrCellMorphlineTest.testSolrCellJPGCompressed-seed#[62CD2BFB5E10AEC5]] search.SolrIndexSearcher (SolrIndexSearcher.java:<init>(198)) - Opening Searcher@4415eed8 main
   [junit4]   1> 2013-12-20 09:29:13,181 INFO  [TEST-SolrCellMorphlineTest.testSolrCellJPGCompressed-seed#[62CD2BFB5E10AEC5]] update.UpdateHandler (DirectUpdateHandler2.java:commit(612)) - end_commit_flush
   [junit4]   1> 2013-12-20 09:29:13,181 INFO  [searcherExecutor-4-thread-1] core.SolrCore (QuerySenderListener.java:newSearcher(44)) - QuerySenderListener sending requests to Searcher@4415eed8 main{StandardDirectoryReader(segments_1:7:nrt _0(5.0):C1 _1(5.0):C1 _2(5.0):C1)}
   [junit4]   1> 2013-12-20 09:29:13,181 INFO  [searcherExecutor-4-thread-1] core.SolrCore (QuerySenderListener.java:newSearcher(91)) - QuerySenderListener done.
   [junit4]   1> 2013-12-20 09:29:13,181 INFO  [searcherExecutor-4-thread-1] core.SolrCore (SolrCore.java:registerSearcher(1827)) - [collection1] Registered new searcher Searcher@4415eed8 main{StandardDirectoryReader(segments_1:7:nrt _0(5.0):C1 _1(5.0):C1 _2(5.0):C1)}
   [junit4]   1> 2013-12-20 09:29:13,183 INFO  [TEST-SolrCellMorphlineTest.testSolrCellJPGCompressed-seed#[62CD2BFB5E10AEC5]] processor.LogUpdateProcessor (LogUpdateProcessorFactory.java:finish(198)) - [collection1] webapp=null path=/update params={commit=true&softCommit=true&waitSearcher=true} {commit=} 0 10
   [junit4]   1> 2013-12-20 09:29:13,185 INFO  [TEST-SolrCellMorphlineTest.testSolrCellJPGCompressed-seed#[62CD2BFB5E10AEC5]] core.SolrCore (SolrCore.java:execute(1879)) - [collection1] webapp=null path=/select params={q=*%3A*&rows=2147483647} hits=3 status=0 QTime=0 
   [junit4]   1> 2013-12-20 09:29:13,187 INFO  [TEST-SolrCellMorphlineTest.testSolrCellJPGCompressed-seed#[62CD2BFB5E10AEC5]] update.UpdateHandler (DirectUpdateHandler2.java:commit(521)) - start commit{,optimize=false,openSearcher=true,waitSearcher=true,expungeDeletes=false,softCommit=true,prepareCommit=false}
   [junit4]   1> 2013-12-20 09:29:13,187 INFO  [TEST-SolrCellMorphlineTest.testSolrCellJPGCompressed-seed#[62CD2BFB5E10AEC5]] search.SolrIndexSearcher (SolrIndexSearcher.java:<init>(198)) - Opening Searcher@62eabb86 main
   [junit4]   1> 2013-12-20 09:29:13,188 INFO  [TEST-SolrCellMorphlineTest.testSolrCellJPGCompressed-seed#[62CD2BFB5E10AEC5]] update.UpdateHandler (DirectUpdateHandler2.java:commit(612)) - end_commit_flush
   [junit4]   1> 2013-12-20 09:29:13,188 INFO  [searcherExecutor-4-thread-1] core.SolrCore (QuerySenderListener.java:newSearcher(44)) - QuerySenderListener sending requests to Searcher@62eabb86 main{StandardDirectoryReader(segments_1:7:nrt _0(5.0):C1 _1(5.0):C1 _2(5.0):C1)}
   [junit4]   1> 2013-12-20 09:29:13,189 INFO  [searcherExecutor-4-thread-1] core.SolrCore (QuerySenderListener.java:newSearcher(91)) - QuerySenderListener done.
   [junit4]   1> 2013-12-20 09:29:13,189 INFO  [searcherExecutor-4-thread-1] core.SolrCore (SolrCore.java:registerSearcher(1827)) - [collection1] Registered new searcher Searcher@62eabb86 main{StandardDirectoryReader(segments_1:7:nrt _0(5.0):C1 _1(5.0):C1 _2(5.0):C1)}
   [junit4]   1> 2013-12-20 09:29:13,191 INFO  [TEST-SolrCellMorphlineTest.testSolrCellJPGCompressed-seed#[62CD2BFB5E10AEC5]] processor.LogUpdateProcessor (LogUpdateProcessorFactory.java:finish(198)) - [collection1] webapp=null path=/update params={commit=true&softCommit=true&waitSearcher=true} {commit=} 0 5
   [junit4]   1> 2013-12-20 09:29:13,192 INFO  [TEST-SolrCellMorphlineTest.testSolrCellJPGCompressed-seed#[62CD2BFB5E10AEC5]] core.SolrCore (SolrCore.java:execute(1879)) - [collection1] webapp=null path=/select params={q=*%3A*&rows=2147483647} hits=3 status=0 QTime=1 
   [junit4]   1> 2013-12-20 09:29:13,193 INFO  [TEST-SolrCellMorphlineTest.testSolrCellJPGCompressed-seed#[62CD2BFB5E10AEC5]] solr.SolrTestCaseJ4 (SolrTestCaseJ4.java:tearDown(227)) - ###Ending testSolrCellJPGCompressed
   [junit4]   1> 2013-12-20 09:29:13,207 INFO  [TEST-SolrCellMorphlineTest.testSolrCellXML-seed#[62CD2BFB5E10AEC5]] solr.SolrTestCaseJ4 (SolrTestCaseJ4.java:setUp(222)) - ###Starting testSolrCellXML
   [junit4]   1> 2013-12-20 09:29:13,342 INFO  [TEST-SolrCellMorphlineTest.testSolrCellXML-seed#[62CD2BFB5E10AEC5]] search.SolrIndexSearcher (SolrIndexSearcher.java:<init>(198)) - Opening Searcher@28a6a735 realtime
   [junit4]   1> 2013-12-20 09:29:13,346 INFO  [TEST-SolrCellMorphlineTest.testSolrCellXML-seed#[62CD2BFB5E10AEC5]] processor.LogUpdateProcessor (LogUpdateProcessorFactory.java:finish(198)) - [collection1] webapp=null path=/update params={} {deleteByQuery=*:* (-1454932495653928960)} 0 139
   [junit4]   1> 2013-12-20 09:29:13,348 INFO  [TEST-SolrCellMorphlineTest.testSolrCellXML-seed#[62CD2BFB5E10AEC5]] update.UpdateHandler (DirectUpdateHandler2.java:commit(521)) - start commit{,optimize=false,openSearcher=true,waitSearcher=true,expungeDeletes=false,softCommit=false,prepareCommit=false}
   [junit4]   1> 2013-12-20 09:29:13,353 INFO  [TEST-SolrCellMorphlineTest.testSolrCellXML-seed#[62CD2BFB5E10AEC5]] core.SolrCore (SolrDeletionPolicy.java:onCommit(98)) - SolrDeletionPolicy.onCommit: commits: num=2
   [junit4]   1> 	commit{dir=MockDirectoryWrapper(org.apache.lucene.store.RAMDirectory@5a61b819 lockFactory=org.apache.lucene.store.NativeFSLockFactory@2afd506),segFN=segments_1,generation=1}
   [junit4]   1> 	commit{dir=MockDirectoryWrapper(org.apache.lucene.store.RAMDirectory@5a61b819 lockFactory=org.apache.lucene.store.NativeFSLockFactory@2afd506),segFN=segments_2,generation=2}
   [junit4]   1> 2013-12-20 09:29:13,353 INFO  [TEST-SolrCellMorphlineTest.testSolrCellXML-seed#[62CD2BFB5E10AEC5]] core.SolrCore (SolrDeletionPolicy.java:updateCommits(165)) - newest commit generation = 2
   [junit4]   1> 2013-12-20 09:29:13,356 INFO  [TEST-SolrCellMorphlineTest.testSolrCellXML-seed#[62CD2BFB5E10AEC5]] search.SolrIndexSearcher (SolrIndexSearcher.java:<init>(198)) - Opening Searcher@484bedfb main
   [junit4]   1> 2013-12-20 09:29:13,356 INFO  [TEST-SolrCellMorphlineTest.testSolrCellXML-seed#[62CD2BFB5E10AEC5]] update.UpdateHandler (DirectUpdateHandler2.java:commit(612)) - end_commit_flush
   [junit4]   1> 2013-12-20 09:29:13,356 INFO  [searcherExecutor-4-thread-1] core.SolrCore (QuerySenderListener.java:newSearcher(44)) - QuerySenderListener sending requests to Searcher@484bedfb main{StandardDirectoryReader(segments_1:9:nrt)}
   [junit4]   1> 2013-12-20 09:29:13,358 INFO  [searcherExecutor-4-thread-1] core.SolrCore (QuerySenderListener.java:newSearcher(91)) - QuerySenderListener done.
   [junit4]   1> 2013-12-20 09:29:13,358 INFO  [searcherExecutor-4-thread-1] core.SolrCore (SolrCore.java:registerSearcher(1827)) - [collection1] Registered new searcher Searcher@484bedfb main{StandardDirectoryReader(segments_1:9:nrt)}
   [junit4]   1> 2013-12-20 09:29:13,369 INFO  [TEST-SolrCellMorphlineTest.testSolrCellXML-seed#[62CD2BFB5E10AEC5]] processor.LogUpdateProcessor (LogUpdateProcessorFactory.java:finish(198)) - [collection1] webapp=null path=/update params={commit=true&softCommit=false&waitSearcher=true} {commit=} 0 22
   [junit4]   1> 2013-12-20 09:29:13,393 INFO  [TEST-SolrCellMorphlineTest.testSolrCellXML-seed#[62CD2BFB5E10AEC5]] api.MorphlineContext (MorphlineContext.java:importCommandBuilders(75)) - Importing commands
   [junit4]   1> 2013-12-20 09:29:14,599 INFO  [TEST-SolrCellMorphlineTest.testSolrCellXML-seed#[62CD2BFB5E10AEC5]] core.SolrResourceLoader (SolrResourceLoader.java:<init>(116)) - new SolrResourceLoader for directory: 'C:\Users\JenkinsSlave\workspace\Lucene-Solr-trunk-Windows\solr/contrib/map-reduce/src/test-files/solr/collection1\'
   [junit4]   1> 2013-12-20 09:29:14,723 INFO  [TEST-SolrCellMorphlineTest.testSolrCellXML-seed#[62CD2BFB5E10AEC5]] core.SolrConfig (SolrConfig.java:initLibs(503)) - Adding specified lib dirs to ClassLoader
   [junit4]   1> 2013-12-20 09:29:14,725 

[...truncated too long message...]

ead-1] core.SolrCore (QuerySenderListener.java:newSearcher(91)) - QuerySenderListener done.
   [junit4]   1> 2013-12-20 09:29:18,733 INFO  [searcherExecutor-4-thread-1] core.SolrCore (SolrCore.java:registerSearcher(1827)) - [collection1] Registered new searcher Searcher@69839ff8 main{StandardDirectoryReader(segments_2:11:nrt _3(5.0):C1)}
   [junit4]   1> 2013-12-20 09:29:18,734 INFO  [TEST-SolrCellMorphlineTest.testSolrCellXML-seed#[62CD2BFB5E10AEC5]] processor.LogUpdateProcessor (LogUpdateProcessorFactory.java:finish(198)) - [collection1] webapp=null path=/update params={commit=true&softCommit=true&waitSearcher=true} {commit=} 0 10
   [junit4]   1> 2013-12-20 09:29:18,735 INFO  [TEST-SolrCellMorphlineTest.testSolrCellXML-seed#[62CD2BFB5E10AEC5]] core.SolrCore (SolrCore.java:execute(1879)) - [collection1] webapp=null path=/select params={q=*%3A*&rows=2147483647} hits=1 status=0 QTime=0 
   [junit4]   1> 2013-12-20 09:29:18,736 INFO  [TEST-SolrCellMorphlineTest.testSolrCellXML-seed#[62CD2BFB5E10AEC5]] update.UpdateHandler (DirectUpdateHandler2.java:commit(521)) - start commit{,optimize=false,openSearcher=true,waitSearcher=true,expungeDeletes=false,softCommit=true,prepareCommit=false}
   [junit4]   1> 2013-12-20 09:29:18,736 INFO  [TEST-SolrCellMorphlineTest.testSolrCellXML-seed#[62CD2BFB5E10AEC5]] search.SolrIndexSearcher (SolrIndexSearcher.java:<init>(198)) - Opening Searcher@a0f59dd main
   [junit4]   1> 2013-12-20 09:29:18,737 INFO  [TEST-SolrCellMorphlineTest.testSolrCellXML-seed#[62CD2BFB5E10AEC5]] update.UpdateHandler (DirectUpdateHandler2.java:commit(612)) - end_commit_flush
   [junit4]   1> 2013-12-20 09:29:18,738 INFO  [searcherExecutor-4-thread-1] core.SolrCore (QuerySenderListener.java:newSearcher(44)) - QuerySenderListener sending requests to Searcher@a0f59dd main{StandardDirectoryReader(segments_2:11:nrt _3(5.0):C1)}
   [junit4]   1> 2013-12-20 09:29:18,739 INFO  [searcherExecutor-4-thread-1] core.SolrCore (QuerySenderListener.java:newSearcher(91)) - QuerySenderListener done.
   [junit4]   1> 2013-12-20 09:29:18,739 INFO  [searcherExecutor-4-thread-1] core.SolrCore (SolrCore.java:registerSearcher(1827)) - [collection1] Registered new searcher Searcher@a0f59dd main{StandardDirectoryReader(segments_2:11:nrt _3(5.0):C1)}
   [junit4]   1> 2013-12-20 09:29:18,740 INFO  [TEST-SolrCellMorphlineTest.testSolrCellXML-seed#[62CD2BFB5E10AEC5]] processor.LogUpdateProcessor (LogUpdateProcessorFactory.java:finish(198)) - [collection1] webapp=null path=/update params={commit=true&softCommit=true&waitSearcher=true} {commit=} 0 5
   [junit4]   1> 2013-12-20 09:29:18,741 INFO  [TEST-SolrCellMorphlineTest.testSolrCellXML-seed#[62CD2BFB5E10AEC5]] core.SolrCore (SolrCore.java:execute(1879)) - [collection1] webapp=null path=/select params={q=*%3A*&rows=2147483647} hits=1 status=0 QTime=0 
   [junit4]   1> 2013-12-20 09:29:18,741 INFO  [TEST-SolrCellMorphlineTest.testSolrCellXML-seed#[62CD2BFB5E10AEC5]] solr.SolrTestCaseJ4 (SolrTestCaseJ4.java:tearDown(227)) - ###Ending testSolrCellXML
   [junit4]   1> 2013-12-20 09:29:18,747 INFO  [SUITE-SolrCellMorphlineTest-seed#[62CD2BFB5E10AEC5]-worker] solr.SolrTestCaseJ4 (SolrTestCaseJ4.java:deleteCore(543)) - ###deleteCore
   [junit4]   1> 2013-12-20 09:29:18,748 INFO  [SUITE-SolrCellMorphlineTest-seed#[62CD2BFB5E10AEC5]-worker] core.CoreContainer (CoreContainer.java:shutdown(343)) - Shutting down CoreContainer instance=1580955370
   [junit4]   1> 2013-12-20 09:29:18,749 INFO  [SUITE-SolrCellMorphlineTest-seed#[62CD2BFB5E10AEC5]-worker] core.SolrCore (SolrCore.java:close(997)) - [collection1]  CLOSING SolrCore org.apache.solr.core.SolrCore@6001169d
   [junit4]   1> 2013-12-20 09:29:18,749 INFO  [SUITE-SolrCellMorphlineTest-seed#[62CD2BFB5E10AEC5]-worker] update.UpdateHandler (DirectUpdateHandler2.java:close(687)) - closing DirectUpdateHandler2{commits=13,autocommit maxTime=60000ms,autocommits=0,soft autocommit maxTime=1000ms,soft autocommits=0,optimizes=0,rollbacks=0,expungeDeletes=0,docsPending=1,adds=0,deletesById=0,deletesByQuery=0,errors=0,cumulative_adds=4,cumulative_deletesById=0,cumulative_deletesByQuery=7,cumulative_errors=0,transaction_logs_total_size=8096,transaction_logs_total_number=7}
   [junit4]   1> 2013-12-20 09:29:18,752 INFO  [SUITE-SolrCellMorphlineTest-seed#[62CD2BFB5E10AEC5]-worker] update.SolrCoreState (SolrCoreState.java:decrefSolrCoreState(71)) - Closing SolrCoreState
   [junit4]   1> 2013-12-20 09:29:18,754 INFO  [SUITE-SolrCellMorphlineTest-seed#[62CD2BFB5E10AEC5]-worker] update.DefaultSolrCoreState (DefaultSolrCoreState.java:closeIndexWriter(65)) - SolrCoreState ref count has reached 0 - closing IndexWriter
   [junit4]   1> 2013-12-20 09:29:18,754 INFO  [SUITE-SolrCellMorphlineTest-seed#[62CD2BFB5E10AEC5]-worker] update.DefaultSolrCoreState (DefaultSolrCoreState.java:closeIndexWriter(67)) - closing IndexWriter with IndexWriterCloser
   [junit4]   1> 2013-12-20 09:29:18,755 INFO  [SUITE-SolrCellMorphlineTest-seed#[62CD2BFB5E10AEC5]-worker] core.SolrCore (SolrDeletionPolicy.java:onCommit(98)) - SolrDeletionPolicy.onCommit: commits: num=2
   [junit4]   1> 	commit{dir=MockDirectoryWrapper(org.apache.lucene.store.RAMDirectory@5a61b819 lockFactory=org.apache.lucene.store.NativeFSLockFactory@2afd506),segFN=segments_2,generation=2}
   [junit4]   1> 	commit{dir=MockDirectoryWrapper(org.apache.lucene.store.RAMDirectory@5a61b819 lockFactory=org.apache.lucene.store.NativeFSLockFactory@2afd506),segFN=segments_3,generation=3}
   [junit4]   1> 2013-12-20 09:29:18,755 INFO  [SUITE-SolrCellMorphlineTest-seed#[62CD2BFB5E10AEC5]-worker] core.SolrCore (SolrDeletionPolicy.java:updateCommits(165)) - newest commit generation = 3
   [junit4]   1> 2013-12-20 09:29:18,761 INFO  [SUITE-SolrCellMorphlineTest-seed#[62CD2BFB5E10AEC5]-worker] core.SolrCore (SolrCore.java:closeSearcher(1844)) - [collection1] Closing main searcher on request.
   [junit4]   1> 2013-12-20 09:29:18,761 INFO  [SUITE-SolrCellMorphlineTest-seed#[62CD2BFB5E10AEC5]-worker] core.CachingDirectoryFactory (CachingDirectoryFactory.java:close(168)) - Closing MockDirectoryFactory - 2 directories currently being tracked
   [junit4]   1> 2013-12-20 09:29:18,763 INFO  [SUITE-SolrCellMorphlineTest-seed#[62CD2BFB5E10AEC5]-worker] core.CachingDirectoryFactory (CachingDirectoryFactory.java:closeCacheValue(235)) - looking to close C:\Users\JenkinsSlave\workspace\Lucene-Solr-trunk-Windows\solr\build\contrib\solr-morphlines-cell\test\J0\.\solrtest-SolrCellMorphlineTest-1387531718805\index [CachedDir<<refCount=0;path=C:\Users\JenkinsSlave\workspace\Lucene-Solr-trunk-Windows\solr\build\contrib\solr-morphlines-cell\test\J0\.\solrtest-SolrCellMorphlineTest-1387531718805\index;done=false>>]
   [junit4]   1> 2013-12-20 09:29:18,763 INFO  [SUITE-SolrCellMorphlineTest-seed#[62CD2BFB5E10AEC5]-worker] core.CachingDirectoryFactory (CachingDirectoryFactory.java:close(304)) - Closing directory: C:\Users\JenkinsSlave\workspace\Lucene-Solr-trunk-Windows\solr\build\contrib\solr-morphlines-cell\test\J0\.\solrtest-SolrCellMorphlineTest-1387531718805\index
   [junit4]   1> 2013-12-20 09:29:18,763 INFO  [SUITE-SolrCellMorphlineTest-seed#[62CD2BFB5E10AEC5]-worker] core.CachingDirectoryFactory (CachingDirectoryFactory.java:closeCacheValue(235)) - looking to close C:\Users\JenkinsSlave\workspace\Lucene-Solr-trunk-Windows\solr\build\contrib\solr-morphlines-cell\test\J0\.\solrtest-SolrCellMorphlineTest-1387531718805\ [CachedDir<<refCount=0;path=C:\Users\JenkinsSlave\workspace\Lucene-Solr-trunk-Windows\solr\build\contrib\solr-morphlines-cell\test\J0\.\solrtest-SolrCellMorphlineTest-1387531718805\;done=false>>]
   [junit4]   1> 2013-12-20 09:29:18,763 INFO  [SUITE-SolrCellMorphlineTest-seed#[62CD2BFB5E10AEC5]-worker] core.CachingDirectoryFactory (CachingDirectoryFactory.java:close(304)) - Closing directory: C:\Users\JenkinsSlave\workspace\Lucene-Solr-trunk-Windows\solr\build\contrib\solr-morphlines-cell\test\J0\.\solrtest-SolrCellMorphlineTest-1387531718805\
   [junit4]   2> NOTE: test params are: codec=Lucene46: {}, docValues:{}, sim=RandomSimilarityProvider(queryNorm=false,coord=no): {}, locale=ar_EG, timezone=Mideast/Riyadh87
   [junit4]   2> NOTE: Windows 7 6.1 amd64/Oracle Corporation 1.7.0_60-ea (64-bit)/cpus=2,threads=1,free=82415984,total=138575872
   [junit4]   2> NOTE: All tests run in this JVM: [SolrCellMorphlineTest]
   [junit4] Completed in 42.13s, 5 tests, 2 errors <<< FAILURES!

[...truncated 10 lines...]
BUILD FAILED
C:\Users\JenkinsSlave\workspace\Lucene-Solr-trunk-Windows\build.xml:453: The following error occurred while executing this line:
C:\Users\JenkinsSlave\workspace\Lucene-Solr-trunk-Windows\build.xml:433: The following error occurred while executing this line:
C:\Users\JenkinsSlave\workspace\Lucene-Solr-trunk-Windows\build.xml:39: The following error occurred while executing this line:
C:\Users\JenkinsSlave\workspace\Lucene-Solr-trunk-Windows\extra-targets.xml:37: The following error occurred while executing this line:
C:\Users\JenkinsSlave\workspace\Lucene-Solr-trunk-Windows\solr\build.xml:209: The following error occurred while executing this line:
C:\Users\JenkinsSlave\workspace\Lucene-Solr-trunk-Windows\solr\common-build.xml:441: The following error occurred while executing this line:
C:\Users\JenkinsSlave\workspace\Lucene-Solr-trunk-Windows\solr\common-build.xml:491: The following error occurred while executing this line:
C:\Users\JenkinsSlave\workspace\Lucene-Solr-trunk-Windows\lucene\common-build.xml:1304: The following error occurred while executing this line:
C:\Users\JenkinsSlave\workspace\Lucene-Solr-trunk-Windows\lucene\common-build.xml:937: There were test failures: 1 suite, 5 tests, 2 errors

Total time: 95 minutes 3 seconds
Build step 'Invoke Ant' marked build as failure
Description set: Java: 64bit/jdk1.7.0_60-ea-b01 -XX:-UseCompressedOops -XX:+UseSerialGC
Archiving artifacts
Recording test results
Email was triggered for: Failure
Sending email for trigger: Failure



Mime
View raw message