lucene-dev mailing list archives

Site index · List index
Message view « Date » · « Thread »
Top « Date » · « Thread »
From Apache Jenkins Server <jenk...@builds.apache.org>
Subject [JENKINS] Lucene-Solr-NightlyTests-trunk - Build # 455 - Failure
Date Sun, 01 Dec 2013 19:48:10 GMT
Build: https://builds.apache.org/job/Lucene-Solr-NightlyTests-trunk/455/

2 tests failed.
REGRESSION:  org.apache.solr.cloud.ChaosMonkeyNothingIsSafeTest.testDistribSearch

Error Message:
shard2 is not consistent.  Got 148 from http://127.0.0.1:23467/collection1lastClient and got 146 from http://127.0.0.1:54578/collection1

Stack Trace:
java.lang.AssertionError: shard2 is not consistent.  Got 148 from http://127.0.0.1:23467/collection1lastClient and got 146 from http://127.0.0.1:54578/collection1
	at __randomizedtesting.SeedInfo.seed([362813F11CB09D89:B7CE9DE96BEFFDB5]:0)
	at org.junit.Assert.fail(Assert.java:93)
	at org.apache.solr.cloud.AbstractFullDistribZkTestBase.checkShardConsistency(AbstractFullDistribZkTestBase.java:1152)
	at org.apache.solr.cloud.ChaosMonkeyNothingIsSafeTest.doTest(ChaosMonkeyNothingIsSafeTest.java:208)
	at org.apache.solr.BaseDistributedSearchTestCase.testDistribSearch(BaseDistributedSearchTestCase.java:843)
	at sun.reflect.NativeMethodAccessorImpl.invoke0(Native Method)
	at sun.reflect.NativeMethodAccessorImpl.invoke(NativeMethodAccessorImpl.java:57)
	at sun.reflect.DelegatingMethodAccessorImpl.invoke(DelegatingMethodAccessorImpl.java:43)
	at java.lang.reflect.Method.invoke(Method.java:606)
	at com.carrotsearch.randomizedtesting.RandomizedRunner.invoke(RandomizedRunner.java:1559)
	at com.carrotsearch.randomizedtesting.RandomizedRunner.access$600(RandomizedRunner.java:79)
	at com.carrotsearch.randomizedtesting.RandomizedRunner$6.evaluate(RandomizedRunner.java:737)
	at com.carrotsearch.randomizedtesting.RandomizedRunner$7.evaluate(RandomizedRunner.java:773)
	at com.carrotsearch.randomizedtesting.RandomizedRunner$8.evaluate(RandomizedRunner.java:787)
	at com.carrotsearch.randomizedtesting.rules.SystemPropertiesRestoreRule$1.evaluate(SystemPropertiesRestoreRule.java:53)
	at org.apache.lucene.util.TestRuleSetupTeardownChained$1.evaluate(TestRuleSetupTeardownChained.java:50)
	at org.apache.lucene.util.TestRuleFieldCacheSanity$1.evaluate(TestRuleFieldCacheSanity.java:51)
	at org.apache.lucene.util.AbstractBeforeAfterRule$1.evaluate(AbstractBeforeAfterRule.java:46)
	at com.carrotsearch.randomizedtesting.rules.SystemPropertiesInvariantRule$1.evaluate(SystemPropertiesInvariantRule.java:55)
	at org.apache.lucene.util.TestRuleThreadAndTestName$1.evaluate(TestRuleThreadAndTestName.java:49)
	at org.apache.lucene.util.TestRuleIgnoreAfterMaxFailures$1.evaluate(TestRuleIgnoreAfterMaxFailures.java:70)
	at org.apache.lucene.util.TestRuleMarkFailure$1.evaluate(TestRuleMarkFailure.java:48)
	at com.carrotsearch.randomizedtesting.rules.StatementAdapter.evaluate(StatementAdapter.java:36)
	at com.carrotsearch.randomizedtesting.ThreadLeakControl$StatementRunner.run(ThreadLeakControl.java:358)
	at com.carrotsearch.randomizedtesting.ThreadLeakControl.forkTimeoutingTask(ThreadLeakControl.java:782)
	at com.carrotsearch.randomizedtesting.ThreadLeakControl$3.evaluate(ThreadLeakControl.java:442)
	at com.carrotsearch.randomizedtesting.RandomizedRunner.runSingleTest(RandomizedRunner.java:746)
	at com.carrotsearch.randomizedtesting.RandomizedRunner$3.evaluate(RandomizedRunner.java:648)
	at com.carrotsearch.randomizedtesting.RandomizedRunner$4.evaluate(RandomizedRunner.java:682)
	at com.carrotsearch.randomizedtesting.RandomizedRunner$5.evaluate(RandomizedRunner.java:693)
	at com.carrotsearch.randomizedtesting.rules.StatementAdapter.evaluate(StatementAdapter.java:36)
	at com.carrotsearch.randomizedtesting.rules.SystemPropertiesRestoreRule$1.evaluate(SystemPropertiesRestoreRule.java:53)
	at org.apache.lucene.util.AbstractBeforeAfterRule$1.evaluate(AbstractBeforeAfterRule.java:46)
	at org.apache.lucene.util.TestRuleStoreClassName$1.evaluate(TestRuleStoreClassName.java:42)
	at com.carrotsearch.randomizedtesting.rules.SystemPropertiesInvariantRule$1.evaluate(SystemPropertiesInvariantRule.java:55)
	at com.carrotsearch.randomizedtesting.rules.NoShadowingOrOverridesOnMethodsRule$1.evaluate(NoShadowingOrOverridesOnMethodsRule.java:39)
	at com.carrotsearch.randomizedtesting.rules.NoShadowingOrOverridesOnMethodsRule$1.evaluate(NoShadowingOrOverridesOnMethodsRule.java:39)
	at com.carrotsearch.randomizedtesting.rules.StatementAdapter.evaluate(StatementAdapter.java:36)
	at org.apache.lucene.util.TestRuleAssertionsRequired$1.evaluate(TestRuleAssertionsRequired.java:43)
	at org.apache.lucene.util.TestRuleMarkFailure$1.evaluate(TestRuleMarkFailure.java:48)
	at org.apache.lucene.util.TestRuleIgnoreAfterMaxFailures$1.evaluate(TestRuleIgnoreAfterMaxFailures.java:70)
	at org.apache.lucene.util.TestRuleIgnoreTestSuites$1.evaluate(TestRuleIgnoreTestSuites.java:55)
	at com.carrotsearch.randomizedtesting.rules.StatementAdapter.evaluate(StatementAdapter.java:36)
	at com.carrotsearch.randomizedtesting.ThreadLeakControl$StatementRunner.run(ThreadLeakControl.java:358)
	at java.lang.Thread.run(Thread.java:724)


REGRESSION:  org.apache.solr.handler.TestReplicationHandler.doTestReplicateAfterCoreReload

Error Message:
expected:<[{indexVersion=1385926509202,generation=2,filelist=[_1ftl.fdt, _1ftl.fdx, _1ftl.fnm, _1ftl.nvd, _1ftl.nvm, _1ftl.si, _1ftl_SimpleText_0.pst, _1g7n.fdt, _1g7n.fdx, _1g7n.fnm, _1g7n.nvd, _1g7n.nvm, _1g7n.si, _1g7n_SimpleText_0.pst, _1g7o.fdt, _1g7o.fdx, _1g7o.fnm, _1g7o.nvd, _1g7o.nvm, _1g7o.si, _1g7o_SimpleText_0.pst, _1g7p.fdt, _1g7p.fdx, _1g7p.fnm, _1g7p.nvd, _1g7p.nvm, _1g7p.si, _1g7p_SimpleText_0.pst, _1g7q.fdt, _1g7q.fdx, _1g7q.fnm, _1g7q.nvd, _1g7q.nvm, _1g7q.si, _1g7q_SimpleText_0.pst, _1g7r.fdt, _1g7r.fdx, _1g7r.fnm, _1g7r.nvd, _1g7r.nvm, _1g7r.si, _1g7r_SimpleText_0.pst, _1g7s.fdt, _1g7s.fdx, _1g7s.fnm, _1g7s.nvd, _1g7s.nvm, _1g7s.si, _1g7s_SimpleText_0.pst, _1g7t.fdt, _1g7t.fdx, _1g7t.fnm, _1g7t.nvd, _1g7t.nvm, _1g7t.si, _1g7t_SimpleText_0.pst, _1g7u.fdt, _1g7u.fdx, _1g7u.fnm, _1g7u.nvd, _1g7u.nvm, _1g7u.si, _1g7u_SimpleText_0.pst, _1g7v.fdt, _1g7v.fdx, _1g7v.fnm, _1g7v.nvd, _1g7v.nvm, _1g7v.si, _1g7v_SimpleText_0.pst, _1g7w.fdt, _1g7w.fdx, _1g7w.fnm, _1g7w.nvd, _1g7w.nvm, _1g7w.si, _1g7w_SimpleText_0.pst, _1g7x.fdt, _1g7x.fdx, _1g7x.fnm, _1g7x.nvd, _1g7x.nvm, _1g7x.si, _1g7x_SimpleText_0.pst, _1g7y.fdt, _1g7y.fdx, _1g7y.fnm, _1g7y.nvd, _1g7y.nvm, _1g7y.si, _1g7y_SimpleText_0.pst, _1g7z.fdt, _1g7z.fdx, _1g7z.fnm, _1g7z.nvd, _1g7z.nvm, _1g7z.si, _1g7z_SimpleText_0.pst, _1g80.fdt, _1g80.fdx, _1g80.fnm, _1g80.nvd, _1g80.nvm, _1g80.si, _1g80_SimpleText_0.pst, _1g81.fdt, _1g81.fdx, _1g81.fnm, _1g81.nvd, _1g81.nvm, _1g81.si, _1g81_SimpleText_0.pst, _1g82.fdt, _1g82.fdx, _1g82.fnm, _1g82.nvd, _1g82.nvm, _1g82.si, _1g82_SimpleText_0.pst, _1g83.fdt, _1g83.fdx, _1g83.fnm, _1g83.nvd, _1g83.nvm, _1g83.si, _1g83_SimpleText_0.pst, _1g84.fdt, _1g84.fdx, _1g84.fnm, _1g84.nvd, _1g84.nvm, _1g84.si, _1g84_SimpleText_0.pst, _1g85.fdt, _1g85.fdx, _1g85.fnm, _1g85.nvd, _1g85.nvm, _1g85.si, _1g85_SimpleText_0.pst, _1g86.fdt, _1g86.fdx, _1g86.fnm, _1g86.nvd, _1g86.nvm, _1g86.si, _1g86_SimpleText_0.pst, _1g87.fdt, _1g87.fdx, _1g87.fnm, _1g87.nvd, _1g87.nvm, _1g87.si, _1g87_SimpleText_0.pst, _1g88.fdt, _1g88.fdx, _1g88.fnm, _1g88.nvd, _1g88.nvm, _1g88.si, _1g88_SimpleText_0.pst, _1g89.fdt, _1g89.fdx, _1g89.fnm, _1g89.nvd, _1g89.nvm, _1g89.si, _1g89_SimpleText_0.pst, _1g8a.fdt, _1g8a.fdx, _1g8a.fnm, _1g8a.nvd, _1g8a.nvm, _1g8a.si, _1g8a_SimpleText_0.pst, _1g8b.fdt, _1g8b.fdx, _1g8b.fnm, _1g8b.nvd, _1g8b.nvm, _1g8b.si, _1g8b_SimpleText_0.pst, _1g8c.fdt, _1g8c.fdx, _1g8c.fnm, _1g8c.nvd, _1g8c.nvm, _1g8c.si, _1g8c_SimpleText_0.pst, _1g8d.fdt, _1g8d.fdx, _1g8d.fnm, _1g8d.nvd, _1g8d.nvm, _1g8d.si, _1g8d_SimpleText_0.pst, _1g8e.fdt, _1g8e.fdx, _1g8e.fnm, _1g8e.nvd, _1g8e.nvm, _1g8e.si, _1g8e_SimpleText_0.pst, _1g8f.fdt, _1g8f.fdx, _1g8f.fnm, _1g8f.nvd, _1g8f.nvm, _1g8f.si, _1g8f_SimpleText_0.pst, _1g8g.fdt, _1g8g.fdx, _1g8g.fnm, _1g8g.nvd, _1g8g.nvm, _1g8g.si, _1g8g_SimpleText_0.pst, _1g8h.fdt, _1g8h.fdx, _1g8h.fnm, _1g8h.nvd, _1g8h.nvm, _1g8h.si, _1g8h_SimpleText_0.pst, _1g8i.fdt, _1g8i.fdx, _1g8i.fnm, _1g8i.nvd, _1g8i.nvm, _1g8i.si, _1g8i_SimpleText_0.pst, _1g8j.fdt, _1g8j.fdx, _1g8j.fnm, _1g8j.nvd, _1g8j.nvm, _1g8j.si, _1g8j_SimpleText_0.pst, _1g8k.fdt, _1g8k.fdx, _1g8k.fnm, _1g8k.nvd, _1g8k.nvm, _1g8k.si, _1g8k_SimpleText_0.pst, _1g8l.fdt, _1g8l.fdx, _1g8l.fnm, _1g8l.nvd, _1g8l.nvm, _1g8l.si, _1g8l_SimpleText_0.pst, _1g8m.fdt, _1g8m.fdx, _1g8m.fnm, _1g8m.nvd, _1g8m.nvm, _1g8m.si, _1g8m_SimpleText_0.pst, _1g8n.fdt, _1g8n.fdx, _1g8n.fnm, _1g8n.nvd, _1g8n.nvm, _1g8n.si, _1g8n_SimpleText_0.pst, _1g8o.fdt, _1g8o.fdx, _1g8o.fnm, _1g8o.nvd, _1g8o.nvm, _1g8o.si, _1g8o_SimpleText_0.pst, _1g8p.fdt, _1g8p.fdx, _1g8p.fnm, _1g8p.nvd, _1g8p.nvm, _1g8p.si, _1g8p_SimpleText_0.pst, _1g8q.fdt, _1g8q.fdx, _1g8q.fnm, _1g8q.nvd, _1g8q.nvm, _1g8q.si, _1g8q_SimpleText_0.pst, _1g8r.fdt, _1g8r.fdx, _1g8r.fnm, _1g8r.nvd, _1g8r.nvm, _1g8r.si, _1g8r_SimpleText_0.pst, _1g8s.fdt, _1g8s.fdx, _1g8s.fnm, _1g8s.nvd, _1g8s.nvm, _1g8s.si, _1g8s_SimpleText_0.pst, _1g8t.fdt, _1g8t.fdx, _1g8t.fnm, _1g8t.nvd, _1g8t.nvm, _1g8t.si, _1g8t_SimpleText_0.pst, _1g8u.fdt, _1g8u.fdx, _1g8u.fnm, _1g8u.nvd, _1g8u.nvm, _1g8u.si, _1g8u_SimpleText_0.pst, _1g8v.fdt, _1g8v.fdx, _1g8v.fnm, _1g8v.nvd, _1g8v.nvm, _1g8v.si, _1g8v_SimpleText_0.pst, _1gkf.fdt, _1gkf.fdx, _1gkf.fnm, _1gkf.nvd, _1gkf.nvm, _1gkf.si, _1gkf_SimpleText_0.pst, _1gkg.fdt, _1gkg.fdx, _1gkg.fnm, _1gkg.nvd, _1gkg.nvm, _1gkg.si, _1gkg_SimpleText_0.pst, _1gkh.fdt, _1gkh.fdx, _1gkh.fnm, _1gkh.nvd, _1gkh.nvm, _1gkh.si, _1gkh_SimpleText_0.pst, _1gki.fdt, _1gki.fdx, _1gki.fnm, _1gki.nvd, _1gki.nvm, _1gki.si, _1gki_SimpleText_0.pst, _1gkj.fdt, _1gkj.fdx, _1gkj.fnm, _1gkj.nvd, _1gkj.nvm, _1gkj.si, _1gkj_SimpleText_0.pst, _1gkk.fdt, _1gkk.fdx, _1gkk.fnm, _1gkk.nvd, _1gkk.nvm, _1gkk.si, _1gkk_SimpleText_0.pst, _1gkl.fdt, _1gkl.fdx, _1gkl.fnm, _1gkl.nvd, _1gkl.nvm, _1gkl.si, _1gkl_SimpleText_0.pst, _1gkm.fdt, _1gkm.fdx, _1gkm.fnm, _1gkm.nvd, _1gkm.nvm, _1gkm.si, _1gkm_SimpleText_0.pst, _1gkn.fdt, _1gkn.fdx, _1gkn.fnm, _1gkn.nvd, _1gkn.nvm, _1gkn.si, _1gkn_SimpleText_0.pst, _1gko.fdt, _1gko.fdx, _1gko.fnm, _1gko.nvd, _1gko.nvm, _1gko.si, _1gko_SimpleText_0.pst, _1gkp.fdt, _1gkp.fdx, _1gkp.fnm, _1gkp.nvd, _1gkp.nvm, _1gkp.si, _1gkp_SimpleText_0.pst, _1gkq.fdt, _1gkq.fdx, _1gkq.fnm, _1gkq.nvd, _1gkq.nvm, _1gkq.si, _1gkq_SimpleText_0.pst, _1gkr.fdt, _1gkr.fdx, _1gkr.fnm, _1gkr.nvd, _1gkr.nvm, _1gkr.si, _1gkr_SimpleText_0.pst, _1gks.fdt, _1gks.fdx, _1gks.fnm, _1gks.nvd, _1gks.nvm, _1gks.si, _1gks_SimpleText_0.pst, _1gkt.fdt, _1gkt.fdx, _1gkt.fnm, _1gkt.nvd, _1gkt.nvm, _1gkt.si, _1gkt_SimpleText_0.pst, _1gku.fdt, _1gku.fdx, _1gku.fnm, _1gku.nvd, _1gku.nvm, _1gku.si, _1gku_SimpleText_0.pst, _1gkv.fdt, _1gkv.fdx, _1gkv.fnm, _1gkv.nvd, _1gkv.nvm, _1gkv.si, _1gkv_SimpleText_0.pst, _1gkw.fdt, _1gkw.fdx, _1gkw.fnm, _1gkw.nvd, _1gkw.nvm, _1gkw.si, _1gkw_SimpleText_0.pst, _1gkx.fdt, _1gkx.fdx, _1gkx.fnm, _1gkx.nvd, _1gkx.nvm, _1gkx.si, _1gkx_SimpleText_0.pst, _1gky.fdt, _1gky.fdx, _1gky.fnm, _1gky.nvd, _1gky.nvm, _1gky.si, _1gky_SimpleText_0.pst, _1gkz.fdt, _1gkz.fdx, _1gkz.fnm, _1gkz.nvd, _1gkz.nvm, _1gkz.si, _1gkz_SimpleText_0.pst, segments_2]}]> but was:<[{indexVersion=1385926509202,generation=2,filelist=[_1ftl.fdt, _1ftl.fdx, _1ftl.fnm, _1ftl.nvd, _1ftl.nvm, _1ftl.si, _1ftl_SimpleText_0.pst, _1g7n.fdt, _1g7n.fdx, _1g7n.fnm, _1g7n.nvd, _1g7n.nvm, _1g7n.si, _1g7n_SimpleText_0.pst, _1g7o.fdt, _1g7o.fdx, _1g7o.fnm, _1g7o.nvd, _1g7o.nvm, _1g7o.si, _1g7o_SimpleText_0.pst, _1g7p.fdt, _1g7p.fdx, _1g7p.fnm, _1g7p.nvd, _1g7p.nvm, _1g7p.si, _1g7p_SimpleText_0.pst, _1g7q.fdt, _1g7q.fdx, _1g7q.fnm, _1g7q.nvd, _1g7q.nvm, _1g7q.si, _1g7q_SimpleText_0.pst, _1g7r.fdt, _1g7r.fdx, _1g7r.fnm, _1g7r.nvd, _1g7r.nvm, _1g7r.si, _1g7r_SimpleText_0.pst, _1g7s.fdt, _1g7s.fdx, _1g7s.fnm, _1g7s.nvd, _1g7s.nvm, _1g7s.si, _1g7s_SimpleText_0.pst, _1g7t.fdt, _1g7t.fdx, _1g7t.fnm, _1g7t.nvd, _1g7t.nvm, _1g7t.si, _1g7t_SimpleText_0.pst, _1g7u.fdt, _1g7u.fdx, _1g7u.fnm, _1g7u.nvd, _1g7u.nvm, _1g7u.si, _1g7u_SimpleText_0.pst, _1g7v.fdt, _1g7v.fdx, _1g7v.fnm, _1g7v.nvd, _1g7v.nvm, _1g7v.si, _1g7v_SimpleText_0.pst, _1g7w.fdt, _1g7w.fdx, _1g7w.fnm, _1g7w.nvd, _1g7w.nvm, _1g7w.si, _1g7w_SimpleText_0.pst, _1g7x.fdt, _1g7x.fdx, _1g7x.fnm, _1g7x.nvd, _1g7x.nvm, _1g7x.si, _1g7x_SimpleText_0.pst, _1g7y.fdt, _1g7y.fdx, _1g7y.fnm, _1g7y.nvd, _1g7y.nvm, _1g7y.si, _1g7y_SimpleText_0.pst, _1g7z.fdt, _1g7z.fdx, _1g7z.fnm, _1g7z.nvd, _1g7z.nvm, _1g7z.si, _1g7z_SimpleText_0.pst, _1g80.fdt, _1g80.fdx, _1g80.fnm, _1g80.nvd, _1g80.nvm, _1g80.si, _1g80_SimpleText_0.pst, _1g81.fdt, _1g81.fdx, _1g81.fnm, _1g81.nvd, _1g81.nvm, _1g81.si, _1g81_SimpleText_0.pst, _1g82.fdt, _1g82.fdx, _1g82.fnm, _1g82.nvd, _1g82.nvm, _1g82.si, _1g82_SimpleText_0.pst, _1g83.fdt, _1g83.fdx, _1g83.fnm, _1g83.nvd, _1g83.nvm, _1g83.si, _1g83_SimpleText_0.pst, _1g84.fdt, _1g84.fdx, _1g84.fnm, _1g84.nvd, _1g84.nvm, _1g84.si, _1g84_SimpleText_0.pst, _1g85.fdt, _1g85.fdx, _1g85.fnm, _1g85.nvd, _1g85.nvm, _1g85.si, _1g85_SimpleText_0.pst, _1g86.fdt, _1g86.fdx, _1g86.fnm, _1g86.nvd, _1g86.nvm, _1g86.si, _1g86_SimpleText_0.pst, _1g87.fdt, _1g87.fdx, _1g87.fnm, _1g87.nvd, _1g87.nvm, _1g87.si, _1g87_SimpleText_0.pst, _1g88.fdt, _1g88.fdx, _1g88.fnm, _1g88.nvd, _1g88.nvm, _1g88.si, _1g88_SimpleText_0.pst, _1g89.fdt, _1g89.fdx, _1g89.fnm, _1g89.nvd, _1g89.nvm, _1g89.si, _1g89_SimpleText_0.pst, _1g8a.fdt, _1g8a.fdx, _1g8a.fnm, _1g8a.nvd, _1g8a.nvm, _1g8a.si, _1g8a_SimpleText_0.pst, _1g8b.fdt, _1g8b.fdx, _1g8b.fnm, _1g8b.nvd, _1g8b.nvm, _1g8b.si, _1g8b_SimpleText_0.pst, _1g8c.fdt, _1g8c.fdx, _1g8c.fnm, _1g8c.nvd, _1g8c.nvm, _1g8c.si, _1g8c_SimpleText_0.pst, _1g8d.fdt, _1g8d.fdx, _1g8d.fnm, _1g8d.nvd, _1g8d.nvm, _1g8d.si, _1g8d_SimpleText_0.pst, _1g8e.fdt, _1g8e.fdx, _1g8e.fnm, _1g8e.nvd, _1g8e.nvm, _1g8e.si, _1g8e_SimpleText_0.pst, _1g8f.fdt, _1g8f.fdx, _1g8f.fnm, _1g8f.nvd, _1g8f.nvm, _1g8f.si, _1g8f_SimpleText_0.pst, _1g8g.fdt, _1g8g.fdx, _1g8g.fnm, _1g8g.nvd, _1g8g.nvm, _1g8g.si, _1g8g_SimpleText_0.pst, _1g8h.fdt, _1g8h.fdx, _1g8h.fnm, _1g8h.nvd, _1g8h.nvm, _1g8h.si, _1g8h_SimpleText_0.pst, _1g8i.fdt, _1g8i.fdx, _1g8i.fnm, _1g8i.nvd, _1g8i.nvm, _1g8i.si, _1g8i_SimpleText_0.pst, _1g8j.fdt, _1g8j.fdx, _1g8j.fnm, _1g8j.nvd, _1g8j.nvm, _1g8j.si, _1g8j_SimpleText_0.pst, _1g8k.fdt, _1g8k.fdx, _1g8k.fnm, _1g8k.nvd, _1g8k.nvm, _1g8k.si, _1g8k_SimpleText_0.pst, _1g8l.fdt, _1g8l.fdx, _1g8l.fnm, _1g8l.nvd, _1g8l.nvm, _1g8l.si, _1g8l_SimpleText_0.pst, _1g8m.fdt, _1g8m.fdx, _1g8m.fnm, _1g8m.nvd, _1g8m.nvm, _1g8m.si, _1g8m_SimpleText_0.pst, _1g8n.fdt, _1g8n.fdx, _1g8n.fnm, _1g8n.nvd, _1g8n.nvm, _1g8n.si, _1g8n_SimpleText_0.pst, _1g8o.fdt, _1g8o.fdx, _1g8o.fnm, _1g8o.nvd, _1g8o.nvm, _1g8o.si, _1g8o_SimpleText_0.pst, _1g8p.fdt, _1g8p.fdx, _1g8p.fnm, _1g8p.nvd, _1g8p.nvm, _1g8p.si, _1g8p_SimpleText_0.pst, _1g8q.fdt, _1g8q.fdx, _1g8q.fnm, _1g8q.nvd, _1g8q.nvm, _1g8q.si, _1g8q_SimpleText_0.pst, _1g8r.fdt, _1g8r.fdx, _1g8r.fnm, _1g8r.nvd, _1g8r.nvm, _1g8r.si, _1g8r_SimpleText_0.pst, _1g8s.fdt, _1g8s.fdx, _1g8s.fnm, _1g8s.nvd, _1g8s.nvm, _1g8s.si, _1g8s_SimpleText_0.pst, _1g8t.fdt, _1g8t.fdx, _1g8t.fnm, _1g8t.nvd, _1g8t.nvm, _1g8t.si, _1g8t_SimpleText_0.pst, _1g8u.fdt, _1g8u.fdx, _1g8u.fnm, _1g8u.nvd, _1g8u.nvm, _1g8u.si, _1g8u_SimpleText_0.pst, _1g8v.fdt, _1g8v.fdx, _1g8v.fnm, _1g8v.nvd, _1g8v.nvm, _1g8v.si, _1g8v_SimpleText_0.pst, _1gkf.fdt, _1gkf.fdx, _1gkf.fnm, _1gkf.nvd, _1gkf.nvm, _1gkf.si, _1gkf_SimpleText_0.pst, _1gkg.fdt, _1gkg.fdx, _1gkg.fnm, _1gkg.nvd, _1gkg.nvm, _1gkg.si, _1gkg_SimpleText_0.pst, _1gkh.fdt, _1gkh.fdx, _1gkh.fnm, _1gkh.nvd, _1gkh.nvm, _1gkh.si, _1gkh_SimpleText_0.pst, _1gki.fdt, _1gki.fdx, _1gki.fnm, _1gki.nvd, _1gki.nvm, _1gki.si, _1gki_SimpleText_0.pst, _1gkj.fdt, _1gkj.fdx, _1gkj.fnm, _1gkj.nvd, _1gkj.nvm, _1gkj.si, _1gkj_SimpleText_0.pst, _1gkk.fdt, _1gkk.fdx, _1gkk.fnm, _1gkk.nvd, _1gkk.nvm, _1gkk.si, _1gkk_SimpleText_0.pst, _1gkl.fdt, _1gkl.fdx, _1gkl.fnm, _1gkl.nvd, _1gkl.nvm, _1gkl.si, _1gkl_SimpleText_0.pst, _1gkm.fdt, _1gkm.fdx, _1gkm.fnm, _1gkm.nvd, _1gkm.nvm, _1gkm.si, _1gkm_SimpleText_0.pst, _1gkn.fdt, _1gkn.fdx, _1gkn.fnm, _1gkn.nvd, _1gkn.nvm, _1gkn.si, _1gkn_SimpleText_0.pst, _1gko.fdt, _1gko.fdx, _1gko.fnm, _1gko.nvd, _1gko.nvm, _1gko.si, _1gko_SimpleText_0.pst, _1gkp.fdt, _1gkp.fdx, _1gkp.fnm, _1gkp.nvd, _1gkp.nvm, _1gkp.si, _1gkp_SimpleText_0.pst, _1gkq.fdt, _1gkq.fdx, _1gkq.fnm, _1gkq.nvd, _1gkq.nvm, _1gkq.si, _1gkq_SimpleText_0.pst, _1gkr.fdt, _1gkr.fdx, _1gkr.fnm, _1gkr.nvd, _1gkr.nvm, _1gkr.si, _1gkr_SimpleText_0.pst, _1gks.fdt, _1gks.fdx, _1gks.fnm, _1gks.nvd, _1gks.nvm, _1gks.si, _1gks_SimpleText_0.pst, _1gkt.fdt, _1gkt.fdx, _1gkt.fnm, _1gkt.nvd, _1gkt.nvm, _1gkt.si, _1gkt_SimpleText_0.pst, _1gku.fdt, _1gku.fdx, _1gku.fnm, _1gku.nvd, _1gku.nvm, _1gku.si, _1gku_SimpleText_0.pst, _1gkv.fdt, _1gkv.fdx, _1gkv.fnm, _1gkv.nvd, _1gkv.nvm, _1gkv.si, _1gkv_SimpleText_0.pst, _1gkw.fdt, _1gkw.fdx, _1gkw.fnm, _1gkw.nvd, _1gkw.nvm, _1gkw.si, _1gkw_SimpleText_0.pst, _1gkx.fdt, _1gkx.fdx, _1gkx.fnm, _1gkx.nvd, _1gkx.nvm, _1gkx.si, _1gkx_SimpleText_0.pst, _1gky.fdt, _1gky.fdx, _1gky.fnm, _1gky.nvd, _1gky.nvm, _1gky.si, _1gky_SimpleText_0.pst, _1gkz.fdt, _1gkz.fdx, _1gkz.fnm, _1gkz.nvd, _1gkz.nvm, _1gkz.si, _1gkz_SimpleText_0.pst, segments_2]}, {indexVersion=1385926509202,generation=3,filelist=[_1g8x.fdt, _1g8x.fdx, _1g8x.fnm, _1g8x.nvd, _1g8x.nvm, _1g8x.si, _1g8x_SimpleText_0.pst, _1gkf.fdt, _1gkf.fdx, _1gkf.fnm, _1gkf.nvd, _1gkf.nvm, _1gkf.si, _1gkf_SimpleText_0.pst, _1gkg.fdt, _1gkg.fdx, _1gkg.fnm, _1gkg.nvd, _1gkg.nvm, _1gkg.si, _1gkg_SimpleText_0.pst, _1gkh.fdt, _1gkh.fdx, _1gkh.fnm, _1gkh.nvd, _1gkh.nvm, _1gkh.si, _1gkh_SimpleText_0.pst, _1gki.fdt, _1gki.fdx, _1gki.fnm, _1gki.nvd, _1gki.nvm, _1gki.si, _1gki_SimpleText_0.pst, _1gkj.fdt, _1gkj.fdx, _1gkj.fnm, _1gkj.nvd, _1gkj.nvm, _1gkj.si, _1gkj_SimpleText_0.pst, _1gkk.fdt, _1gkk.fdx, _1gkk.fnm, _1gkk.nvd, _1gkk.nvm, _1gkk.si, _1gkk_SimpleText_0.pst, _1gkl.fdt, _1gkl.fdx, _1gkl.fnm, _1gkl.nvd, _1gkl.nvm, _1gkl.si, _1gkl_SimpleText_0.pst, _1gkm.fdt, _1gkm.fdx, _1gkm.fnm, _1gkm.nvd, _1gkm.nvm, _1gkm.si, _1gkm_SimpleText_0.pst, _1gkn.fdt, _1gkn.fdx, _1gkn.fnm, _1gkn.nvd, _1gkn.nvm, _1gkn.si, _1gkn_SimpleText_0.pst, _1gko.fdt, _1gko.fdx, _1gko.fnm, _1gko.nvd, _1gko.nvm, _1gko.si, _1gko_SimpleText_0.pst, _1gkp.fdt, _1gkp.fdx, _1gkp.fnm, _1gkp.nvd, _1gkp.nvm, _1gkp.si, _1gkp_SimpleText_0.pst, _1gkq.fdt, _1gkq.fdx, _1gkq.fnm, _1gkq.nvd, _1gkq.nvm, _1gkq.si, _1gkq_SimpleText_0.pst, _1gkr.fdt, _1gkr.fdx, _1gkr.fnm, _1gkr.nvd, _1gkr.nvm, _1gkr.si, _1gkr_SimpleText_0.pst, _1gks.fdt, _1gks.fdx, _1gks.fnm, _1gks.nvd, _1gks.nvm, _1gks.si, _1gks_SimpleText_0.pst, _1gkt.fdt, _1gkt.fdx, _1gkt.fnm, _1gkt.nvd, _1gkt.nvm, _1gkt.si, _1gkt_SimpleText_0.pst, _1gku.fdt, _1gku.fdx, _1gku.fnm, _1gku.nvd, _1gku.nvm, _1gku.si, _1gku_SimpleText_0.pst, _1gkv.fdt, _1gkv.fdx, _1gkv.fnm, _1gkv.nvd, _1gkv.nvm, _1gkv.si, _1gkv_SimpleText_0.pst, _1gkw.fdt, _1gkw.fdx, _1gkw.fnm, _1gkw.nvd, _1gkw.nvm, _1gkw.si, _1gkw_SimpleText_0.pst, _1gkx.fdt, _1gkx.fdx, _1gkx.fnm, _1gkx.nvd, _1gkx.nvm, _1gkx.si, _1gkx_SimpleText_0.pst, _1gky.fdt, _1gky.fdx, _1gky.fnm, _1gky.nvd, _1gky.nvm, _1gky.si, _1gky_SimpleText_0.pst, _1gkz.fdt, _1gkz.fdx, _1gkz.fnm, _1gkz.nvd, _1gkz.nvm, _1gkz.si, _1gkz_SimpleText_0.pst, segments_3]}]>

Stack Trace:
java.lang.AssertionError: expected:<[{indexVersion=1385926509202,generation=2,filelist=[_1ftl.fdt, _1ftl.fdx, _1ftl.fnm, _1ftl.nvd, _1ftl.nvm, _1ftl.si, _1ftl_SimpleText_0.pst, _1g7n.fdt, _1g7n.fdx, _1g7n.fnm, _1g7n.nvd, _1g7n.nvm, _1g7n.si, _1g7n_SimpleText_0.pst, _1g7o.fdt, _1g7o.fdx, _1g7o.fnm, _1g7o.nvd, _1g7o.nvm, _1g7o.si, _1g7o_SimpleText_0.pst, _1g7p.fdt, _1g7p.fdx, _1g7p.fnm, _1g7p.nvd, _1g7p.nvm, _1g7p.si, _1g7p_SimpleText_0.pst, _1g7q.fdt, _1g7q.fdx, _1g7q.fnm, _1g7q.nvd, _1g7q.nvm, _1g7q.si, _1g7q_SimpleText_0.pst, _1g7r.fdt, _1g7r.fdx, _1g7r.fnm, _1g7r.nvd, _1g7r.nvm, _1g7r.si, _1g7r_SimpleText_0.pst, _1g7s.fdt, _1g7s.fdx, _1g7s.fnm, _1g7s.nvd, _1g7s.nvm, _1g7s.si, _1g7s_SimpleText_0.pst, _1g7t.fdt, _1g7t.fdx, _1g7t.fnm, _1g7t.nvd, _1g7t.nvm, _1g7t.si, _1g7t_SimpleText_0.pst, _1g7u.fdt, _1g7u.fdx, _1g7u.fnm, _1g7u.nvd, _1g7u.nvm, _1g7u.si, _1g7u_SimpleText_0.pst, _1g7v.fdt, _1g7v.fdx, _1g7v.fnm, _1g7v.nvd, _1g7v.nvm, _1g7v.si, _1g7v_SimpleText_0.pst, _1g7w.fdt, _1g7w.fdx, _1g7w.fnm, _1g7w.nvd, _1g7w.nvm, _1g7w.si, _1g7w_SimpleText_0.pst, _1g7x.fdt, _1g7x.fdx, _1g7x.fnm, _1g7x.nvd, _1g7x.nvm, _1g7x.si, _1g7x_SimpleText_0.pst, _1g7y.fdt, _1g7y.fdx, _1g7y.fnm, _1g7y.nvd, _1g7y.nvm, _1g7y.si, _1g7y_SimpleText_0.pst, _1g7z.fdt, _1g7z.fdx, _1g7z.fnm, _1g7z.nvd, _1g7z.nvm, _1g7z.si, _1g7z_SimpleText_0.pst, _1g80.fdt, _1g80.fdx, _1g80.fnm, _1g80.nvd, _1g80.nvm, _1g80.si, _1g80_SimpleText_0.pst, _1g81.fdt, _1g81.fdx, _1g81.fnm, _1g81.nvd, _1g81.nvm, _1g81.si, _1g81_SimpleText_0.pst, _1g82.fdt, _1g82.fdx, _1g82.fnm, _1g82.nvd, _1g82.nvm, _1g82.si, _1g82_SimpleText_0.pst, _1g83.fdt, _1g83.fdx, _1g83.fnm, _1g83.nvd, _1g83.nvm, _1g83.si, _1g83_SimpleText_0.pst, _1g84.fdt, _1g84.fdx, _1g84.fnm, _1g84.nvd, _1g84.nvm, _1g84.si, _1g84_SimpleText_0.pst, _1g85.fdt, _1g85.fdx, _1g85.fnm, _1g85.nvd, _1g85.nvm, _1g85.si, _1g85_SimpleText_0.pst, _1g86.fdt, _1g86.fdx, _1g86.fnm, _1g86.nvd, _1g86.nvm, _1g86.si, _1g86_SimpleText_0.pst, _1g87.fdt, _1g87.fdx, _1g87.fnm, _1g87.nvd, _1g87.nvm, _1g87.si, _1g87_SimpleText_0.pst, _1g88.fdt, _1g88.fdx, _1g88.fnm, _1g88.nvd, _1g88.nvm, _1g88.si, _1g88_SimpleText_0.pst, _1g89.fdt, _1g89.fdx, _1g89.fnm, _1g89.nvd, _1g89.nvm, _1g89.si, _1g89_SimpleText_0.pst, _1g8a.fdt, _1g8a.fdx, _1g8a.fnm, _1g8a.nvd, _1g8a.nvm, _1g8a.si, _1g8a_SimpleText_0.pst, _1g8b.fdt, _1g8b.fdx, _1g8b.fnm, _1g8b.nvd, _1g8b.nvm, _1g8b.si, _1g8b_SimpleText_0.pst, _1g8c.fdt, _1g8c.fdx, _1g8c.fnm, _1g8c.nvd, _1g8c.nvm, _1g8c.si, _1g8c_SimpleText_0.pst, _1g8d.fdt, _1g8d.fdx, _1g8d.fnm, _1g8d.nvd, _1g8d.nvm, _1g8d.si, _1g8d_SimpleText_0.pst, _1g8e.fdt, _1g8e.fdx, _1g8e.fnm, _1g8e.nvd, _1g8e.nvm, _1g8e.si, _1g8e_SimpleText_0.pst, _1g8f.fdt, _1g8f.fdx, _1g8f.fnm, _1g8f.nvd, _1g8f.nvm, _1g8f.si, _1g8f_SimpleText_0.pst, _1g8g.fdt, _1g8g.fdx, _1g8g.fnm, _1g8g.nvd, _1g8g.nvm, _1g8g.si, _1g8g_SimpleText_0.pst, _1g8h.fdt, _1g8h.fdx, _1g8h.fnm, _1g8h.nvd, _1g8h.nvm, _1g8h.si, _1g8h_SimpleText_0.pst, _1g8i.fdt, _1g8i.fdx, _1g8i.fnm, _1g8i.nvd, _1g8i.nvm, _1g8i.si, _1g8i_SimpleText_0.pst, _1g8j.fdt, _1g8j.fdx, _1g8j.fnm, _1g8j.nvd, _1g8j.nvm, _1g8j.si, _1g8j_SimpleText_0.pst, _1g8k.fdt, _1g8k.fdx, _1g8k.fnm, _1g8k.nvd, _1g8k.nvm, _1g8k.si, _1g8k_SimpleText_0.pst, _1g8l.fdt, _1g8l.fdx, _1g8l.fnm, _1g8l.nvd, _1g8l.nvm, _1g8l.si, _1g8l_SimpleText_0.pst, _1g8m.fdt, _1g8m.fdx, _1g8m.fnm, _1g8m.nvd, _1g8m.nvm, _1g8m.si, _1g8m_SimpleText_0.pst, _1g8n.fdt, _1g8n.fdx, _1g8n.fnm, _1g8n.nvd, _1g8n.nvm, _1g8n.si, _1g8n_SimpleText_0.pst, _1g8o.fdt, _1g8o.fdx, _1g8o.fnm, _1g8o.nvd, _1g8o.nvm, _1g8o.si, _1g8o_SimpleText_0.pst, _1g8p.fdt, _1g8p.fdx, _1g8p.fnm, _1g8p.nvd, _1g8p.nvm, _1g8p.si, _1g8p_SimpleText_0.pst, _1g8q.fdt, _1g8q.fdx, _1g8q.fnm, _1g8q.nvd, _1g8q.nvm, _1g8q.si, _1g8q_SimpleText_0.pst, _1g8r.fdt, _1g8r.fdx, _1g8r.fnm, _1g8r.nvd, _1g8r.nvm, _1g8r.si, _1g8r_SimpleText_0.pst, _1g8s.fdt, _1g8s.fdx, _1g8s.fnm, _1g8s.nvd, _1g8s.nvm, _1g8s.si, _1g8s_SimpleText_0.pst, _1g8t.fdt, _1g8t.fdx, _1g8t.fnm, _1g8t.nvd, _1g8t.nvm, _1g8t.si, _1g8t_SimpleText_0.pst, _1g8u.fdt, _1g8u.fdx, _1g8u.fnm, _1g8u.nvd, _1g8u.nvm, _1g8u.si, _1g8u_SimpleText_0.pst, _1g8v.fdt, _1g8v.fdx, _1g8v.fnm, _1g8v.nvd, _1g8v.nvm, _1g8v.si, _1g8v_SimpleText_0.pst, _1gkf.fdt, _1gkf.fdx, _1gkf.fnm, _1gkf.nvd, _1gkf.nvm, _1gkf.si, _1gkf_SimpleText_0.pst, _1gkg.fdt, _1gkg.fdx, _1gkg.fnm, _1gkg.nvd, _1gkg.nvm, _1gkg.si, _1gkg_SimpleText_0.pst, _1gkh.fdt, _1gkh.fdx, _1gkh.fnm, _1gkh.nvd, _1gkh.nvm, _1gkh.si, _1gkh_SimpleText_0.pst, _1gki.fdt, _1gki.fdx, _1gki.fnm, _1gki.nvd, _1gki.nvm, _1gki.si, _1gki_SimpleText_0.pst, _1gkj.fdt, _1gkj.fdx, _1gkj.fnm, _1gkj.nvd, _1gkj.nvm, _1gkj.si, _1gkj_SimpleText_0.pst, _1gkk.fdt, _1gkk.fdx, _1gkk.fnm, _1gkk.nvd, _1gkk.nvm, _1gkk.si, _1gkk_SimpleText_0.pst, _1gkl.fdt, _1gkl.fdx, _1gkl.fnm, _1gkl.nvd, _1gkl.nvm, _1gkl.si, _1gkl_SimpleText_0.pst, _1gkm.fdt, _1gkm.fdx, _1gkm.fnm, _1gkm.nvd, _1gkm.nvm, _1gkm.si, _1gkm_SimpleText_0.pst, _1gkn.fdt, _1gkn.fdx, _1gkn.fnm, _1gkn.nvd, _1gkn.nvm, _1gkn.si, _1gkn_SimpleText_0.pst, _1gko.fdt, _1gko.fdx, _1gko.fnm, _1gko.nvd, _1gko.nvm, _1gko.si, _1gko_SimpleText_0.pst, _1gkp.fdt, _1gkp.fdx, _1gkp.fnm, _1gkp.nvd, _1gkp.nvm, _1gkp.si, _1gkp_SimpleText_0.pst, _1gkq.fdt, _1gkq.fdx, _1gkq.fnm, _1gkq.nvd, _1gkq.nvm, _1gkq.si, _1gkq_SimpleText_0.pst, _1gkr.fdt, _1gkr.fdx, _1gkr.fnm, _1gkr.nvd, _1gkr.nvm, _1gkr.si, _1gkr_SimpleText_0.pst, _1gks.fdt, _1gks.fdx, _1gks.fnm, _1gks.nvd, _1gks.nvm, _1gks.si, _1gks_SimpleText_0.pst, _1gkt.fdt, _1gkt.fdx, _1gkt.fnm, _1gkt.nvd, _1gkt.nvm, _1gkt.si, _1gkt_SimpleText_0.pst, _1gku.fdt, _1gku.fdx, _1gku.fnm, _1gku.nvd, _1gku.nvm, _1gku.si, _1gku_SimpleText_0.pst, _1gkv.fdt, _1gkv.fdx, _1gkv.fnm, _1gkv.nvd, _1gkv.nvm, _1gkv.si, _1gkv_SimpleText_0.pst, _1gkw.fdt, _1gkw.fdx, _1gkw.fnm, _1gkw.nvd, _1gkw.nvm, _1gkw.si, _1gkw_SimpleText_0.pst, _1gkx.fdt, _1gkx.fdx, _1gkx.fnm, _1gkx.nvd, _1gkx.nvm, _1gkx.si, _1gkx_SimpleText_0.pst, _1gky.fdt, _1gky.fdx, _1gky.fnm, _1gky.nvd, _1gky.nvm, _1gky.si, _1gky_SimpleText_0.pst, _1gkz.fdt, _1gkz.fdx, _1gkz.fnm, _1gkz.nvd, _1gkz.nvm, _1gkz.si, _1gkz_SimpleText_0.pst, segments_2]}]> but was:<[{indexVersion=1385926509202,generation=2,filelist=[_1ftl.fdt, _1ftl.fdx, _1ftl.fnm, _1ftl.nvd, _1ftl.nvm, _1ftl.si, _1ftl_SimpleText_0.pst, _1g7n.fdt, _1g7n.fdx, _1g7n.fnm, _1g7n.nvd, _1g7n.nvm, _1g7n.si, _1g7n_SimpleText_0.pst, _1g7o.fdt, _1g7o.fdx, _1g7o.fnm, _1g7o.nvd, _1g7o.nvm, _1g7o.si, _1g7o_SimpleText_0.pst, _1g7p.fdt, _1g7p.fdx, _1g7p.fnm, _1g7p.nvd, _1g7p.nvm, _1g7p.si, _1g7p_SimpleText_0.pst, _1g7q.fdt, _1g7q.fdx, _1g7q.fnm, _1g7q.nvd, _1g7q.nvm, _1g7q.si, _1g7q_SimpleText_0.pst, _1g7r.fdt, _1g7r.fdx, _1g7r.fnm, _1g7r.nvd, _1g7r.nvm, _1g7r.si, _1g7r_SimpleText_0.pst, _1g7s.fdt, _1g7s.fdx, _1g7s.fnm, _1g7s.nvd, _1g7s.nvm, _1g7s.si, _1g7s_SimpleText_0.pst, _1g7t.fdt, _1g7t.fdx, _1g7t.fnm, _1g7t.nvd, _1g7t.nvm, _1g7t.si, _1g7t_SimpleText_0.pst, _1g7u.fdt, _1g7u.fdx, _1g7u.fnm, _1g7u.nvd, _1g7u.nvm, _1g7u.si, _1g7u_SimpleText_0.pst, _1g7v.fdt, _1g7v.fdx, _1g7v.fnm, _1g7v.nvd, _1g7v.nvm, _1g7v.si, _1g7v_SimpleText_0.pst, _1g7w.fdt, _1g7w.fdx, _1g7w.fnm, _1g7w.nvd, _1g7w.nvm, _1g7w.si, _1g7w_SimpleText_0.pst, _1g7x.fdt, _1g7x.fdx, _1g7x.fnm, _1g7x.nvd, _1g7x.nvm, _1g7x.si, _1g7x_SimpleText_0.pst, _1g7y.fdt, _1g7y.fdx, _1g7y.fnm, _1g7y.nvd, _1g7y.nvm, _1g7y.si, _1g7y_SimpleText_0.pst, _1g7z.fdt, _1g7z.fdx, _1g7z.fnm, _1g7z.nvd, _1g7z.nvm, _1g7z.si, _1g7z_SimpleText_0.pst, _1g80.fdt, _1g80.fdx, _1g80.fnm, _1g80.nvd, _1g80.nvm, _1g80.si, _1g80_SimpleText_0.pst, _1g81.fdt, _1g81.fdx, _1g81.fnm, _1g81.nvd, _1g81.nvm, _1g81.si, _1g81_SimpleText_0.pst, _1g82.fdt, _1g82.fdx, _1g82.fnm, _1g82.nvd, _1g82.nvm, _1g82.si, _1g82_SimpleText_0.pst, _1g83.fdt, _1g83.fdx, _1g83.fnm, _1g83.nvd, _1g83.nvm, _1g83.si, _1g83_SimpleText_0.pst, _1g84.fdt, _1g84.fdx, _1g84.fnm, _1g84.nvd, _1g84.nvm, _1g84.si, _1g84_SimpleText_0.pst, _1g85.fdt, _1g85.fdx, _1g85.fnm, _1g85.nvd, _1g85.nvm, _1g85.si, _1g85_SimpleText_0.pst, _1g86.fdt, _1g86.fdx, _1g86.fnm, _1g86.nvd, _1g86.nvm, _1g86.si, _1g86_SimpleText_0.pst, _1g87.fdt, _1g87.fdx, _1g87.fnm, _1g87.nvd, _1g87.nvm, _1g87.si, _1g87_SimpleText_0.pst, _1g88.fdt, _1g88.fdx, _1g88.fnm, _1g88.nvd, _1g88.nvm, _1g88.si, _1g88_SimpleText_0.pst, _1g89.fdt, _1g89.fdx, _1g89.fnm, _1g89.nvd, _1g89.nvm, _1g89.si, _1g89_SimpleText_0.pst, _1g8a.fdt, _1g8a.fdx, _1g8a.fnm, _1g8a.nvd, _1g8a.nvm, _1g8a.si, _1g8a_SimpleText_0.pst, _1g8b.fdt, _1g8b.fdx, _1g8b.fnm, _1g8b.nvd, _1g8b.nvm, _1g8b.si, _1g8b_SimpleText_0.pst, _1g8c.fdt, _1g8c.fdx, _1g8c.fnm, _1g8c.nvd, _1g8c.nvm, _1g8c.si, _1g8c_SimpleText_0.pst, _1g8d.fdt, _1g8d.fdx, _1g8d.fnm, _1g8d.nvd, _1g8d.nvm, _1g8d.si, _1g8d_SimpleText_0.pst, _1g8e.fdt, _1g8e.fdx, _1g8e.fnm, _1g8e.nvd, _1g8e.nvm, _1g8e.si, _1g8e_SimpleText_0.pst, _1g8f.fdt, _1g8f.fdx, _1g8f.fnm, _1g8f.nvd, _1g8f.nvm, _1g8f.si, _1g8f_SimpleText_0.pst, _1g8g.fdt, _1g8g.fdx, _1g8g.fnm, _1g8g.nvd, _1g8g.nvm, _1g8g.si, _1g8g_SimpleText_0.pst, _1g8h.fdt, _1g8h.fdx, _1g8h.fnm, _1g8h.nvd, _1g8h.nvm, _1g8h.si, _1g8h_SimpleText_0.pst, _1g8i.fdt, _1g8i.fdx, _1g8i.fnm, _1g8i.nvd, _1g8i.nvm, _1g8i.si, _1g8i_SimpleText_0.pst, _1g8j.fdt, _1g8j.fdx, _1g8j.fnm, _1g8j.nvd, _1g8j.nvm, _1g8j.si, _1g8j_SimpleText_0.pst, _1g8k.fdt, _1g8k.fdx, _1g8k.fnm, _1g8k.nvd, _1g8k.nvm, _1g8k.si, _1g8k_SimpleText_0.pst, _1g8l.fdt, _1g8l.fdx, _1g8l.fnm, _1g8l.nvd, _1g8l.nvm, _1g8l.si, _1g8l_SimpleText_0.pst, _1g8m.fdt, _1g8m.fdx, _1g8m.fnm, _1g8m.nvd, _1g8m.nvm, _1g8m.si, _1g8m_SimpleText_0.pst, _1g8n.fdt, _1g8n.fdx, _1g8n.fnm, _1g8n.nvd, _1g8n.nvm, _1g8n.si, _1g8n_SimpleText_0.pst, _1g8o.fdt, _1g8o.fdx, _1g8o.fnm, _1g8o.nvd, _1g8o.nvm, _1g8o.si, _1g8o_SimpleText_0.pst, _1g8p.fdt, _1g8p.fdx, _1g8p.fnm, _1g8p.nvd, _1g8p.nvm, _1g8p.si, _1g8p_SimpleText_0.pst, _1g8q.fdt, _1g8q.fdx, _1g8q.fnm, _1g8q.nvd, _1g8q.nvm, _1g8q.si, _1g8q_SimpleText_0.pst, _1g8r.fdt, _1g8r.fdx, _1g8r.fnm, _1g8r.nvd, _1g8r.nvm, _1g8r.si, _1g8r_SimpleText_0.pst, _1g8s.fdt, _1g8s.fdx, _1g8s.fnm, _1g8s.nvd, _1g8s.nvm, _1g8s.si, _1g8s_SimpleText_0.pst, _1g8t.fdt, _1g8t.fdx, _1g8t.fnm, _1g8t.nvd, _1g8t.nvm, _1g8t.si, _1g8t_SimpleText_0.pst, _1g8u.fdt, _1g8u.fdx, _1g8u.fnm, _1g8u.nvd, _1g8u.nvm, _1g8u.si, _1g8u_SimpleText_0.pst, _1g8v.fdt, _1g8v.fdx, _1g8v.fnm, _1g8v.nvd, _1g8v.nvm, _1g8v.si, _1g8v_SimpleText_0.pst, _1gkf.fdt, _1gkf.fdx, _1gkf.fnm, _1gkf.nvd, _1gkf.nvm, _1gkf.si, _1gkf_SimpleText_0.pst, _1gkg.fdt, _1gkg.fdx, _1gkg.fnm, _1gkg.nvd, _1gkg.nvm, _1gkg.si, _1gkg_SimpleText_0.pst, _1gkh.fdt, _1gkh.fdx, _1gkh.fnm, _1gkh.nvd, _1gkh.nvm, _1gkh.si, _1gkh_SimpleText_0.pst, _1gki.fdt, _1gki.fdx, _1gki.fnm, _1gki.nvd, _1gki.nvm, _1gki.si, _1gki_SimpleText_0.pst, _1gkj.fdt, _1gkj.fdx, _1gkj.fnm, _1gkj.nvd, _1gkj.nvm, _1gkj.si, _1gkj_SimpleText_0.pst, _1gkk.fdt, _1gkk.fdx, _1gkk.fnm, _1gkk.nvd, _1gkk.nvm, _1gkk.si, _1gkk_SimpleText_0.pst, _1gkl.fdt, _1gkl.fdx, _1gkl.fnm, _1gkl.nvd, _1gkl.nvm, _1gkl.si, _1gkl_SimpleText_0.pst, _1gkm.fdt, _1gkm.fdx, _1gkm.fnm, _1gkm.nvd, _1gkm.nvm, _1gkm.si, _1gkm_SimpleText_0.pst, _1gkn.fdt, _1gkn.fdx, _1gkn.fnm, _1gkn.nvd, _1gkn.nvm, _1gkn.si, _1gkn_SimpleText_0.pst, _1gko.fdt, _1gko.fdx, _1gko.fnm, _1gko.nvd, _1gko.nvm, _1gko.si, _1gko_SimpleText_0.pst, _1gkp.fdt, _1gkp.fdx, _1gkp.fnm, _1gkp.nvd, _1gkp.nvm, _1gkp.si, _1gkp_SimpleText_0.pst, _1gkq.fdt, _1gkq.fdx, _1gkq.fnm, _1gkq.nvd, _1gkq.nvm, _1gkq.si, _1gkq_SimpleText_0.pst, _1gkr.fdt, _1gkr.fdx, _1gkr.fnm, _1gkr.nvd, _1gkr.nvm, _1gkr.si, _1gkr_SimpleText_0.pst, _1gks.fdt, _1gks.fdx, _1gks.fnm, _1gks.nvd, _1gks.nvm, _1gks.si, _1gks_SimpleText_0.pst, _1gkt.fdt, _1gkt.fdx, _1gkt.fnm, _1gkt.nvd, _1gkt.nvm, _1gkt.si, _1gkt_SimpleText_0.pst, _1gku.fdt, _1gku.fdx, _1gku.fnm, _1gku.nvd, _1gku.nvm, _1gku.si, _1gku_SimpleText_0.pst, _1gkv.fdt, _1gkv.fdx, _1gkv.fnm, _1gkv.nvd, _1gkv.nvm, _1gkv.si, _1gkv_SimpleText_0.pst, _1gkw.fdt, _1gkw.fdx, _1gkw.fnm, _1gkw.nvd, _1gkw.nvm, _1gkw.si, _1gkw_SimpleText_0.pst, _1gkx.fdt, _1gkx.fdx, _1gkx.fnm, _1gkx.nvd, _1gkx.nvm, _1gkx.si, _1gkx_SimpleText_0.pst, _1gky.fdt, _1gky.fdx, _1gky.fnm, _1gky.nvd, _1gky.nvm, _1gky.si, _1gky_SimpleText_0.pst, _1gkz.fdt, _1gkz.fdx, _1gkz.fnm, _1gkz.nvd, _1gkz.nvm, _1gkz.si, _1gkz_SimpleText_0.pst, segments_2]}, {indexVersion=1385926509202,generation=3,filelist=[_1g8x.fdt, _1g8x.fdx, _1g8x.fnm, _1g8x.nvd, _1g8x.nvm, _1g8x.si, _1g8x_SimpleText_0.pst, _1gkf.fdt, _1gkf.fdx, _1gkf.fnm, _1gkf.nvd, _1gkf.nvm, _1gkf.si, _1gkf_SimpleText_0.pst, _1gkg.fdt, _1gkg.fdx, _1gkg.fnm, _1gkg.nvd, _1gkg.nvm, _1gkg.si, _1gkg_SimpleText_0.pst, _1gkh.fdt, _1gkh.fdx, _1gkh.fnm, _1gkh.nvd, _1gkh.nvm, _1gkh.si, _1gkh_SimpleText_0.pst, _1gki.fdt, _1gki.fdx, _1gki.fnm, _1gki.nvd, _1gki.nvm, _1gki.si, _1gki_SimpleText_0.pst, _1gkj.fdt, _1gkj.fdx, _1gkj.fnm, _1gkj.nvd, _1gkj.nvm, _1gkj.si, _1gkj_SimpleText_0.pst, _1gkk.fdt, _1gkk.fdx, _1gkk.fnm, _1gkk.nvd, _1gkk.nvm, _1gkk.si, _1gkk_SimpleText_0.pst, _1gkl.fdt, _1gkl.fdx, _1gkl.fnm, _1gkl.nvd, _1gkl.nvm, _1gkl.si, _1gkl_SimpleText_0.pst, _1gkm.fdt, _1gkm.fdx, _1gkm.fnm, _1gkm.nvd, _1gkm.nvm, _1gkm.si, _1gkm_SimpleText_0.pst, _1gkn.fdt, _1gkn.fdx, _1gkn.fnm, _1gkn.nvd, _1gkn.nvm, _1gkn.si, _1gkn_SimpleText_0.pst, _1gko.fdt, _1gko.fdx, _1gko.fnm, _1gko.nvd, _1gko.nvm, _1gko.si, _1gko_SimpleText_0.pst, _1gkp.fdt, _1gkp.fdx, _1gkp.fnm, _1gkp.nvd, _1gkp.nvm, _1gkp.si, _1gkp_SimpleText_0.pst, _1gkq.fdt, _1gkq.fdx, _1gkq.fnm, _1gkq.nvd, _1gkq.nvm, _1gkq.si, _1gkq_SimpleText_0.pst, _1gkr.fdt, _1gkr.fdx, _1gkr.fnm, _1gkr.nvd, _1gkr.nvm, _1gkr.si, _1gkr_SimpleText_0.pst, _1gks.fdt, _1gks.fdx, _1gks.fnm, _1gks.nvd, _1gks.nvm, _1gks.si, _1gks_SimpleText_0.pst, _1gkt.fdt, _1gkt.fdx, _1gkt.fnm, _1gkt.nvd, _1gkt.nvm, _1gkt.si, _1gkt_SimpleText_0.pst, _1gku.fdt, _1gku.fdx, _1gku.fnm, _1gku.nvd, _1gku.nvm, _1gku.si, _1gku_SimpleText_0.pst, _1gkv.fdt, _1gkv.fdx, _1gkv.fnm, _1gkv.nvd, _1gkv.nvm, _1gkv.si, _1gkv_SimpleText_0.pst, _1gkw.fdt, _1gkw.fdx, _1gkw.fnm, _1gkw.nvd, _1gkw.nvm, _1gkw.si, _1gkw_SimpleText_0.pst, _1gkx.fdt, _1gkx.fdx, _1gkx.fnm, _1gkx.nvd, _1gkx.nvm, _1gkx.si, _1gkx_SimpleText_0.pst, _1gky.fdt, _1gky.fdx, _1gky.fnm, _1gky.nvd, _1gky.nvm, _1gky.si, _1gky_SimpleText_0.pst, _1gkz.fdt, _1gkz.fdx, _1gkz.fnm, _1gkz.nvd, _1gkz.nvm, _1gkz.si, _1gkz_SimpleText_0.pst, segments_3]}]>
	at __randomizedtesting.SeedInfo.seed([362813F11CB09D89:13FF08C16CF8938A]:0)
	at org.junit.Assert.fail(Assert.java:93)
	at org.junit.Assert.failNotEquals(Assert.java:647)
	at org.junit.Assert.assertEquals(Assert.java:128)
	at org.junit.Assert.assertEquals(Assert.java:147)
	at org.apache.solr.handler.TestReplicationHandler.doTestReplicateAfterCoreReload(TestReplicationHandler.java:1179)
	at sun.reflect.NativeMethodAccessorImpl.invoke0(Native Method)
	at sun.reflect.NativeMethodAccessorImpl.invoke(NativeMethodAccessorImpl.java:57)
	at sun.reflect.DelegatingMethodAccessorImpl.invoke(DelegatingMethodAccessorImpl.java:43)
	at java.lang.reflect.Method.invoke(Method.java:606)
	at com.carrotsearch.randomizedtesting.RandomizedRunner.invoke(RandomizedRunner.java:1559)
	at com.carrotsearch.randomizedtesting.RandomizedRunner.access$600(RandomizedRunner.java:79)
	at com.carrotsearch.randomizedtesting.RandomizedRunner$6.evaluate(RandomizedRunner.java:737)
	at com.carrotsearch.randomizedtesting.RandomizedRunner$7.evaluate(RandomizedRunner.java:773)
	at com.carrotsearch.randomizedtesting.RandomizedRunner$8.evaluate(RandomizedRunner.java:787)
	at com.carrotsearch.randomizedtesting.rules.SystemPropertiesRestoreRule$1.evaluate(SystemPropertiesRestoreRule.java:53)
	at org.apache.lucene.util.TestRuleSetupTeardownChained$1.evaluate(TestRuleSetupTeardownChained.java:50)
	at org.apache.lucene.util.TestRuleFieldCacheSanity$1.evaluate(TestRuleFieldCacheSanity.java:51)
	at org.apache.lucene.util.AbstractBeforeAfterRule$1.evaluate(AbstractBeforeAfterRule.java:46)
	at com.carrotsearch.randomizedtesting.rules.SystemPropertiesInvariantRule$1.evaluate(SystemPropertiesInvariantRule.java:55)
	at org.apache.lucene.util.TestRuleThreadAndTestName$1.evaluate(TestRuleThreadAndTestName.java:49)
	at org.apache.lucene.util.TestRuleIgnoreAfterMaxFailures$1.evaluate(TestRuleIgnoreAfterMaxFailures.java:70)
	at org.apache.lucene.util.TestRuleMarkFailure$1.evaluate(TestRuleMarkFailure.java:48)
	at com.carrotsearch.randomizedtesting.rules.StatementAdapter.evaluate(StatementAdapter.java:36)
	at com.carrotsearch.randomizedtesting.ThreadLeakControl$StatementRunner.run(ThreadLeakControl.java:358)
	at com.carrotsearch.randomizedtesting.ThreadLeakControl.forkTimeoutingTask(ThreadLeakControl.java:782)
	at com.carrotsearch.randomizedtesting.ThreadLeakControl$3.evaluate(ThreadLeakControl.java:442)
	at com.carrotsearch.randomizedtesting.RandomizedRunner.runSingleTest(RandomizedRunner.java:746)
	at com.carrotsearch.randomizedtesting.RandomizedRunner$3.evaluate(RandomizedRunner.java:648)
	at com.carrotsearch.randomizedtesting.RandomizedRunner$4.evaluate(RandomizedRunner.java:682)
	at com.carrotsearch.randomizedtesting.RandomizedRunner$5.evaluate(RandomizedRunner.java:693)
	at com.carrotsearch.randomizedtesting.rules.StatementAdapter.evaluate(StatementAdapter.java:36)
	at com.carrotsearch.randomizedtesting.rules.SystemPropertiesRestoreRule$1.evaluate(SystemPropertiesRestoreRule.java:53)
	at org.apache.lucene.util.AbstractBeforeAfterRule$1.evaluate(AbstractBeforeAfterRule.java:46)
	at org.apache.lucene.util.TestRuleStoreClassName$1.evaluate(TestRuleStoreClassName.java:42)
	at com.carrotsearch.randomizedtesting.rules.SystemPropertiesInvariantRule$1.evaluate(SystemPropertiesInvariantRule.java:55)
	at com.carrotsearch.randomizedtesting.rules.NoShadowingOrOverridesOnMethodsRule$1.evaluate(NoShadowingOrOverridesOnMethodsRule.java:39)
	at com.carrotsearch.randomizedtesting.rules.NoShadowingOrOverridesOnMethodsRule$1.evaluate(NoShadowingOrOverridesOnMethodsRule.java:39)
	at com.carrotsearch.randomizedtesting.rules.StatementAdapter.evaluate(StatementAdapter.java:36)
	at org.apache.lucene.util.TestRuleAssertionsRequired$1.evaluate(TestRuleAssertionsRequired.java:43)
	at org.apache.lucene.util.TestRuleMarkFailure$1.evaluate(TestRuleMarkFailure.java:48)
	at org.apache.lucene.util.TestRuleIgnoreAfterMaxFailures$1.evaluate(TestRuleIgnoreAfterMaxFailures.java:70)
	at org.apache.lucene.util.TestRuleIgnoreTestSuites$1.evaluate(TestRuleIgnoreTestSuites.java:55)
	at com.carrotsearch.randomizedtesting.rules.StatementAdapter.evaluate(StatementAdapter.java:36)
	at com.carrotsearch.randomizedtesting.ThreadLeakControl$StatementRunner.run(ThreadLeakControl.java:358)
	at java.lang.Thread.run(Thread.java:724)




Build Log:
[...truncated 10361 lines...]
   [junit4] Suite: org.apache.solr.cloud.ChaosMonkeyNothingIsSafeTest
   [junit4]   2> 1162370 T2179 oas.BaseDistributedSearchTestCase.initHostContext Setting hostContext system property: /
   [junit4]   2> 1162378 T2179 oas.SolrTestCaseJ4.setUp ###Starting testDistribSearch
   [junit4]   2> Creating dataDir: /usr/home/hudson/hudson-slave/workspace/Lucene-Solr-NightlyTests-trunk/solr/build/solr-core/test/J1/./solrtest-ChaosMonkeyNothingIsSafeTest-1385924821353
   [junit4]   2> 1162379 T2179 oasc.ZkTestServer.run STARTING ZK TEST SERVER
   [junit4]   2> 1162380 T2180 oasc.ZkTestServer$ZKServerMain.runFromConfig Starting server
   [junit4]   2> 1162481 T2179 oasc.ZkTestServer.run start zk server on port:44387
   [junit4]   2> 1162482 T2179 oascc.ConnectionManager.waitForConnected Waiting for client to connect to ZooKeeper
   [junit4]   2> 1162486 T2186 oascc.ConnectionManager.process Watcher org.apache.solr.common.cloud.ConnectionManager@7ba8a7ab name:ZooKeeperConnection Watcher:127.0.0.1:44387 got event WatchedEvent state:SyncConnected type:None path:null path:null type:None
   [junit4]   2> 1162487 T2179 oascc.ConnectionManager.waitForConnected Client is connected to ZooKeeper
   [junit4]   2> 1162487 T2179 oascc.SolrZkClient.makePath makePath: /solr
   [junit4]   2> 1162500 T2179 oascc.ConnectionManager.waitForConnected Waiting for client to connect to ZooKeeper
   [junit4]   2> 1162502 T2188 oascc.ConnectionManager.process Watcher org.apache.solr.common.cloud.ConnectionManager@5ebdbded name:ZooKeeperConnection Watcher:127.0.0.1:44387/solr got event WatchedEvent state:SyncConnected type:None path:null path:null type:None
   [junit4]   2> 1162502 T2179 oascc.ConnectionManager.waitForConnected Client is connected to ZooKeeper
   [junit4]   2> 1162503 T2179 oascc.SolrZkClient.makePath makePath: /collections/collection1
   [junit4]   2> 1162513 T2179 oascc.SolrZkClient.makePath makePath: /collections/collection1/shards
   [junit4]   2> 1162516 T2179 oascc.SolrZkClient.makePath makePath: /collections/control_collection
   [junit4]   2> 1162519 T2179 oascc.SolrZkClient.makePath makePath: /collections/control_collection/shards
   [junit4]   2> 1162528 T2179 oasc.AbstractZkTestCase.putConfig put /usr/home/hudson/hudson-slave/workspace/Lucene-Solr-NightlyTests-trunk/solr/build/solr-core/test-files/solr/collection1/conf/solrconfig-tlog.xml to /configs/conf1/solrconfig.xml
   [junit4]   2> 1162529 T2179 oascc.SolrZkClient.makePath makePath: /configs/conf1/solrconfig.xml
   [junit4]   2> 1162541 T2179 oasc.AbstractZkTestCase.putConfig put /usr/home/hudson/hudson-slave/workspace/Lucene-Solr-NightlyTests-trunk/solr/build/solr-core/test-files/solr/collection1/conf/schema15.xml to /configs/conf1/schema.xml
   [junit4]   2> 1162542 T2179 oascc.SolrZkClient.makePath makePath: /configs/conf1/schema.xml
   [junit4]   2> 1162646 T2179 oasc.AbstractZkTestCase.putConfig put /usr/home/hudson/hudson-slave/workspace/Lucene-Solr-NightlyTests-trunk/solr/build/solr-core/test-files/solr/collection1/conf/solrconfig.snippet.randomindexconfig.xml to /configs/conf1/solrconfig.snippet.randomindexconfig.xml
   [junit4]   2> 1162647 T2179 oascc.SolrZkClient.makePath makePath: /configs/conf1/solrconfig.snippet.randomindexconfig.xml
   [junit4]   2> 1162651 T2179 oasc.AbstractZkTestCase.putConfig put /usr/home/hudson/hudson-slave/workspace/Lucene-Solr-NightlyTests-trunk/solr/build/solr-core/test-files/solr/collection1/conf/stopwords.txt to /configs/conf1/stopwords.txt
   [junit4]   2> 1162651 T2179 oascc.SolrZkClient.makePath makePath: /configs/conf1/stopwords.txt
   [junit4]   2> 1162655 T2179 oasc.AbstractZkTestCase.putConfig put /usr/home/hudson/hudson-slave/workspace/Lucene-Solr-NightlyTests-trunk/solr/build/solr-core/test-files/solr/collection1/conf/protwords.txt to /configs/conf1/protwords.txt
   [junit4]   2> 1162655 T2179 oascc.SolrZkClient.makePath makePath: /configs/conf1/protwords.txt
   [junit4]   2> 1162658 T2179 oasc.AbstractZkTestCase.putConfig put /usr/home/hudson/hudson-slave/workspace/Lucene-Solr-NightlyTests-trunk/solr/build/solr-core/test-files/solr/collection1/conf/currency.xml to /configs/conf1/currency.xml
   [junit4]   2> 1162659 T2179 oascc.SolrZkClient.makePath makePath: /configs/conf1/currency.xml
   [junit4]   2> 1162662 T2179 oasc.AbstractZkTestCase.putConfig put /usr/home/hudson/hudson-slave/workspace/Lucene-Solr-NightlyTests-trunk/solr/build/solr-core/test-files/solr/collection1/conf/enumsConfig.xml to /configs/conf1/enumsConfig.xml
   [junit4]   2> 1162663 T2179 oascc.SolrZkClient.makePath makePath: /configs/conf1/enumsConfig.xml
   [junit4]   2> 1162666 T2179 oasc.AbstractZkTestCase.putConfig put /usr/home/hudson/hudson-slave/workspace/Lucene-Solr-NightlyTests-trunk/solr/build/solr-core/test-files/solr/collection1/conf/open-exchange-rates.json to /configs/conf1/open-exchange-rates.json
   [junit4]   2> 1162666 T2179 oascc.SolrZkClient.makePath makePath: /configs/conf1/open-exchange-rates.json
   [junit4]   2> 1162674 T2179 oasc.AbstractZkTestCase.putConfig put /usr/home/hudson/hudson-slave/workspace/Lucene-Solr-NightlyTests-trunk/solr/build/solr-core/test-files/solr/collection1/conf/mapping-ISOLatin1Accent.txt to /configs/conf1/mapping-ISOLatin1Accent.txt
   [junit4]   2> 1162674 T2179 oascc.SolrZkClient.makePath makePath: /configs/conf1/mapping-ISOLatin1Accent.txt
   [junit4]   2> 1162678 T2179 oasc.AbstractZkTestCase.putConfig put /usr/home/hudson/hudson-slave/workspace/Lucene-Solr-NightlyTests-trunk/solr/build/solr-core/test-files/solr/collection1/conf/old_synonyms.txt to /configs/conf1/old_synonyms.txt
   [junit4]   2> 1162678 T2179 oascc.SolrZkClient.makePath makePath: /configs/conf1/old_synonyms.txt
   [junit4]   2> 1162681 T2179 oasc.AbstractZkTestCase.putConfig put /usr/home/hudson/hudson-slave/workspace/Lucene-Solr-NightlyTests-trunk/solr/build/solr-core/test-files/solr/collection1/conf/synonyms.txt to /configs/conf1/synonyms.txt
   [junit4]   2> 1162682 T2179 oascc.SolrZkClient.makePath makePath: /configs/conf1/synonyms.txt
   [junit4]   2> 1162999 T2179 oejs.Server.doStart jetty-8.1.10.v20130312
   [junit4]   2> 1163002 T2179 oejs.AbstractConnector.doStart Started SocketConnector@127.0.0.1:63120
   [junit4]   2> 1163003 T2179 oass.SolrDispatchFilter.init SolrDispatchFilter.init()
   [junit4]   2> 1163003 T2179 oasc.SolrResourceLoader.locateSolrHome JNDI not configured for solr (NoInitialContextEx)
   [junit4]   2> 1163004 T2179 oasc.SolrResourceLoader.locateSolrHome using system property solr.solr.home: ./org.apache.solr.cloud.ChaosMonkeyNothingIsSafeTest-controljetty-1385924821666
   [junit4]   2> 1163004 T2179 oasc.SolrResourceLoader.<init> new SolrResourceLoader for directory: './org.apache.solr.cloud.ChaosMonkeyNothingIsSafeTest-controljetty-1385924821666/'
   [junit4]   2> 1163044 T2179 oasc.ConfigSolr.fromFile Loading container configuration from /usr/home/hudson/hudson-slave/workspace/Lucene-Solr-NightlyTests-trunk/solr/build/solr-core/test/J1/./org.apache.solr.cloud.ChaosMonkeyNothingIsSafeTest-controljetty-1385924821666/solr.xml
   [junit4]   2> 1163141 T2179 oasc.CoreContainer.<init> New CoreContainer 777022888
   [junit4]   2> 1163141 T2179 oasc.CoreContainer.load Loading cores into CoreContainer [instanceDir=./org.apache.solr.cloud.ChaosMonkeyNothingIsSafeTest-controljetty-1385924821666/]
   [junit4]   2> 1163143 T2179 oashc.HttpShardHandlerFactory.getParameter Setting socketTimeout to: 90000
   [junit4]   2> 1163144 T2179 oashc.HttpShardHandlerFactory.getParameter Setting urlScheme to: http://
   [junit4]   2> 1163144 T2179 oashc.HttpShardHandlerFactory.getParameter Setting connTimeout to: 15000
   [junit4]   2> 1163144 T2179 oashc.HttpShardHandlerFactory.getParameter Setting maxConnectionsPerHost to: 20
   [junit4]   2> 1163145 T2179 oashc.HttpShardHandlerFactory.getParameter Setting corePoolSize to: 0
   [junit4]   2> 1163145 T2179 oashc.HttpShardHandlerFactory.getParameter Setting maximumPoolSize to: 2147483647
   [junit4]   2> 1163146 T2179 oashc.HttpShardHandlerFactory.getParameter Setting maxThreadIdleTime to: 5
   [junit4]   2> 1163146 T2179 oashc.HttpShardHandlerFactory.getParameter Setting sizeOfQueue to: -1
   [junit4]   2> 1163146 T2179 oashc.HttpShardHandlerFactory.getParameter Setting fairnessPolicy to: false
   [junit4]   2> 1163166 T2179 oasl.LogWatcher.createWatcher SLF4J impl is org.slf4j.impl.Log4jLoggerFactory
   [junit4]   2> 1163167 T2179 oasl.LogWatcher.newRegisteredLogWatcher Registering Log Listener [Log4j (org.slf4j.impl.Log4jLoggerFactory)]
   [junit4]   2> 1163167 T2179 oasc.CoreContainer.load Host Name: 127.0.0.1
   [junit4]   2> 1163167 T2179 oasc.ZkContainer.initZooKeeper Zookeeper client=127.0.0.1:44387/solr
   [junit4]   2> 1163168 T2179 oasc.ZkController.checkChrootPath zkHost includes chroot
   [junit4]   2> 1163169 T2179 oascc.ConnectionManager.waitForConnected Waiting for client to connect to ZooKeeper
   [junit4]   2> 1163172 T2199 oascc.ConnectionManager.process Watcher org.apache.solr.common.cloud.ConnectionManager@390f7ec1 name:ZooKeeperConnection Watcher:127.0.0.1:44387 got event WatchedEvent state:SyncConnected type:None path:null path:null type:None
   [junit4]   2> 1163173 T2179 oascc.ConnectionManager.waitForConnected Client is connected to ZooKeeper
   [junit4]   2> 1163220 T2179 oascc.ConnectionManager.waitForConnected Waiting for client to connect to ZooKeeper
   [junit4]   2> 1163222 T2201 oascc.ConnectionManager.process Watcher org.apache.solr.common.cloud.ConnectionManager@58f9b158 name:ZooKeeperConnection Watcher:127.0.0.1:44387/solr got event WatchedEvent state:SyncConnected type:None path:null path:null type:None
   [junit4]   2> 1163222 T2179 oascc.ConnectionManager.waitForConnected Client is connected to ZooKeeper
   [junit4]   2> 1163270 T2179 oascc.SolrZkClient.makePath makePath: /overseer/queue
   [junit4]   2> 1163274 T2179 oascc.SolrZkClient.makePath makePath: /overseer/collection-queue-work
   [junit4]   2> 1163312 T2179 oascc.SolrZkClient.makePath makePath: /live_nodes
   [junit4]   2> 1163315 T2179 oasc.ZkController.createEphemeralLiveNode Register node as live in ZooKeeper:/live_nodes/127.0.0.1:63120_
   [junit4]   2> 1163322 T2179 oascc.SolrZkClient.makePath makePath: /live_nodes/127.0.0.1:63120_
   [junit4]   2> 1163326 T2179 oascc.SolrZkClient.makePath makePath: /overseer_elect/election
   [junit4]   2> 1163340 T2179 oascc.SolrZkClient.makePath makePath: /overseer_elect/leader
   [junit4]   2> 1163349 T2179 oasc.Overseer.start Overseer (id=90827969092648963-127.0.0.1:63120_-n_0000000000) starting
   [junit4]   2> 1163354 T2179 oascc.SolrZkClient.makePath makePath: /overseer/queue-work
   [junit4]   2> 1163366 T2203 oasc.OverseerCollectionProcessor.run Process current queue of collection creations
   [junit4]   2> 1163367 T2179 oascc.SolrZkClient.makePath makePath: /clusterstate.json
   [junit4]   2> 1163369 T2179 oascc.SolrZkClient.makePath makePath: /aliases.json
   [junit4]   2> 1163376 T2179 oascc.ZkStateReader.createClusterStateWatchersAndUpdate Updating cluster state from ZooKeeper... 
   [junit4]   2> 1163379 T2202 oasc.Overseer$ClusterStateUpdater.run Starting to work on the main queue
   [junit4]   2> 1163385 T2204 oasc.ZkController.publish publishing core=collection1 state=down
   [junit4]   2> 1163385 T2204 oasc.ZkController.publish numShards not found on descriptor - reading it from system property
   [junit4]   2> 1163387 T2201 oasc.DistributedQueue$LatchChildWatcher.process LatchChildWatcher fired on path: /overseer/queue state: SyncConnected type NodeChildrenChanged
   [junit4]   2> 1163387 T2204 oasc.ZkController.waitForCoreNodeName look for our core node name
   [junit4]   2> 1163388 T2202 oascc.ZkStateReader.updateClusterState Updating cloud state from ZooKeeper... 
   [junit4]   2> 1163389 T2202 oasc.Overseer$ClusterStateUpdater.updateState Update state numShards=1 message={
   [junit4]   2> 	  "operation":"state",
   [junit4]   2> 	  "state":"down",
   [junit4]   2> 	  "base_url":"http://127.0.0.1:63120",
   [junit4]   2> 	  "core":"collection1",
   [junit4]   2> 	  "roles":null,
   [junit4]   2> 	  "node_name":"127.0.0.1:63120_",
   [junit4]   2> 	  "shard":null,
   [junit4]   2> 	  "shard_range":null,
   [junit4]   2> 	  "shard_state":"active",
   [junit4]   2> 	  "shard_parent":null,
   [junit4]   2> 	  "collection":"control_collection",
   [junit4]   2> 	  "numShards":"1",
   [junit4]   2> 	  "core_node_name":null}
   [junit4]   2> 1163389 T2202 oasc.Overseer$ClusterStateUpdater.createCollection Create collection control_collection with shards [shard1]
   [junit4]   2> 1163389 T2202 oasc.Overseer$ClusterStateUpdater.updateState Assigning new node to shard shard=shard1
   [junit4]   2> 1163392 T2201 oasc.DistributedQueue$LatchChildWatcher.process LatchChildWatcher fired on path: /overseer/queue state: SyncConnected type NodeChildrenChanged
   [junit4]   2> 1163401 T2201 oascc.ZkStateReader$2.process A cluster state change: WatchedEvent state:SyncConnected type:NodeDataChanged path:/clusterstate.json, has occurred - updating... (live nodes size: 1)
   [junit4]   2> 1164389 T2204 oasc.ZkController.waitForShardId waiting to find shard id in clusterstate for collection1
   [junit4]   2> 1164389 T2204 oasc.CoreContainer.create Creating SolrCore 'collection1' using instanceDir: ./org.apache.solr.cloud.ChaosMonkeyNothingIsSafeTest-controljetty-1385924821666/collection1
   [junit4]   2> 1164389 T2204 oasc.ZkController.createCollectionZkNode Check for collection zkNode:control_collection
   [junit4]   2> 1164390 T2204 oasc.ZkController.createCollectionZkNode Collection zkNode exists
   [junit4]   2> 1164390 T2204 oascc.ZkStateReader.readConfigName Load collection config from:/collections/control_collection
   [junit4]   2> 1164392 T2204 oasc.SolrResourceLoader.<init> new SolrResourceLoader for directory: './org.apache.solr.cloud.ChaosMonkeyNothingIsSafeTest-controljetty-1385924821666/collection1/'
   [junit4]   2> 1164393 T2204 oasc.SolrResourceLoader.replaceClassLoader Adding 'file:/usr/home/hudson/hudson-slave/workspace/Lucene-Solr-NightlyTests-trunk/solr/build/solr-core/test/J1/org.apache.solr.cloud.ChaosMonkeyNothingIsSafeTest-controljetty-1385924821666/collection1/lib/classes/' to classloader
   [junit4]   2> 1164394 T2204 oasc.SolrResourceLoader.replaceClassLoader Adding 'file:/usr/home/hudson/hudson-slave/workspace/Lucene-Solr-NightlyTests-trunk/solr/build/solr-core/test/J1/org.apache.solr.cloud.ChaosMonkeyNothingIsSafeTest-controljetty-1385924821666/collection1/lib/README' to classloader
   [junit4]   2> 1164459 T2204 oasc.SolrConfig.<init> Using Lucene MatchVersion: LUCENE_50
   [junit4]   2> 1164520 T2204 oasc.SolrConfig.<init> Loaded SolrConfig: solrconfig.xml
   [junit4]   2> 1164622 T2204 oass.IndexSchema.readSchema Reading Solr Schema from schema.xml
   [junit4]   2> 1164630 T2204 oass.IndexSchema.readSchema [collection1] Schema name=test
   [junit4]   2> 1165156 T2204 oass.IndexSchema.readSchema default search field in schema is text
   [junit4]   2> 1165160 T2204 oass.IndexSchema.readSchema unique key field: id
   [junit4]   2> 1165162 T2204 oass.FileExchangeRateProvider.reload Reloading exchange rates from file currency.xml
   [junit4]   2> 1165168 T2204 oass.FileExchangeRateProvider.reload Reloading exchange rates from file currency.xml
   [junit4]   2> 1165192 T2204 oasc.SolrCore.initDirectoryFactory solr.StandardDirectoryFactory
   [junit4]   2> 1165248 T2204 oasc.SolrCore.<init> [collection1] Opening new SolrCore at ./org.apache.solr.cloud.ChaosMonkeyNothingIsSafeTest-controljetty-1385924821666/collection1/, dataDir=./org.apache.solr.cloud.ChaosMonkeyNothingIsSafeTest-1385924821352/control/data/
   [junit4]   2> 1165249 T2204 oasc.JmxMonitoredMap.<init> JMX monitoring is enabled. Adding Solr mbeans to JMX Server: com.sun.jmx.mbeanserver.JmxMBeanServer@674a4cd9
   [junit4]   2> 1165251 T2204 oasc.CachingDirectoryFactory.get return new directory for /usr/home/hudson/hudson-slave/workspace/Lucene-Solr-NightlyTests-trunk/solr/build/solr-core/test/J1/org.apache.solr.cloud.ChaosMonkeyNothingIsSafeTest-1385924821352/control/data
   [junit4]   2> 1165252 T2204 oasc.SolrCore.getNewIndexDir New index directory detected: old=null new=./org.apache.solr.cloud.ChaosMonkeyNothingIsSafeTest-1385924821352/control/data/index/
   [junit4]   2> 1165253 T2204 oasc.SolrCore.initIndex WARN [collection1] Solr index directory './org.apache.solr.cloud.ChaosMonkeyNothingIsSafeTest-1385924821352/control/data/index' doesn't exist. Creating new index...
   [junit4]   2> 1165255 T2204 oasc.CachingDirectoryFactory.get return new directory for /usr/home/hudson/hudson-slave/workspace/Lucene-Solr-NightlyTests-trunk/solr/build/solr-core/test/J1/org.apache.solr.cloud.ChaosMonkeyNothingIsSafeTest-1385924821352/control/data/index
   [junit4]   2> 1165255 T2204 oasu.RandomMergePolicy.<init> RandomMergePolicy wrapping class org.apache.lucene.index.MockRandomMergePolicy: org.apache.lucene.index.MockRandomMergePolicy@741e3e9d
   [junit4]   2> 1165260 T2204 oasc.SolrDeletionPolicy.onCommit SolrDeletionPolicy.onCommit: commits: num=1
   [junit4]   2> 		commit{dir=/usr/home/hudson/hudson-slave/workspace/Lucene-Solr-NightlyTests-trunk/solr/build/solr-core/test/J1/org.apache.solr.cloud.ChaosMonkeyNothingIsSafeTest-1385924821352/control/data/index,segFN=segments_1,generation=1}
   [junit4]   2> 1165260 T2204 oasc.SolrDeletionPolicy.updateCommits newest commit generation = 1
   [junit4]   2> 1165265 T2204 oasup.UpdateRequestProcessorChain.init creating updateRequestProcessorChain "nodistrib"
   [junit4]   2> 1165265 T2204 oasup.UpdateRequestProcessorChain.init creating updateRequestProcessorChain "dedupe"
   [junit4]   2> 1165266 T2204 oasup.UpdateRequestProcessorChain.init inserting DistributedUpdateProcessorFactory into updateRequestProcessorChain "dedupe"
   [junit4]   2> 1165266 T2204 oasup.UpdateRequestProcessorChain.init creating updateRequestProcessorChain "stored_sig"
   [junit4]   2> 1165266 T2204 oasup.UpdateRequestProcessorChain.init inserting DistributedUpdateProcessorFactory into updateRequestProcessorChain "stored_sig"
   [junit4]   2> 1165266 T2204 oasup.UpdateRequestProcessorChain.init creating updateRequestProcessorChain "distrib-dup-test-chain-explicit"
   [junit4]   2> 1165267 T2204 oasup.UpdateRequestProcessorChain.init creating updateRequestProcessorChain "distrib-dup-test-chain-implicit"
   [junit4]   2> 1165267 T2204 oasup.UpdateRequestProcessorChain.init inserting DistributedUpdateProcessorFactory into updateRequestProcessorChain "distrib-dup-test-chain-implicit"
   [junit4]   2> 1165268 T2204 oasc.SolrCore.loadUpdateProcessorChains no updateRequestProcessorChain defined as default, creating implicit default
   [junit4]   2> 1165268 T2204 oasc.RequestHandlers.initHandlersFromConfig created standard: solr.StandardRequestHandler
   [junit4]   2> 1165269 T2204 oasc.RequestHandlers.initHandlersFromConfig created /get: solr.RealTimeGetHandler
   [junit4]   2> 1165269 T2204 oasc.RequestHandlers.initHandlersFromConfig adding lazy requestHandler: solr.ReplicationHandler
   [junit4]   2> 1165269 T2204 oasc.RequestHandlers.initHandlersFromConfig created /replication: solr.ReplicationHandler
   [junit4]   2> 1165270 T2204 oasc.RequestHandlers.initHandlersFromConfig created /update: solr.UpdateRequestHandler
   [junit4]   2> 1165270 T2204 oasc.RequestHandlers.initHandlersFromConfig created /admin/: org.apache.solr.handler.admin.AdminHandlers
   [junit4]   2> 1165271 T2204 oasc.RequestHandlers.initHandlersFromConfig created /admin/file: solr.admin.ShowFileRequestHandler
   [junit4]   2> 1165289 T2204 oashl.XMLLoader.init xsltCacheLifetimeSeconds=60
   [junit4]   2> 1165293 T2204 oasu.CommitTracker.<init> Hard AutoCommit: disabled
   [junit4]   2> 1165293 T2204 oasu.CommitTracker.<init> Soft AutoCommit: disabled
   [junit4]   2> 1165294 T2204 oasu.RandomMergePolicy.<init> RandomMergePolicy wrapping class org.apache.lucene.index.TieredMergePolicy: [TieredMergePolicy: maxMergeAtOnce=7, maxMergeAtOnceExplicit=4, maxMergedSegmentMB=58.0625, floorSegmentMB=0.4384765625, forceMergeDeletesPctAllowed=1.751535636816185, segmentsPerTier=50.0, maxCFSSegmentSizeMB=8.796093022207999E12, noCFSRatio=0.6794759673382234
   [junit4]   2> 1165296 T2204 oasc.SolrDeletionPolicy.onInit SolrDeletionPolicy.onInit: commits: num=1
   [junit4]   2> 		commit{dir=/usr/home/hudson/hudson-slave/workspace/Lucene-Solr-NightlyTests-trunk/solr/build/solr-core/test/J1/org.apache.solr.cloud.ChaosMonkeyNothingIsSafeTest-1385924821352/control/data/index,segFN=segments_1,generation=1}
   [junit4]   2> 1165296 T2204 oasc.SolrDeletionPolicy.updateCommits newest commit generation = 1
   [junit4]   2> 1165297 T2204 oass.SolrIndexSearcher.<init> Opening Searcher@4277c283 main
   [junit4]   2> 1165300 T2205 oasc.SolrCore.registerSearcher [collection1] Registered new searcher Searcher@4277c283 main{StandardDirectoryReader(segments_1:1:nrt)}
   [junit4]   2> 1165303 T2204 oasc.CoreContainer.registerCore registering core: collection1
   [junit4]   2> 1165303 T2204 oasc.ZkController.register Register replica - core:collection1 address:http://127.0.0.1:63120 collection:control_collection shard:shard1
   [junit4]   2> 1165304 T2204 oascc.SolrZkClient.makePath makePath: /collections/control_collection/leader_elect/shard1/election
   [junit4]   2> 1165329 T2204 oasc.ShardLeaderElectionContext.runLeaderProcess Running the leader process for shard shard1
   [junit4]   2> 1165337 T2201 oasc.DistributedQueue$LatchChildWatcher.process LatchChildWatcher fired on path: /overseer/queue state: SyncConnected type NodeChildrenChanged
   [junit4]   2> 1165338 T2204 oasc.ShardLeaderElectionContext.waitForReplicasToComeUp Enough replicas found to continue.
   [junit4]   2> 1165338 T2204 oasc.ShardLeaderElectionContext.runLeaderProcess I may be the new leader - try and sync
   [junit4]   2> ASYNC  NEW_CORE C1345 name=collection1 org.apache.solr.core.SolrCore@68424c1d url=http://127.0.0.1:63120/collection1 node=127.0.0.1:63120_ C1345_STATE=coll:control_collection core:collection1 props:{state=down, base_url=http://127.0.0.1:63120, core=collection1, node_name=127.0.0.1:63120_}
   [junit4]   2> 1165338 T2204 C1345 P63120 oasc.SyncStrategy.sync Sync replicas to http://127.0.0.1:63120/collection1/
   [junit4]   2> 1165339 T2202 oascc.ZkStateReader.updateClusterState Updating cloud state from ZooKeeper... 
   [junit4]   2> 1165342 T2201 oasc.DistributedQueue$LatchChildWatcher.process LatchChildWatcher fired on path: /overseer/queue state: SyncConnected type NodeChildrenChanged
   [junit4]   2> 1165351 T2201 oascc.ZkStateReader$2.process A cluster state change: WatchedEvent state:SyncConnected type:NodeDataChanged path:/clusterstate.json, has occurred - updating... (live nodes size: 1)
   [junit4]   2> 1166839 T2204 C1345 P63120 oasc.SyncStrategy.syncReplicas Sync Success - now sync replicas to me
   [junit4]   2> 1166839 T2204 C1345 P63120 oasc.SyncStrategy.syncToMe http://127.0.0.1:63120/collection1/ has no replicas
   [junit4]   2> 1166839 T2204 oasc.ShardLeaderElectionContext.runLeaderProcess I am the new leader: http://127.0.0.1:63120/collection1/ shard1
   [junit4]   2> 1166839 T2204 oascc.SolrZkClient.makePath makePath: /collections/control_collection/leaders/shard1
   [junit4]   2> 1166857 T2201 oasc.DistributedQueue$LatchChildWatcher.process LatchChildWatcher fired on path: /overseer/queue state: SyncConnected type NodeChildrenChanged
   [junit4]   2> 1166858 T2202 oascc.ZkStateReader.updateClusterState Updating cloud state from ZooKeeper... 
   [junit4]   2> 1166862 T2201 oasc.DistributedQueue$LatchChildWatcher.process LatchChildWatcher fired on path: /overseer/queue state: SyncConnected type NodeChildrenChanged
   [junit4]   2> 1166864 T2201 oascc.ZkStateReader$2.process A cluster state change: WatchedEvent state:SyncConnected type:NodeDataChanged path:/clusterstate.json, has occurred - updating... (live nodes size: 1)
   [junit4]   2> 1166908 T2204 oasc.ZkController.register We are http://127.0.0.1:63120/collection1/ and leader is http://127.0.0.1:63120/collection1/
   [junit4]   2> 1166908 T2204 oasc.ZkController.register No LogReplay needed for core=collection1 baseURL=http://127.0.0.1:63120
   [junit4]   2> 1166908 T2204 oasc.ZkController.checkRecovery I am the leader, no recovery necessary
   [junit4]   2> 1166908 T2204 oasc.ZkController.publish publishing core=collection1 state=active
   [junit4]   2> 1166909 T2204 oasc.ZkController.publish numShards not found on descriptor - reading it from system property
   [junit4]   2> 1166910 T2201 oasc.DistributedQueue$LatchChildWatcher.process LatchChildWatcher fired on path: /overseer/queue state: SyncConnected type NodeChildrenChanged
   [junit4]   2> 1166911 T2204 oascc.ZkStateReader.updateClusterState Updating cloud state from ZooKeeper... 
   [junit4]   2> 1166912 T2179 oass.SolrDispatchFilter.init user.dir=/usr/home/hudson/hudson-slave/workspace/Lucene-Solr-NightlyTests-trunk/solr/build/solr-core/test/J1
   [junit4]   2> 1166913 T2179 oass.SolrDispatchFilter.init SolrDispatchFilter.init() done
   [junit4]   2> 1166912 T2202 oascc.ZkStateReader.updateClusterState Updating cloud state from ZooKeeper... 
   [junit4]   2> 1166914 T2202 oasc.Overseer$ClusterStateUpdater.updateState Update state numShards=1 message={
   [junit4]   2> 	  "operation":"state",
   [junit4]   2> 	  "state":"active",
   [junit4]   2> 	  "base_url":"http://127.0.0.1:63120",
   [junit4]   2> 	  "core":"collection1",
   [junit4]   2> 	  "roles":null,
   [junit4]   2> 	  "node_name":"127.0.0.1:63120_",
   [junit4]   2> 	  "shard":"shard1",
   [junit4]   2> 	  "shard_range":null,
   [junit4]   2> 	  "shard_state":"active",
   [junit4]   2> 	  "shard_parent":null,
   [junit4]   2> 	  "collection":"control_collection",
   [junit4]   2> 	  "numShards":"1",
   [junit4]   2> 	  "core_node_name":"core_node1"}
   [junit4]   2> 1166915 T2179 oascc.ConnectionManager.waitForConnected Waiting for client to connect to ZooKeeper
   [junit4]   2> 1166918 T2208 oascc.ConnectionManager.process Watcher org.apache.solr.common.cloud.ConnectionManager@76de8d13 name:ZooKeeperConnection Watcher:127.0.0.1:44387/solr got event WatchedEvent state:SyncConnected type:None path:null path:null type:None
   [junit4]   2> 1166918 T2179 oascc.ConnectionManager.waitForConnected Client is connected to ZooKeeper
   [junit4]   2> 1166926 T2201 oasc.DistributedQueue$LatchChildWatcher.process LatchChildWatcher fired on path: /overseer/queue state: SyncConnected type NodeChildrenChanged
   [junit4]   2> 1166927 T2179 oascc.ZkStateReader.createClusterStateWatchersAndUpdate Updating cluster state from ZooKeeper... 
   [junit4]   2> 1166929 T2179 oasc.ChaosMonkey.monkeyLog monkey: init - expire sessions:false cause connection loss:false
   [junit4]   2> 1167030 T2208 oascc.ZkStateReader$2.process A cluster state change: WatchedEvent state:SyncConnected type:NodeDataChanged path:/clusterstate.json, has occurred - updating... (live nodes size: 1)
   [junit4]   2> 1167030 T2201 oascc.ZkStateReader$2.process A cluster state change: WatchedEvent state:SyncConnected type:NodeDataChanged path:/clusterstate.json, has occurred - updating... (live nodes size: 1)
   [junit4]   2> 1167247 T2179 oejs.Server.doStart jetty-8.1.10.v20130312
   [junit4]   2> 1167260 T2179 oejs.AbstractConnector.doStart Started SocketConnector@127.0.0.1:48452
   [junit4]   2> 1167261 T2179 oass.SolrDispatchFilter.init SolrDispatchFilter.init()
   [junit4]   2> 1167262 T2179 oasc.SolrResourceLoader.locateSolrHome JNDI not configured for solr (NoInitialContextEx)
   [junit4]   2> 1167262 T2179 oasc.SolrResourceLoader.locateSolrHome using system property solr.solr.home: ./org.apache.solr.cloud.ChaosMonkeyNothingIsSafeTest-jetty1-1385924825903
   [junit4]   2> 1167263 T2179 oasc.SolrResourceLoader.<init> new SolrResourceLoader for directory: './org.apache.solr.cloud.ChaosMonkeyNothingIsSafeTest-jetty1-1385924825903/'
   [junit4]   2> 1167305 T2179 oasc.ConfigSolr.fromFile Loading container configuration from /usr/home/hudson/hudson-slave/workspace/Lucene-Solr-NightlyTests-trunk/solr/build/solr-core/test/J1/./org.apache.solr.cloud.ChaosMonkeyNothingIsSafeTest-jetty1-1385924825903/solr.xml
   [junit4]   2> 1167406 T2179 oasc.CoreContainer.<init> New CoreContainer 674074719
   [junit4]   2> 1167406 T2179 oasc.CoreContainer.load Loading cores into CoreContainer [instanceDir=./org.apache.solr.cloud.ChaosMonkeyNothingIsSafeTest-jetty1-1385924825903/]
   [junit4]   2> 1167408 T2179 oashc.HttpShardHandlerFactory.getParameter Setting socketTimeout to: 90000
   [junit4]   2> 1167409 T2179 oashc.HttpShardHandlerFactory.getParameter Setting urlScheme to: http://
   [junit4]   2> 1167409 T2179 oashc.HttpShardHandlerFactory.getParameter Setting connTimeout to: 15000
   [junit4]   2> 1167409 T2179 oashc.HttpShardHandlerFactory.getParameter Setting maxConnectionsPerHost to: 20
   [junit4]   2> 1167410 T2179 oashc.HttpShardHandlerFactory.getParameter Setting corePoolSize to: 0
   [junit4]   2> 1167410 T2179 oashc.HttpShardHandlerFactory.getParameter Setting maximumPoolSize to: 2147483647
   [junit4]   2> 1167411 T2179 oashc.HttpShardHandlerFactory.getParameter Setting maxThreadIdleTime to: 5
   [junit4]   2> 1167411 T2179 oashc.HttpShardHandlerFactory.getParameter Setting sizeOfQueue to: -1
   [junit4]   2> 1167411 T2179 oashc.HttpShardHandlerFactory.getParameter Setting fairnessPolicy to: false
   [junit4]   2> 1167432 T2179 oasl.LogWatcher.createWatcher SLF4J impl is org.slf4j.impl.Log4jLoggerFactory
   [junit4]   2> 1167432 T2179 oasl.LogWatcher.newRegisteredLogWatcher Registering Log Listener [Log4j (org.slf4j.impl.Log4jLoggerFactory)]
   [junit4]   2> 1167433 T2179 oasc.CoreContainer.load Host Name: 127.0.0.1
   [junit4]   2> 1167433 T2179 oasc.ZkContainer.initZooKeeper Zookeeper client=127.0.0.1:44387/solr
   [junit4]   2> 1167434 T2179 oasc.ZkController.checkChrootPath zkHost includes chroot
   [junit4]   2> 1167435 T2179 oascc.ConnectionManager.waitForConnected Waiting for client to connect to ZooKeeper
   [junit4]   2> 1167437 T2219 oascc.ConnectionManager.process Watcher org.apache.solr.common.cloud.ConnectionManager@6cee08fb name:ZooKeeperConnection Watcher:127.0.0.1:44387 got event WatchedEvent state:SyncConnected type:None path:null path:null type:None
   [junit4]   2> 1167438 T2179 oascc.ConnectionManager.waitForConnected Client is connected to ZooKeeper
   [junit4]   2> 1167448 T2179 oascc.ConnectionManager.waitForConnected Waiting for client to connect to ZooKeeper
   [junit4]   2> 1167451 T2221 oascc.ConnectionManager.process Watcher org.apache.solr.common.cloud.ConnectionManager@7d02b73d name:ZooKeeperConnection Watcher:127.0.0.1:44387/solr got event WatchedEvent state:SyncConnected type:None path:null path:null type:None
   [junit4]   2> 1167451 T2179 oascc.ConnectionManager.waitForConnected Client is connected to ZooKeeper
   [junit4]   2> 1167461 T2179 oascc.ZkStateReader.createClusterStateWatchersAndUpdate Updating cluster state from ZooKeeper... 
   [junit4]   2> 1168464 T2179 oasc.ZkController.createEphemeralLiveNode Register node as live in ZooKeeper:/live_nodes/127.0.0.1:48452_
   [junit4]   2> 1168466 T2179 oascc.SolrZkClient.makePath makePath: /live_nodes/127.0.0.1:48452_
   [junit4]   2> 1168470 T2208 oascc.ZkStateReader$3.process Updating live nodes... (2)
   [junit4]   2> 1168470 T2221 oascc.ZkStateReader$3.process Updating live nodes... (2)
   [junit4]   2> 1168470 T2201 oascc.ZkStateReader$3.process Updating live nodes... (2)
   [junit4]   2> 1168477 T2222 oasc.ZkController.publish publishing core=collection1 state=down
   [junit4]   2> 1168477 T2222 oasc.ZkController.publish numShards not found on descriptor - reading it from system property
   [junit4]   2> 1168479 T2222 oasc.ZkController.waitForCoreNodeName look for our core node name
   [junit4]   2> 1168479 T2201 oasc.DistributedQueue$LatchChildWatcher.process LatchChildWatcher fired on path: /overseer/queue state: SyncConnected type NodeChildrenChanged
   [junit4]   2> 1168479 T2201 oasc.DistributedQueue$LatchChildWatcher.process LatchChildWatcher fired on path: /overseer/queue state: SyncConnected type NodeChildrenChanged
   [junit4]   2> 1168479 T2201 oasc.DistributedQueue$LatchChildWatcher.process LatchChildWatcher fired on path: /overseer/queue state: SyncConnected type NodeChildrenChanged
   [junit4]   2> 1168480 T2202 oascc.ZkStateReader.updateClusterState Updating cloud state from ZooKeeper... 
   [junit4]   2> 1168481 T2202 oasc.Overseer$ClusterStateUpdater.updateState Update state numShards=2 message={
   [junit4]   2> 	  "operation":"state",
   [junit4]   2> 	  "state":"down",
   [junit4]   2> 	  "base_url":"http://127.0.0.1:48452",
   [junit4]   2> 	  "core":"collection1",
   [junit4]   2> 	  "roles":null,
   [junit4]   2> 	  "node_name":"127.0.0.1:48452_",
   [junit4]   2> 	  "shard":null,
   [junit4]   2> 	  "shard_range":null,
   [junit4]   2> 	  "shard_state":"active",
   [junit4]   2> 	  "shard_parent":null,
   [junit4]   2> 	  "collection":"collection1",
   [junit4]   2> 	  "numShards":"2",
   [junit4]   2> 	  "core_node_name":null}
   [junit4]   2> 1168481 T2202 oasc.Overseer$ClusterStateUpdater.createCollection Create collection collection1 with shards [shard1, shard2]
   [junit4]   2> 1168481 T2202 oasc.Overseer$ClusterStateUpdater.updateState Assigning new node to shard shard=shard2
   [junit4]   2> 1168489 T2201 oasc.DistributedQueue$LatchChildWatcher.process LatchChildWatcher fired on path: /overseer/queue state: SyncConnected type NodeChildrenChanged
   [junit4]   2> 1168594 T2201 oascc.ZkStateReader$2.process A cluster state change: WatchedEvent state:SyncConnected type:NodeDataChanged path:/clusterstate.json, has occurred - updating... (live nodes size: 2)
   [junit4]   2> 1168594 T2208 oascc.ZkStateReader$2.process A cluster state change: WatchedEvent state:SyncConnected type:NodeDataChanged path:/clusterstate.json, has occurred - updating... (live nodes size: 2)
   [junit4]   2> 1168594 T2221 oascc.ZkStateReader$2.process A cluster state change: WatchedEvent state:SyncConnected type:NodeDataChanged path:/clusterstate.json, has occurred - updating... (live nodes size: 2)
   [junit4]   2> 1169481 T2222 oasc.ZkController.waitForShardId waiting to find shard id in clusterstate for collection1
   [junit4]   2> 1169481 T2222 oasc.CoreContainer.create Creating SolrCore 'collection1' using instanceDir: ./org.apache.solr.cloud.ChaosMonkeyNothingIsSafeTest-jetty1-1385924825903/collection1
   [junit4]   2> 1169481 T2222 oasc.ZkController.createCollectionZkNode Check for collection zkNode:collection1
   [junit4]   2> 1169482 T2222 oasc.ZkController.createCollectionZkNode Collection zkNode exists
   [junit4]   2> 1169482 T2222 oascc.ZkStateReader.readConfigName Load collection config from:/collections/collection1
   [junit4]   2> 1169483 T2222 oasc.SolrResourceLoader.<init> new SolrResourceLoader for directory: './org.apache.solr.cloud.ChaosMonkeyNothingIsSafeTest-jetty1-1385924825903/collection1/'
   [junit4]   2> 1169484 T2222 oasc.SolrResourceLoader.replaceClassLoader Adding 'file:/usr/home/hudson/hudson-slave/workspace/Lucene-Solr-NightlyTests-trunk/solr/build/solr-core/test/J1/org.apache.solr.cloud.ChaosMonkeyNothingIsSafeTest-jetty1-1385924825903/collection1/lib/classes/' to classloader
   [junit4]   2> 1169484 T2222 oasc.SolrResourceLoader.replaceClassLoader Adding 'file:/usr/home/hudson/hudson-slave/workspace/Lucene-Solr-NightlyTests-trunk/solr/build/solr-core/test/J1/org.apache.solr.cloud.ChaosMonkeyNothingIsSafeTest-jetty1-1385924825903/collection1/lib/README' to classloader
   [junit4]   2> 1169527 T2222 oasc.SolrConfig.<init> Using Lucene MatchVersion: LUCENE_50
   [junit4]   2> 1169569 T2222 oasc.SolrConfig.<init> Loaded SolrConfig: solrconfig.xml
   [junit4]   2> 1169671 T2222 oass.IndexSchema.readSchema Reading Solr Schema from schema.xml
   [junit4]   2> 1169681 T2222 oass.IndexSchema.readSchema [collection1] Schema name=test
   [junit4]   2> 1170153 T2222 oass.IndexSchema.readSchema default search field in schema is text
   [junit4]   2> 1170156 T2222 oass.IndexSchema.readSchema unique key field: id
   [junit4]   2> 1170158 T2222 oass.FileExchangeRateProvider.reload Reloading exchange rates from file currency.xml
   [junit4]   2> 1170162 T2222 oass.FileExchangeRateProvider.reload Reloading exchange rates from file currency.xml
   [junit4]   2> 1170183 T2222 oasc.SolrCore.initDirectoryFactory solr.StandardDirectoryFactory
   [junit4]   2> 1170183 T2222 oasc.SolrCore.<init> [collection1] Opening new SolrCore at ./org.apache.solr.cloud.ChaosMonkeyNothingIsSafeTest-jetty1-1385924825903/collection1/, dataDir=./org.apache.solr.cloud.ChaosMonkeyNothingIsSafeTest-1385924821352/jetty1/
   [junit4]   2> 1170183 T2222 oasc.JmxMonitoredMap.<init> JMX monitoring is enabled. Adding Solr mbeans to JMX Server: com.sun.jmx.mbeanserver.JmxMBeanServer@674a4cd9
   [junit4]   2> 1170184 T2222 oasc.CachingDirectoryFactory.get return new directory for /usr/home/hudson/hudson-slave/workspace/Lucene-Solr-NightlyTests-trunk/solr/build/solr-core/test/J1/org.apache.solr.cloud.ChaosMonkeyNothingIsSafeTest-1385924821352/jetty1
   [junit4]   2> 1170185 T2222 oasc.SolrCore.getNewIndexDir New index directory detected: old=null new=./org.apache.solr.cloud.ChaosMonkeyNothingIsSafeTest-1385924821352/jetty1/index/
   [junit4]   2> 1170186 T2222 oasc.SolrCore.initIndex WARN [collection1] Solr index directory './org.apache.solr.cloud.ChaosMonkeyNothingIsSafeTest-1385924821352/jetty1/index' doesn't exist. Creating new index...
   [junit4]   2> 1170187 T2222 oasc.CachingDirectoryFactory.get return new directory for /usr/home/hudson/hudson-slave/workspace/Lucene-Solr-NightlyTests-trunk/solr/build/solr-core/test/J1/org.apache.solr.cloud.ChaosMonkeyNothingIsSafeTest-1385924821352/jetty1/index
   [junit4]   2> 1170187 T2222 oasu.RandomMergePolicy.<init> RandomMergePolicy wrapping class org.apache.lucene.index.MockRandomMergePolicy: org.apache.lucene.index.MockRandomMergePolicy@4e1959b6
   [junit4]   2> 1170190 T2222 oasc.SolrDeletionPolicy.onCommit SolrDeletionPolicy.onCommit: commits: num=1
   [junit4]   2> 		commit{dir=/usr/home/hudson/hudson-slave/workspace/Lucene-Solr-NightlyTests-trunk/solr/build/solr-core/test/J1/org.apache.solr.cloud.ChaosMonkeyNothingIsSafeTest-1385924821352/jetty1/index,segFN=segments_1,generation=1}
   [junit4]   2> 1170191 T2222 oasc.SolrDeletionPolicy.updateCommits newest commit generation = 1
   [junit4]   2> 1170194 T2222 oasup.UpdateRequestProcessorChain.init creating updateRequestProcessorChain "nodistrib"
   [junit4]   2> 1170195 T2222 oasup.UpdateRequestProcessorChain.init creating updateRequestProcessorChain "dedupe"
   [junit4]   2> 1170195 T2222 oasup.UpdateRequestProcessorChain.init inserting DistributedUpdateProcessorFactory into updateRequestProcessorChain "dedupe"
   [junit4]   2> 1170195 T2222 oasup.UpdateRequestProcessorChain.init creating updateRequestProcessorChain "stored_sig"
   [junit4]   2> 1170195 T2222 oasup.UpdateRequestProcessorChain.init inserting DistributedUpdateProcessorFactory into updateRequestProcessorChain "stored_sig"
   [junit4]   2> 1170196 T2222 oasup.UpdateRequestProcessorChain.init creating updateRequestProcessorChain "distrib-dup-test-chain-explicit"
   [junit4]   2> 1170196 T2222 oasup.UpdateRequestProcessorChain.init creating updateRequestProcessorChain "distrib-dup-test-chain-implicit"
   [junit4]   2> 1170196 T2222 oasup.UpdateRequestProcessorChain.init inserting DistributedUpdateProcessorFactory into updateRequestProcessorChain "distrib-dup-test-chain-implicit"
   [junit4]   2> 1170196 T2222 oasc.SolrCore.loadUpdateProcessorChains no updateRequestProcessorChain defined as default, creating implicit default
   [junit4]   2> 1170197 T2222 oasc.RequestHandlers.initHandlersFromConfig created standard: solr.StandardRequestHandler
   [junit4]   2> 1170197 T2222 oasc.RequestHandlers.initHandlersFromConfig created /get: solr.RealTimeGetHandler
   [junit4]   2> 1170197 T2222 oasc.RequestHandlers.initHandlersFromConfig adding lazy requestHandler: solr.ReplicationHandler
   [junit4]   2> 1170198 T2222 oasc.RequestHandlers.initHandlersFromConfig created /replication: solr.ReplicationHandler
   [junit4]   2> 1170198 T2222 oasc.RequestHandlers.initHandlersFromConfig created /update: solr.UpdateRequestHandler
   [junit4]   2> 1170198 T2222 oasc.RequestHandlers.initHandlersFromConfig created /admin/: org.apache.solr.handler.admin.AdminHandlers
   [junit4]   2> 1170199 T2222 oasc.RequestHandlers.initHandlersFromConfig created /admin/file: solr.admin.ShowFileRequestHandler
   [junit4]   2> 1170212 T2222 oashl.XMLLoader.init xsltCacheLifetimeSeconds=60
   [junit4]   2> 1170215 T2222 oasu.CommitTracker.<init> Hard AutoCommit: disabled
   [junit4]   2> 1170215 T2222 oasu.CommitTracker.<init> Soft AutoCommit: disabled
   [junit4]   2> 1170216 T2222 oasu.RandomMergePolicy.<init> RandomMergePolicy wrapping class org.apache.lucene.index.TieredMergePolicy: [TieredMergePolicy: maxMergeAtOnce=7, maxMergeAtOnceExplicit=4, maxMergedSegmentMB=58.0625, floorSegmentMB=0.4384765625, forceMergeDeletesPctAllowed=1.751535636816185, segmentsPerTier=50.0, maxCFSSegmentSizeMB=8.796093022207999E12, noCFSRatio=0.6794759673382234
   [junit4]   2> 1170217 T2222 oasc.SolrDeletionPolicy.onInit SolrDeletionPolicy.onInit: commits: num=1
   [junit4]   2> 		commit{dir=/usr/home/hudson/hudson-slave/workspace/Lucene-Solr-NightlyTests-trunk/solr/build/solr-core/test/J1/org.apache.solr.cloud.ChaosMonkeyNothingIsSafeTest-1385924821352/jetty1/index,segFN=segments_1,generation=1}
   [junit4]   2> 1170217 T2222 oasc.SolrDeletionPolicy.updateCommits newest commit generation = 1
   [junit4]   2> 1170218 T2222 oass.SolrIndexSearcher.<init> Opening Searcher@322fa38f main
   [junit4]   2> 1170221 T2223 oasc.SolrCore.registerSearcher [collection1] Registered new searcher Searcher@322fa38f main{StandardDirectoryReader(segments_1:1:nrt)}
   [junit4]   2> 1170223 T2222 oasc.CoreContainer.registerCore registering core: collection1
   [junit4]   2> 1170224 T2222 oasc.ZkController.register Register replica - core:collection1 address:http://127.0.0.1:48452 collection:collection1 shard:shard2
   [junit4]   2> 1170224 T2222 oascc.SolrZkClient.makePath makePath: /collections/collection1/leader_elect/shard2/election
   [junit4]   2> 1170242 T2222 oasc.ShardLeaderElectionContext.runLeaderProcess Running the leader process for shard shard2
   [junit4]   2> 1170253 T2201 oasc.DistributedQueue$LatchChildWatcher.process LatchChildWatcher fired on path: /overseer/queue state: SyncConnected type NodeChildrenChanged
   [junit4]   2> 1170253 T2201 oasc.DistributedQueue$LatchChildWatcher.process LatchChildWatcher fired on path: /overseer/queue state: SyncConnected type NodeChildrenChanged
   [junit4]   2> 1170253 T2201 oasc.DistributedQueue$LatchChildWatcher.process LatchChildWatcher fired on path: /overseer/queue state: SyncConnected type NodeChildrenChanged
   [junit4]   2> 1170253 T2222 oasc.ShardLeaderElectionContext.waitForReplicasToComeUp Enough replicas found to continue.
   [junit4]   2> 1170254 T2222 oasc.ShardLeaderElectionContext.runLeaderProcess I may be the new leader - try and sync
   [junit4]   2> ASYNC  NEW_CORE C1346 name=collection1 org.apache.solr.core.SolrCore@576d60d7 url=http://127.0.0.1:48452/collection1 node=127.0.0.1:48452_ C1346_STATE=coll:collection1 core:collection1 props:{state=down, base_url=http://127.0.0.1:48452, core=collection1, node_name=127.0.0.1:48452_}
   [junit4]   2> 1170254 T2222 C1346 P48452 oasc.SyncStrategy.sync Sync replicas to http://127.0.0.1:48452/collection1/
   [junit4]   2> 1170255 T2202 oascc.ZkStateReader.updateClusterState Updating cloud state from ZooKeeper... 
   [junit4]   2> 1170258 T2201 oasc.DistributedQueue$LatchChildWatcher.process LatchChildWatcher fired on path: /overseer/queue state: SyncConnected type NodeChildrenChanged
   [junit4]   2> 1170267 T2221 oascc.ZkStateReader$2.process A cluster state change: WatchedEvent state:SyncConnected type:NodeDataChanged path:/clusterstate.json, has occurred - updating... (live nodes size: 2)
   [junit4]   2> 1170267 T2208 oascc.ZkStateReader$2.process A cluster state change: WatchedEvent state:SyncConnected type:NodeDataChanged path:/clusterstate.json, has occurred - updating... (live nodes size: 2)
   [junit4]   2> 1170267 T2201 oascc.ZkStateReader$2.process A cluster state change: WatchedEvent state:SyncConnected type:NodeDataChanged path:/clusterstate.json, has occurred - updating... (live nodes size: 2)
   [junit4]   2> 1171755 T2222 C1346 P48452 oasc.SyncStrategy.syncReplicas Sync Success - now sync replicas to me
   [junit4]   2> 1171755 T2222 C1346 P48452 oasc.SyncStrategy.syncToMe http://127.0.0.1:48452/collection1/ has no replicas
   [junit4]   2> 1171755 T2222 oasc.ShardLeaderElectionContext.runLeaderProcess I am the new leader: http://127.0.0.1:48452/collection1/ shard2
   [junit4]   2> 1171755 T2222 oascc.SolrZkClient.makePath makePath: /collections/collection1/leaders/shard2
   [junit4]   2> 1171773 T2201 oasc.DistributedQueue$LatchChildWatcher.process LatchChildWatcher fired on path: /overseer/queue state: SyncConnected type NodeChildrenChanged
   [junit4]   2> 1171774 T2202 oascc.ZkStateReader.updateClusterState Updating cloud state from ZooKeeper... 
   [junit4]   2> 1171778 T2201 oasc.DistributedQueue$LatchChildWatcher.process LatchChildWatcher fired on path: /overseer/queue state: SyncConnected type NodeChildrenChanged
   [junit4]   2> 1171779 T2201 oascc.ZkStateReader$2.process A cluster state change: WatchedEvent state:SyncConnected type:NodeDataChanged path:/clusterstate.json, has occurred - updating... (live nodes size: 2)
   [junit4]   2> 1171779 T2221 oascc.ZkStateReader$2.process A cluster state change: WatchedEvent state:SyncConnected type:NodeDataChanged path:/clusterstate.json, has occurred - updating... (live nodes size: 2)
   [junit4]   2> 1171779 T2208 oascc.ZkStateReader$2.process A cluster state change: WatchedEvent state:SyncConnected type:NodeDataChanged path:/clusterstate.json, has occurred - updating... (live nodes size: 2)
   [junit4]   2> 1171824 T2222 oasc.ZkController.register We are http://127.0.0.1:48452/collection1/ and leader is http://127.0.0.1:48452/collection1/
   [junit4]   2> 1171824 T2222 oasc.ZkController.register No LogReplay needed for core=collection1 baseURL=http://127.0.0.1:48452
   [junit4]   2> 1171824 T2222 oasc.ZkController.checkRecovery I am the leader, no recovery necessary
   [junit4]   2> 1171824 T2222 oasc.ZkController.publish publishing core=collection1 state=active
   [junit4]   2> 1171824 T2222 oasc.ZkController.publish numShards not found on descriptor - reading it from system property
   [junit4]   2> 1171826 T2201 oasc.DistributedQueue$LatchChildWatcher.process LatchChildWatcher fired on path: /overseer/queue state: SyncConnected type NodeChildrenChanged
   [junit4]   2> 1171827 T2222 oascc.ZkStateReader.updateClusterState Updating cloud state from ZooKeeper... 
   [junit4]   2> 1171828 T2202 oascc.ZkStateReader.updateClusterState Updating cloud state from ZooKeeper... 
   [junit4]   2> 1171828 T2179 oass.SolrDispatchFilter.init user.dir=/usr/home/hudson/hudson-slave/workspace/Lucene-Solr-NightlyTests-trunk/solr/build/solr-core/test/J1
   [junit4]   2> 1171828 T2202 oasc.Overseer$ClusterStateUpdater.updateState Update state numShards=2 message={
   [junit4]   2> 	  "operation":"state",
   [junit4]   2> 	  "state":"active",
   [junit4]   2> 	  "base_url":"http://127.0.0.1:48452",
   [junit4]   2> 	  "core":"collection1",
   [junit4]   2> 	  "roles":null,
   [junit4]   2> 	  "node_name":"127.0.0.1:48452_",
   [junit4]   2> 	  "shard":"shard2",
   [junit4]   2> 	  "shard_range":null,
   [junit4]   2> 	  "shard_state":"active",
   [junit4]   2> 	  "shard_parent":null,
   [junit4]   2> 	  "collection":"collection1",
   [junit4]   2> 	  "numShards":"2",
   [junit4]   2> 	  "core_node_name":"core_node1"}
   [junit4]   2> 1171828 T2179 oass.SolrDispatchFilter.init SolrDispatchFilter.init() done
   [junit4]   2> 1171838 T2201 oasc.DistributedQueue$LatchChildWatcher.process LatchChildWatcher fired on path: /overseer/queue state: SyncConnected type NodeChildrenChanged
   [junit4]   2> 1171942 T2208 oascc.ZkStateReader$2.process A cluster state change: WatchedEvent state:SyncConnected type:NodeDataChanged path:/clusterstate.json, has occurred - updating... (live nodes size: 2)
   [junit4]   2> 1171942 T2221 oascc.ZkStateReader$2.process A cluster state change: WatchedEvent state:SyncConnected type:NodeDataChanged path:/clusterstate.json, has occurred - updating... (live nodes size: 2)
   [junit4]   2> 1171942 T2201 oascc.ZkStateReader$2.process A cluster state change: WatchedEvent state:SyncConnected type:NodeDataChanged path:/clusterstate.json, has occurred - updating... (live nodes size: 2)
   [junit4]   2> 1172133 T2179 oejs.Server.doStart jetty-8.1.10.v20130312
   [junit4]   2> 1172136 T2179 oejs.AbstractConnector.doStart Started SocketConnector@127.0.0.1:21430
   [junit4]   2> 1172137 T2179 oass.SolrDispatchFilter.init SolrDispatchFilter.init()
   [junit4]   2> 1172137 T2179 oasc.SolrResourceLoader.locateSolrHome JNDI not configured for solr (NoInitialContextEx)
   [junit4]   2> 1172138 T2179 oasc.SolrResourceLoader.locateSolrHome using system property solr.solr.home: ../../../../../../../../../../../usr/home/hudson/hudson-slave/workspace/Lucene-Solr-NightlyTests-trunk/solr/build/solr-core/test/J1/./org.apache.solr.cloud.ChaosMonkeyNothingIsSafeTest-jetty2-1385924830804
   [junit4]   2> 1172138 T2179 oasc.SolrResourceLoader.<init> new SolrResourceLoader for directory: '../../../../../../../../../../../usr/home/hudson/hudson-slave/workspace/Lucene-Solr-NightlyTests-trunk/solr/build/solr-core/test/J1/./org.apache.solr.cloud.ChaosMonkeyNothingIsSafeTest-jetty2-1385924830804/'
   [junit4]   2> 1172177 T2179 oasc.ConfigSolr.fromFile Loading container configuration from /usr/home/hudson/hudson-slave/workspace/Lucene-Solr-NightlyTests-trunk/solr/build/solr-core/test/J1/../../../../../../../../../../../usr/home/hudson/hudson-slave/workspace/Lucene-Solr-NightlyTests-trunk/solr/build/solr-core/test/J1/./org.apache.solr.cloud.ChaosMonkeyNothingIsSafeTest-jetty2-1385924830804/solr.xml
   [junit4]   2> 1172250 T2179 oasc.CoreContainer.<init> New CoreContainer 1829496599
   [junit4]   2> 1172250 T2179 oasc.CoreContainer.load Loading cores into CoreContainer [instanceDir=../../../../../../../../../../../usr/home/hudson/hudson-slave/workspace/Lucene-Solr-NightlyTests-trunk/solr/build/solr-core/test/J1/./org.apache.solr.cloud.ChaosMonkeyNothingIsSafeTest-jetty2-1385924830804/]
   [junit4]   2> 1172251 T2179 oashc.HttpShardHandlerFactory.getParameter Setting socketTimeout to: 90000
   [junit4]   2> 1172252 T2179 oashc.HttpShardHandlerFactory.getParameter Setting urlScheme to: http://
   [junit4]   2> 1172252 T2179 oashc.HttpShardHandlerFactory.getParameter Setting connTimeout to: 15000
   [junit4]   2> 1172252 T2179 oashc.HttpShardHandlerFactory.getParameter Setting maxConnectionsPerHost to: 20
   [junit4]   2> 1172252 T2179 oashc.HttpShardHandlerFactory.getParameter Setting corePoolSize to: 0
   [junit4]   2> 1172253 T2179 oashc.HttpShardHandlerFactory.getParameter Setting maximumPoolSize to: 2147483647
   [junit4]   2> 1172253 T2179 oashc.HttpShardHandlerFactory.getParameter Setting maxThreadIdleTime to: 5
   [junit4]   2> 1172253 T2179 oashc.HttpShardHandlerFactory.getParameter Setting sizeOfQueue to: -1
   [junit4]   2> 1172253 T2179 oashc.HttpShardHandlerFactory.getParameter Setting fairnessPolicy to: false
   [junit4]   2> 1172266 T2179 oasl.LogWatcher.createWatcher SLF4J impl is org.slf4j.impl.Log4jLoggerFactory
   [junit4]   2> 1172266 T2179 oasl.LogWatcher.newRegisteredLogWatcher Registering Log Listener [Log4j (org.slf4j.impl.Log4jLoggerFactory)]
   [junit4]   2> 1172267 T2179 oasc.CoreContainer.load Host Name: 127.0.0.1
   [junit4]   2> 1172267 T2179 oasc.ZkContainer.initZooKeeper Zookeeper client=127.0.0.1:44387/solr
   [junit4]   2> 1172267 T2179 oasc.ZkController.checkChrootPath zkHost includes chroot
   [junit4]   2> 1172268 T2179 oascc.ConnectionManager.waitForConnected Waiting for client to connect to ZooKeeper
   [junit4]   2> 1172270 T2235 oa

[...truncated too long message...]

 oasc.SolrCore.close [collection1]  CLOSING SolrCore org.apache.solr.core.SolrCore@2a31ab2
   [junit4]   2> 2862692 T2482 oasu.DirectUpdateHandler2.close closing DirectUpdateHandler2{commits=2,autocommits=0,soft autocommits=0,optimizes=0,rollbacks=0,expungeDeletes=0,docsPending=0,adds=0,deletesById=0,deletesByQuery=0,errors=0,cumulative_adds=496,cumulative_deletesById=0,cumulative_deletesByQuery=1,cumulative_errors=0}
   [junit4]   2> 2862693 T2482 oasu.SolrCoreState.decrefSolrCoreState Closing SolrCoreState
   [junit4]   2> 2862693 T2482 oasu.DefaultSolrCoreState.closeIndexWriter SolrCoreState ref count has reached 0 - closing IndexWriter
   [junit4]   2> 2862693 T2482 oasu.DefaultSolrCoreState.closeIndexWriter closing IndexWriter with IndexWriterCloser
   [junit4]   2> 2862694 T2482 oasc.SolrCore.closeSearcher [collection1] Closing main searcher on request.
   [junit4]   2> 2862695 T2482 oasc.CachingDirectoryFactory.close Closing MockDirectoryFactory - 2 directories currently being tracked
   [junit4]   2> 2862695 T2482 oasc.CachingDirectoryFactory.closeCacheValue looking to close /usr/home/hudson/hudson-slave/workspace/Lucene-Solr-NightlyTests-trunk/solr/build/solr-core/test/J0/./org.apache.solr.handler.TestReplicationHandler$SolrInstance-1385926517072/master/collection1/data/index.20131201133520692 [CachedDir<<refCount=0;path=/usr/home/hudson/hudson-slave/workspace/Lucene-Solr-NightlyTests-trunk/solr/build/solr-core/test/J0/./org.apache.solr.handler.TestReplicationHandler$SolrInstance-1385926517072/master/collection1/data/index.20131201133520692;done=false>>]
   [junit4]   2> 2862696 T2482 oasc.CachingDirectoryFactory.close Closing directory: /usr/home/hudson/hudson-slave/workspace/Lucene-Solr-NightlyTests-trunk/solr/build/solr-core/test/J0/./org.apache.solr.handler.TestReplicationHandler$SolrInstance-1385926517072/master/collection1/data/index.20131201133520692
   [junit4]   2> 2862696 T2482 oasc.CachingDirectoryFactory.closeCacheValue looking to close /usr/home/hudson/hudson-slave/workspace/Lucene-Solr-NightlyTests-trunk/solr/build/solr-core/test/J0/./org.apache.solr.handler.TestReplicationHandler$SolrInstance-1385926517072/master/collection1/data [CachedDir<<refCount=0;path=/usr/home/hudson/hudson-slave/workspace/Lucene-Solr-NightlyTests-trunk/solr/build/solr-core/test/J0/./org.apache.solr.handler.TestReplicationHandler$SolrInstance-1385926517072/master/collection1/data;done=false>>]
   [junit4]   2> 2862697 T2482 oasc.CachingDirectoryFactory.close Closing directory: /usr/home/hudson/hudson-slave/workspace/Lucene-Solr-NightlyTests-trunk/solr/build/solr-core/test/J0/./org.apache.solr.handler.TestReplicationHandler$SolrInstance-1385926517072/master/collection1/data
   [junit4]   2> 2862697 T2482 oejsh.ContextHandler.doStop stopped o.e.j.s.ServletContextHandler{/solr,null}
   [junit4]   2> 2862750 T2482 oasc.CoreContainer.shutdown Shutting down CoreContainer instance=747137030
   [junit4]   2> 2862751 T2482 oasc.SolrCore.close [collection1]  CLOSING SolrCore org.apache.solr.core.SolrCore@27cf577
   [junit4]   2> 2862751 T2482 oasu.DirectUpdateHandler2.close closing DirectUpdateHandler2{commits=2,autocommits=0,soft autocommits=0,optimizes=0,rollbacks=0,expungeDeletes=0,docsPending=0,adds=0,deletesById=0,deletesByQuery=0,errors=0,cumulative_adds=3,cumulative_deletesById=0,cumulative_deletesByQuery=1,cumulative_errors=0}
   [junit4]   2> 2862753 T2482 oasu.SolrCoreState.decrefSolrCoreState Closing SolrCoreState
   [junit4]   2> 2862753 T2482 oasu.DefaultSolrCoreState.closeIndexWriter SolrCoreState ref count has reached 0 - closing IndexWriter
   [junit4]   2> 2862753 T2482 oasu.DefaultSolrCoreState.closeIndexWriter closing IndexWriter with IndexWriterCloser
   [junit4]   2> 2862754 T2482 C2811 oasc.SolrDeletionPolicy.onCommit SolrDeletionPolicy.onCommit: commits: num=2
   [junit4]   2> 		commit{dir=MockDirectoryWrapper(org.apache.lucene.store.RAMDirectory@22b75826 lockFactory=org.apache.lucene.store.SingleInstanceLockFactory@7a089353),segFN=segments_3,generation=3}
   [junit4]   2> 		commit{dir=MockDirectoryWrapper(org.apache.lucene.store.RAMDirectory@22b75826 lockFactory=org.apache.lucene.store.SingleInstanceLockFactory@7a089353),segFN=segments_4,generation=4}
   [junit4]   2> 2862755 T2482 C2811 oasc.SolrDeletionPolicy.updateCommits newest commit generation = 4
   [junit4]   2> 2862755 T2482 oasc.SolrCore.closeSearcher [collection1] Closing main searcher on request.
   [junit4]   2> 2862756 T2482 oasc.CachingDirectoryFactory.close Closing MockDirectoryFactory - 2 directories currently being tracked
   [junit4]   2> 2862756 T2482 oasc.CachingDirectoryFactory.closeCacheValue looking to close /usr/home/hudson/hudson-slave/workspace/Lucene-Solr-NightlyTests-trunk/solr/build/solr-core/test/J0/./org.apache.solr.handler.TestReplicationHandler$SolrInstance-1385926517353/slave/collection1/data [CachedDir<<refCount=0;path=/usr/home/hudson/hudson-slave/workspace/Lucene-Solr-NightlyTests-trunk/solr/build/solr-core/test/J0/./org.apache.solr.handler.TestReplicationHandler$SolrInstance-1385926517353/slave/collection1/data;done=false>>]
   [junit4]   2> 2862757 T2482 oasc.CachingDirectoryFactory.close Closing directory: /usr/home/hudson/hudson-slave/workspace/Lucene-Solr-NightlyTests-trunk/solr/build/solr-core/test/J0/./org.apache.solr.handler.TestReplicationHandler$SolrInstance-1385926517353/slave/collection1/data
   [junit4]   2> 2862757 T2482 oasc.CachingDirectoryFactory.closeCacheValue looking to close /usr/home/hudson/hudson-slave/workspace/Lucene-Solr-NightlyTests-trunk/solr/build/solr-core/test/J0/./org.apache.solr.handler.TestReplicationHandler$SolrInstance-1385926517353/slave/collection1/data/index.20131201133519610 [CachedDir<<refCount=0;path=/usr/home/hudson/hudson-slave/workspace/Lucene-Solr-NightlyTests-trunk/solr/build/solr-core/test/J0/./org.apache.solr.handler.TestReplicationHandler$SolrInstance-1385926517353/slave/collection1/data/index.20131201133519610;done=false>>]
   [junit4]   2> 2862758 T2482 oasc.CachingDirectoryFactory.close Closing directory: /usr/home/hudson/hudson-slave/workspace/Lucene-Solr-NightlyTests-trunk/solr/build/solr-core/test/J0/./org.apache.solr.handler.TestReplicationHandler$SolrInstance-1385926517353/slave/collection1/data/index.20131201133519610
   [junit4]   2> 2862758 T2482 oejsh.ContextHandler.doStop stopped o.e.j.s.ServletContextHandler{/solr,null}
   [junit4]   2> 2862822 T2482 oas.SolrTestCaseJ4.deleteCore ###deleteCore
   [junit4]   2> NOTE: test params are: codec=Lucene46: {newname=PostingsFormat(name=SimpleText), id=PostingsFormat(name=SimpleText), name=PostingsFormat(name=SimpleText)}, docValues:{}, sim=RandomSimilarityProvider(queryNorm=true,coord=yes): {}, locale=hi_IN, timezone=America/Indiana/Knox
   [junit4]   2> NOTE: FreeBSD 9.1-RELEASE-p3 amd64/Oracle Corporation 1.7.0_25 (64-bit)/cpus=16,threads=1,free=256348624,total=500105216
   [junit4]   2> NOTE: All tests run in this JVM: [TestMergePolicyConfig, TestLFUCache, TestFieldCollectionResource, TestCloudManagedSchemaAddField, QueryElevationComponentTest, HdfsCollectionsAPIDistributedZkTest, HdfsBasicDistributedZk2Test, TestCollationFieldDocValues, ParsingFieldUpdateProcessorsTest, UUIDFieldTest, AbstractAnalyticsFacetTest, TestExtendedDismaxParser, HdfsSyncSliceTest, PeerSyncTest, CoreAdminCreateDiscoverTest, LoggingHandlerTest, TestPostingsSolrHighlighter, BasicDistributedZkTest, SynonymTokenizerTest, ResourceLoaderTest, SyncSliceTest, TestDynamicFieldCollectionResource, TestSort, LegacyHTMLStripCharFilterTest, HdfsBasicDistributedZkTest, TestDocSet, TestStressVersions, OverseerTest, WordBreakSolrSpellCheckerTest, TestQueryUtils, SolrTestCaseJ4Test, TestCoreContainer, TestSolrXMLSerializer, SuggesterFSTTest, BasicFunctionalityTest, CopyFieldTest, SpatialFilterTest, TestShardHandlerFactory, LeaderElectionTest, BJQParserTest, TestSearchPerf, ZkControllerTest, MBeansHandlerTest, SliceStateTest, ShardSplitTest, BlockCacheTest, ClusterStateUpdateTest, TestTrie, TestHighFrequencyDictionaryFactory, SearchHandlerTest, IndexSchemaTest, UpdateRequestProcessorFactoryTest, HdfsLockFactoryTest, PolyFieldTest, HdfsRecoveryZkTest, SoftAutoCommitTest, TestValueSourceCache, EchoParamsTest, CoreAdminHandlerTest, TestBadConfig, TestReloadAndDeleteDocs, SliceStateUpdateTest, URLClassifyProcessorTest, DocumentBuilderTest, RecoveryZkTest, SolrCoreTest, TestJoin, TestJmxMonitoredMap, PrimitiveFieldTypeTest, TestReplicationHandler]
   [junit4] Completed on J0 in 1673.01s, 14 tests, 1 failure <<< FAILURES!

[...truncated 584 lines...]
BUILD FAILED
/usr/home/hudson/hudson-slave/workspace/Lucene-Solr-NightlyTests-trunk/build.xml:427: The following error occurred while executing this line:
/usr/home/hudson/hudson-slave/workspace/Lucene-Solr-NightlyTests-trunk/build.xml:400: The following error occurred while executing this line:
/usr/home/hudson/hudson-slave/workspace/Lucene-Solr-NightlyTests-trunk/build.xml:39: The following error occurred while executing this line:
/usr/home/hudson/hudson-slave/workspace/Lucene-Solr-NightlyTests-trunk/extra-targets.xml:37: The following error occurred while executing this line:
/usr/home/hudson/hudson-slave/workspace/Lucene-Solr-NightlyTests-trunk/solr/build.xml:189: The following error occurred while executing this line:
/usr/home/hudson/hudson-slave/workspace/Lucene-Solr-NightlyTests-trunk/solr/common-build.xml:491: The following error occurred while executing this line:
/usr/home/hudson/hudson-slave/workspace/Lucene-Solr-NightlyTests-trunk/lucene/common-build.xml:1275: The following error occurred while executing this line:
/usr/home/hudson/hudson-slave/workspace/Lucene-Solr-NightlyTests-trunk/lucene/common-build.xml:908: There were test failures: 357 suites, 1570 tests, 2 failures, 32 ignored (4 assumptions)

Total time: 135 minutes 36 seconds
Build step 'Invoke Ant' marked build as failure
Archiving artifacts
Recording test results
Email was triggered for: Failure
Sending email for trigger: Failure



Mime
View raw message