lucene-dev mailing list archives

Site index · List index
Message view « Date » · « Thread »
Top « Date » · « Thread »
From Policeman Jenkins Server <jenk...@thetaphi.de>
Subject [JENKINS] Lucene-Solr-trunk-Linux (64bit/ibm-j9-jdk7) - Build # 8854 - Failure!
Date Sat, 28 Dec 2013 04:37:49 GMT
Build: http://jenkins.thetaphi.de/job/Lucene-Solr-trunk-Linux/8854/
Java: 64bit/ibm-j9-jdk7 -Xjit:exclude={org/apache/lucene/util/fst/FST.pack(IIF)Lorg/apache/lucene/util/fst/FST;}

5 tests failed.
REGRESSION:  org.apache.solr.analytics.expression.ExpressionTest.addTest

Error Message:
Caught exception in getStatResult, xPath = /response/lst[@name='stats']/lst[@name='ar']/double[@name='sum']  raw data: <?xml version="1.0" encoding="UTF-8"?> <response>  <lst name="responseHeader">   <int name="status">0</int>   <int name="QTime">10</int> </lst> <result name="response" numFound="100" start="0"> </result> <lst name="stats">   <lst name="stats_fields"/> </lst> <lst name="stats">   <lst name="ar">     <long name="count">100</long>     <null name="mcm"/>     <null name="mean"/>     <null name="median"/>     <null name="su"/>     <null name="sum"/>     <null name="unique"/>   </lst>   <lst name="cdr">     <date name="cd1">1800-12-31T23:59:59Z</date>     <date name="cd2">1804-06-30T23:59:59Z</date>     <str name="cs1">1800-12-31T23:59:59Z</str>     <str name="cs2">1804-06-30T23:59:59Z</str>   </lst>   <lst name="mr">     <long name="count">100</long>     <double name="mcm">70829.5</double>     <double name="mean">28.91</double>     <double name="median">24.5</double>     <double name="su">104076.0</double>     <double name="sum">2891.0</double>     <long name="unique">36</long>   </lst>   <lst name="dr">     <long name="count">100</long>     <null name="mc"/>     <null name="mean"/>     <null name="su"/>     <null name="sum"/>     <null name="unique"/>   </lst>   <lst name="avr">     <double name="c">100.0</double>     <long name="count">100</long>     <double name="s">2891.0</double>     <double name="sum">2891.0</double>   </lst>   <lst name="pr">     <long name="count">100</long>     <null name="mc"/>     <null name="mean"/>     <null name="su"/>     <null name="sum"/>     <null name="unique"/>   </lst>   <lst name="csr">     <str name="cs1">this is the first</str>     <str name="cs2">this is the second</str>     <str name="cs3">this is the third</str>   </lst>   <lst name="cr">     <str name="ccmax">this is the secondstr9</str>     <str name="ccmin">this is the firststr0</str>     <str name="csmax">this is the second</str>     <str name="csmin">this is the first</str>     <str name="max">str9</str>     <str name="min">str0</str>   </lst>   <lst name="cnr">     <double name="c10">10.0</double>     <double name="c8">8.0</double>   </lst>   <lst name="dmr">     <str name="cma">+2MONTHS</str>     <str name="cme">+2YEARS</str>     <date name="dmma">1812-02-29T23:59:59Z</date>     <date name="dmme">1807-12-31T23:59:59Z</date>     <date name="max">1811-12-31T23:59:59Z</date>     <date name="median">1805-12-31T23:59:59Z</date>   </lst>   <lst name="rr">     <str name="max">str9</str>     <str name="min">str0</str>     <str name="rmax">9rts</str>     <str name="rmin">0rts</str>   </lst>   <lst name="nr">     <double name="c">-100.0</double>     <long name="count">100</long>     <null name="s"/>     <null name="sum"/>   </lst> </lst> </response> 

Stack Trace:
java.lang.AssertionError: Caught exception in getStatResult, xPath = /response/lst[@name='stats']/lst[@name='ar']/double[@name='sum'] 
raw data: <?xml version="1.0" encoding="UTF-8"?>
<response>

<lst name="responseHeader">
  <int name="status">0</int>
  <int name="QTime">10</int>
</lst>
<result name="response" numFound="100" start="0">
</result>
<lst name="stats">
  <lst name="stats_fields"/>
</lst>
<lst name="stats">
  <lst name="ar">
    <long name="count">100</long>
    <null name="mcm"/>
    <null name="mean"/>
    <null name="median"/>
    <null name="su"/>
    <null name="sum"/>
    <null name="unique"/>
  </lst>
  <lst name="cdr">
    <date name="cd1">1800-12-31T23:59:59Z</date>
    <date name="cd2">1804-06-30T23:59:59Z</date>
    <str name="cs1">1800-12-31T23:59:59Z</str>
    <str name="cs2">1804-06-30T23:59:59Z</str>
  </lst>
  <lst name="mr">
    <long name="count">100</long>
    <double name="mcm">70829.5</double>
    <double name="mean">28.91</double>
    <double name="median">24.5</double>
    <double name="su">104076.0</double>
    <double name="sum">2891.0</double>
    <long name="unique">36</long>
  </lst>
  <lst name="dr">
    <long name="count">100</long>
    <null name="mc"/>
    <null name="mean"/>
    <null name="su"/>
    <null name="sum"/>
    <null name="unique"/>
  </lst>
  <lst name="avr">
    <double name="c">100.0</double>
    <long name="count">100</long>
    <double name="s">2891.0</double>
    <double name="sum">2891.0</double>
  </lst>
  <lst name="pr">
    <long name="count">100</long>
    <null name="mc"/>
    <null name="mean"/>
    <null name="su"/>
    <null name="sum"/>
    <null name="unique"/>
  </lst>
  <lst name="csr">
    <str name="cs1">this is the first</str>
    <str name="cs2">this is the second</str>
    <str name="cs3">this is the third</str>
  </lst>
  <lst name="cr">
    <str name="ccmax">this is the secondstr9</str>
    <str name="ccmin">this is the firststr0</str>
    <str name="csmax">this is the second</str>
    <str name="csmin">this is the first</str>
    <str name="max">str9</str>
    <str name="min">str0</str>
  </lst>
  <lst name="cnr">
    <double name="c10">10.0</double>
    <double name="c8">8.0</double>
  </lst>
  <lst name="dmr">
    <str name="cma">+2MONTHS</str>
    <str name="cme">+2YEARS</str>
    <date name="dmma">1812-02-29T23:59:59Z</date>
    <date name="dmme">1807-12-31T23:59:59Z</date>
    <date name="max">1811-12-31T23:59:59Z</date>
    <date name="median">1805-12-31T23:59:59Z</date>
  </lst>
  <lst name="rr">
    <str name="max">str9</str>
    <str name="min">str0</str>
    <str name="rmax">9rts</str>
    <str name="rmin">0rts</str>
  </lst>
  <lst name="nr">
    <double name="c">-100.0</double>
    <long name="count">100</long>
    <null name="s"/>
    <null name="sum"/>
  </lst>
</lst>
</response>

	at __randomizedtesting.SeedInfo.seed([7994B522A7F98776:8FB818FCE6368031]:0)
	at org.junit.Assert.fail(Assert.java:93)
	at org.apache.solr.analytics.AbstractAnalyticsStatsTest.getStatResult(AbstractAnalyticsStatsTest.java:113)
	at org.apache.solr.analytics.expression.ExpressionTest.addTest(ExpressionTest.java:78)
	at sun.reflect.NativeMethodAccessorImpl.invoke0(Native Method)
	at sun.reflect.NativeMethodAccessorImpl.invoke(NativeMethodAccessorImpl.java:88)
	at sun.reflect.DelegatingMethodAccessorImpl.invoke(DelegatingMethodAccessorImpl.java:55)
	at java.lang.reflect.Method.invoke(Method.java:613)
	at com.carrotsearch.randomizedtesting.RandomizedRunner.invoke(RandomizedRunner.java:1559)
	at com.carrotsearch.randomizedtesting.RandomizedRunner.access$600(RandomizedRunner.java:79)
	at com.carrotsearch.randomizedtesting.RandomizedRunner$6.evaluate(RandomizedRunner.java:737)
	at com.carrotsearch.randomizedtesting.RandomizedRunner$7.evaluate(RandomizedRunner.java:773)
	at com.carrotsearch.randomizedtesting.RandomizedRunner$8.evaluate(RandomizedRunner.java:787)
	at com.carrotsearch.randomizedtesting.rules.SystemPropertiesRestoreRule$1.evaluate(SystemPropertiesRestoreRule.java:53)
	at org.apache.lucene.util.TestRuleSetupTeardownChained$1.evaluate(TestRuleSetupTeardownChained.java:50)
	at org.apache.lucene.util.TestRuleFieldCacheSanity$1.evaluate(TestRuleFieldCacheSanity.java:51)
	at org.apache.lucene.util.AbstractBeforeAfterRule$1.evaluate(AbstractBeforeAfterRule.java:46)
	at com.carrotsearch.randomizedtesting.rules.SystemPropertiesInvariantRule$1.evaluate(SystemPropertiesInvariantRule.java:55)
	at org.apache.lucene.util.TestRuleThreadAndTestName$1.evaluate(TestRuleThreadAndTestName.java:49)
	at org.apache.lucene.util.TestRuleIgnoreAfterMaxFailures$1.evaluate(TestRuleIgnoreAfterMaxFailures.java:70)
	at org.apache.lucene.util.TestRuleMarkFailure$1.evaluate(TestRuleMarkFailure.java:48)
	at com.carrotsearch.randomizedtesting.rules.StatementAdapter.evaluate(StatementAdapter.java:36)
	at com.carrotsearch.randomizedtesting.ThreadLeakControl$StatementRunner.run(ThreadLeakControl.java:358)
	at com.carrotsearch.randomizedtesting.ThreadLeakControl.forkTimeoutingTask(ThreadLeakControl.java:782)
	at com.carrotsearch.randomizedtesting.ThreadLeakControl$3.evaluate(ThreadLeakControl.java:442)
	at com.carrotsearch.randomizedtesting.RandomizedRunner.runSingleTest(RandomizedRunner.java:746)
	at com.carrotsearch.randomizedtesting.RandomizedRunner$3.evaluate(RandomizedRunner.java:648)
	at com.carrotsearch.randomizedtesting.RandomizedRunner$4.evaluate(RandomizedRunner.java:682)
	at com.carrotsearch.randomizedtesting.RandomizedRunner$5.evaluate(RandomizedRunner.java:693)
	at com.carrotsearch.randomizedtesting.rules.StatementAdapter.evaluate(StatementAdapter.java:36)
	at com.carrotsearch.randomizedtesting.rules.SystemPropertiesRestoreRule$1.evaluate(SystemPropertiesRestoreRule.java:53)
	at org.apache.lucene.util.AbstractBeforeAfterRule$1.evaluate(AbstractBeforeAfterRule.java:46)
	at org.apache.lucene.util.TestRuleStoreClassName$1.evaluate(TestRuleStoreClassName.java:42)
	at com.carrotsearch.randomizedtesting.rules.SystemPropertiesInvariantRule$1.evaluate(SystemPropertiesInvariantRule.java:55)
	at com.carrotsearch.randomizedtesting.rules.NoShadowingOrOverridesOnMethodsRule$1.evaluate(NoShadowingOrOverridesOnMethodsRule.java:39)
	at com.carrotsearch.randomizedtesting.rules.NoShadowingOrOverridesOnMethodsRule$1.evaluate(NoShadowingOrOverridesOnMethodsRule.java:39)
	at com.carrotsearch.randomizedtesting.rules.StatementAdapter.evaluate(StatementAdapter.java:36)
	at org.apache.lucene.util.TestRuleAssertionsRequired$1.evaluate(TestRuleAssertionsRequired.java:43)
	at org.apache.lucene.util.TestRuleMarkFailure$1.evaluate(TestRuleMarkFailure.java:48)
	at org.apache.lucene.util.TestRuleIgnoreAfterMaxFailures$1.evaluate(TestRuleIgnoreAfterMaxFailures.java:70)
	at org.apache.lucene.util.TestRuleIgnoreTestSuites$1.evaluate(TestRuleIgnoreTestSuites.java:55)
	at com.carrotsearch.randomizedtesting.rules.StatementAdapter.evaluate(StatementAdapter.java:36)
	at com.carrotsearch.randomizedtesting.ThreadLeakControl$StatementRunner.run(ThreadLeakControl.java:358)
	at java.lang.Thread.run(Thread.java:780)


REGRESSION:  org.apache.solr.analytics.expression.ExpressionTest.powerTest

Error Message:
Caught exception in getStatResult, xPath = /response/lst[@name='stats']/lst[@name='pr']/double[@name='sum']  raw data: <?xml version="1.0" encoding="UTF-8"?> <response>  <lst name="responseHeader">   <int name="status">0</int>   <int name="QTime">10</int> </lst> <result name="response" numFound="100" start="0"> </result> <lst name="stats">   <lst name="stats_fields"/> </lst> <lst name="stats">   <lst name="ar">     <long name="count">100</long>     <null name="mcm"/>     <null name="mean"/>     <null name="median"/>     <null name="su"/>     <null name="sum"/>     <null name="unique"/>   </lst>   <lst name="cdr">     <date name="cd1">1800-12-31T23:59:59Z</date>     <date name="cd2">1804-06-30T23:59:59Z</date>     <str name="cs1">1800-12-31T23:59:59Z</str>     <str name="cs2">1804-06-30T23:59:59Z</str>   </lst>   <lst name="mr">     <long name="count">100</long>     <double name="mcm">70829.5</double>     <double name="mean">28.91</double>     <double name="median">24.5</double>     <double name="su">104076.0</double>     <double name="sum">2891.0</double>     <long name="unique">36</long>   </lst>   <lst name="dr">     <long name="count">100</long>     <null name="mc"/>     <null name="mean"/>     <null name="su"/>     <null name="sum"/>     <null name="unique"/>   </lst>   <lst name="avr">     <double name="c">100.0</double>     <long name="count">100</long>     <double name="s">2891.0</double>     <double name="sum">2891.0</double>   </lst>   <lst name="pr">     <long name="count">100</long>     <null name="mc"/>     <null name="mean"/>     <null name="su"/>     <null name="sum"/>     <null name="unique"/>   </lst>   <lst name="csr">     <str name="cs1">this is the first</str>     <str name="cs2">this is the second</str>     <str name="cs3">this is the third</str>   </lst>   <lst name="cr">     <str name="ccmax">this is the secondstr9</str>     <str name="ccmin">this is the firststr0</str>     <str name="csmax">this is the second</str>     <str name="csmin">this is the first</str>     <str name="max">str9</str>     <str name="min">str0</str>   </lst>   <lst name="cnr">     <double name="c10">10.0</double>     <double name="c8">8.0</double>   </lst>   <lst name="dmr">     <str name="cma">+2MONTHS</str>     <str name="cme">+2YEARS</str>     <date name="dmma">1812-02-29T23:59:59Z</date>     <date name="dmme">1807-12-31T23:59:59Z</date>     <date name="max">1811-12-31T23:59:59Z</date>     <date name="median">1805-12-31T23:59:59Z</date>   </lst>   <lst name="rr">     <str name="max">str9</str>     <str name="min">str0</str>     <str name="rmax">9rts</str>     <str name="rmin">0rts</str>   </lst>   <lst name="nr">     <double name="c">-100.0</double>     <long name="count">100</long>     <null name="s"/>     <null name="sum"/>   </lst> </lst> </response> 

Stack Trace:
java.lang.AssertionError: Caught exception in getStatResult, xPath = /response/lst[@name='stats']/lst[@name='pr']/double[@name='sum'] 
raw data: <?xml version="1.0" encoding="UTF-8"?>
<response>

<lst name="responseHeader">
  <int name="status">0</int>
  <int name="QTime">10</int>
</lst>
<result name="response" numFound="100" start="0">
</result>
<lst name="stats">
  <lst name="stats_fields"/>
</lst>
<lst name="stats">
  <lst name="ar">
    <long name="count">100</long>
    <null name="mcm"/>
    <null name="mean"/>
    <null name="median"/>
    <null name="su"/>
    <null name="sum"/>
    <null name="unique"/>
  </lst>
  <lst name="cdr">
    <date name="cd1">1800-12-31T23:59:59Z</date>
    <date name="cd2">1804-06-30T23:59:59Z</date>
    <str name="cs1">1800-12-31T23:59:59Z</str>
    <str name="cs2">1804-06-30T23:59:59Z</str>
  </lst>
  <lst name="mr">
    <long name="count">100</long>
    <double name="mcm">70829.5</double>
    <double name="mean">28.91</double>
    <double name="median">24.5</double>
    <double name="su">104076.0</double>
    <double name="sum">2891.0</double>
    <long name="unique">36</long>
  </lst>
  <lst name="dr">
    <long name="count">100</long>
    <null name="mc"/>
    <null name="mean"/>
    <null name="su"/>
    <null name="sum"/>
    <null name="unique"/>
  </lst>
  <lst name="avr">
    <double name="c">100.0</double>
    <long name="count">100</long>
    <double name="s">2891.0</double>
    <double name="sum">2891.0</double>
  </lst>
  <lst name="pr">
    <long name="count">100</long>
    <null name="mc"/>
    <null name="mean"/>
    <null name="su"/>
    <null name="sum"/>
    <null name="unique"/>
  </lst>
  <lst name="csr">
    <str name="cs1">this is the first</str>
    <str name="cs2">this is the second</str>
    <str name="cs3">this is the third</str>
  </lst>
  <lst name="cr">
    <str name="ccmax">this is the secondstr9</str>
    <str name="ccmin">this is the firststr0</str>
    <str name="csmax">this is the second</str>
    <str name="csmin">this is the first</str>
    <str name="max">str9</str>
    <str name="min">str0</str>
  </lst>
  <lst name="cnr">
    <double name="c10">10.0</double>
    <double name="c8">8.0</double>
  </lst>
  <lst name="dmr">
    <str name="cma">+2MONTHS</str>
    <str name="cme">+2YEARS</str>
    <date name="dmma">1812-02-29T23:59:59Z</date>
    <date name="dmme">1807-12-31T23:59:59Z</date>
    <date name="max">1811-12-31T23:59:59Z</date>
    <date name="median">1805-12-31T23:59:59Z</date>
  </lst>
  <lst name="rr">
    <str name="max">str9</str>
    <str name="min">str0</str>
    <str name="rmax">9rts</str>
    <str name="rmin">0rts</str>
  </lst>
  <lst name="nr">
    <double name="c">-100.0</double>
    <long name="count">100</long>
    <null name="s"/>
    <null name="sum"/>
  </lst>
</lst>
</response>

	at __randomizedtesting.SeedInfo.seed([7994B522A7F98776:172602214FEED9A7]:0)
	at org.junit.Assert.fail(Assert.java:93)
	at org.apache.solr.analytics.AbstractAnalyticsStatsTest.getStatResult(AbstractAnalyticsStatsTest.java:113)
	at org.apache.solr.analytics.expression.ExpressionTest.powerTest(ExpressionTest.java:119)
	at sun.reflect.NativeMethodAccessorImpl.invoke0(Native Method)
	at sun.reflect.NativeMethodAccessorImpl.invoke(NativeMethodAccessorImpl.java:88)
	at sun.reflect.DelegatingMethodAccessorImpl.invoke(DelegatingMethodAccessorImpl.java:55)
	at java.lang.reflect.Method.invoke(Method.java:613)
	at com.carrotsearch.randomizedtesting.RandomizedRunner.invoke(RandomizedRunner.java:1559)
	at com.carrotsearch.randomizedtesting.RandomizedRunner.access$600(RandomizedRunner.java:79)
	at com.carrotsearch.randomizedtesting.RandomizedRunner$6.evaluate(RandomizedRunner.java:737)
	at com.carrotsearch.randomizedtesting.RandomizedRunner$7.evaluate(RandomizedRunner.java:773)
	at com.carrotsearch.randomizedtesting.RandomizedRunner$8.evaluate(RandomizedRunner.java:787)
	at com.carrotsearch.randomizedtesting.rules.SystemPropertiesRestoreRule$1.evaluate(SystemPropertiesRestoreRule.java:53)
	at org.apache.lucene.util.TestRuleSetupTeardownChained$1.evaluate(TestRuleSetupTeardownChained.java:50)
	at org.apache.lucene.util.TestRuleFieldCacheSanity$1.evaluate(TestRuleFieldCacheSanity.java:51)
	at org.apache.lucene.util.AbstractBeforeAfterRule$1.evaluate(AbstractBeforeAfterRule.java:46)
	at com.carrotsearch.randomizedtesting.rules.SystemPropertiesInvariantRule$1.evaluate(SystemPropertiesInvariantRule.java:55)
	at org.apache.lucene.util.TestRuleThreadAndTestName$1.evaluate(TestRuleThreadAndTestName.java:49)
	at org.apache.lucene.util.TestRuleIgnoreAfterMaxFailures$1.evaluate(TestRuleIgnoreAfterMaxFailures.java:70)
	at org.apache.lucene.util.TestRuleMarkFailure$1.evaluate(TestRuleMarkFailure.java:48)
	at com.carrotsearch.randomizedtesting.rules.StatementAdapter.evaluate(StatementAdapter.java:36)
	at com.carrotsearch.randomizedtesting.ThreadLeakControl$StatementRunner.run(ThreadLeakControl.java:358)
	at com.carrotsearch.randomizedtesting.ThreadLeakControl.forkTimeoutingTask(ThreadLeakControl.java:782)
	at com.carrotsearch.randomizedtesting.ThreadLeakControl$3.evaluate(ThreadLeakControl.java:442)
	at com.carrotsearch.randomizedtesting.RandomizedRunner.runSingleTest(RandomizedRunner.java:746)
	at com.carrotsearch.randomizedtesting.RandomizedRunner$3.evaluate(RandomizedRunner.java:648)
	at com.carrotsearch.randomizedtesting.RandomizedRunner$4.evaluate(RandomizedRunner.java:682)
	at com.carrotsearch.randomizedtesting.RandomizedRunner$5.evaluate(RandomizedRunner.java:693)
	at com.carrotsearch.randomizedtesting.rules.StatementAdapter.evaluate(StatementAdapter.java:36)
	at com.carrotsearch.randomizedtesting.rules.SystemPropertiesRestoreRule$1.evaluate(SystemPropertiesRestoreRule.java:53)
	at org.apache.lucene.util.AbstractBeforeAfterRule$1.evaluate(AbstractBeforeAfterRule.java:46)
	at org.apache.lucene.util.TestRuleStoreClassName$1.evaluate(TestRuleStoreClassName.java:42)
	at com.carrotsearch.randomizedtesting.rules.SystemPropertiesInvariantRule$1.evaluate(SystemPropertiesInvariantRule.java:55)
	at com.carrotsearch.randomizedtesting.rules.NoShadowingOrOverridesOnMethodsRule$1.evaluate(NoShadowingOrOverridesOnMethodsRule.java:39)
	at com.carrotsearch.randomizedtesting.rules.NoShadowingOrOverridesOnMethodsRule$1.evaluate(NoShadowingOrOverridesOnMethodsRule.java:39)
	at com.carrotsearch.randomizedtesting.rules.StatementAdapter.evaluate(StatementAdapter.java:36)
	at org.apache.lucene.util.TestRuleAssertionsRequired$1.evaluate(TestRuleAssertionsRequired.java:43)
	at org.apache.lucene.util.TestRuleMarkFailure$1.evaluate(TestRuleMarkFailure.java:48)
	at org.apache.lucene.util.TestRuleIgnoreAfterMaxFailures$1.evaluate(TestRuleIgnoreAfterMaxFailures.java:70)
	at org.apache.lucene.util.TestRuleIgnoreTestSuites$1.evaluate(TestRuleIgnoreTestSuites.java:55)
	at com.carrotsearch.randomizedtesting.rules.StatementAdapter.evaluate(StatementAdapter.java:36)
	at com.carrotsearch.randomizedtesting.ThreadLeakControl$StatementRunner.run(ThreadLeakControl.java:358)
	at java.lang.Thread.run(Thread.java:780)


REGRESSION:  org.apache.solr.analytics.expression.ExpressionTest.negateTest

Error Message:
Caught exception in getStatResult, xPath = /response/lst[@name='stats']/lst[@name='nr']/double[@name='sum']  raw data: <?xml version="1.0" encoding="UTF-8"?> <response>  <lst name="responseHeader">   <int name="status">0</int>   <int name="QTime">10</int> </lst> <result name="response" numFound="100" start="0"> </result> <lst name="stats">   <lst name="stats_fields"/> </lst> <lst name="stats">   <lst name="ar">     <long name="count">100</long>     <null name="mcm"/>     <null name="mean"/>     <null name="median"/>     <null name="su"/>     <null name="sum"/>     <null name="unique"/>   </lst>   <lst name="cdr">     <date name="cd1">1800-12-31T23:59:59Z</date>     <date name="cd2">1804-06-30T23:59:59Z</date>     <str name="cs1">1800-12-31T23:59:59Z</str>     <str name="cs2">1804-06-30T23:59:59Z</str>   </lst>   <lst name="mr">     <long name="count">100</long>     <double name="mcm">70829.5</double>     <double name="mean">28.91</double>     <double name="median">24.5</double>     <double name="su">104076.0</double>     <double name="sum">2891.0</double>     <long name="unique">36</long>   </lst>   <lst name="dr">     <long name="count">100</long>     <null name="mc"/>     <null name="mean"/>     <null name="su"/>     <null name="sum"/>     <null name="unique"/>   </lst>   <lst name="avr">     <double name="c">100.0</double>     <long name="count">100</long>     <double name="s">2891.0</double>     <double name="sum">2891.0</double>   </lst>   <lst name="pr">     <long name="count">100</long>     <null name="mc"/>     <null name="mean"/>     <null name="su"/>     <null name="sum"/>     <null name="unique"/>   </lst>   <lst name="csr">     <str name="cs1">this is the first</str>     <str name="cs2">this is the second</str>     <str name="cs3">this is the third</str>   </lst>   <lst name="cr">     <str name="ccmax">this is the secondstr9</str>     <str name="ccmin">this is the firststr0</str>     <str name="csmax">this is the second</str>     <str name="csmin">this is the first</str>     <str name="max">str9</str>     <str name="min">str0</str>   </lst>   <lst name="cnr">     <double name="c10">10.0</double>     <double name="c8">8.0</double>   </lst>   <lst name="dmr">     <str name="cma">+2MONTHS</str>     <str name="cme">+2YEARS</str>     <date name="dmma">1812-02-29T23:59:59Z</date>     <date name="dmme">1807-12-31T23:59:59Z</date>     <date name="max">1811-12-31T23:59:59Z</date>     <date name="median">1805-12-31T23:59:59Z</date>   </lst>   <lst name="rr">     <str name="max">str9</str>     <str name="min">str0</str>     <str name="rmax">9rts</str>     <str name="rmin">0rts</str>   </lst>   <lst name="nr">     <double name="c">-100.0</double>     <long name="count">100</long>     <null name="s"/>     <null name="sum"/>   </lst> </lst> </response> 

Stack Trace:
java.lang.AssertionError: Caught exception in getStatResult, xPath = /response/lst[@name='stats']/lst[@name='nr']/double[@name='sum'] 
raw data: <?xml version="1.0" encoding="UTF-8"?>
<response>

<lst name="responseHeader">
  <int name="status">0</int>
  <int name="QTime">10</int>
</lst>
<result name="response" numFound="100" start="0">
</result>
<lst name="stats">
  <lst name="stats_fields"/>
</lst>
<lst name="stats">
  <lst name="ar">
    <long name="count">100</long>
    <null name="mcm"/>
    <null name="mean"/>
    <null name="median"/>
    <null name="su"/>
    <null name="sum"/>
    <null name="unique"/>
  </lst>
  <lst name="cdr">
    <date name="cd1">1800-12-31T23:59:59Z</date>
    <date name="cd2">1804-06-30T23:59:59Z</date>
    <str name="cs1">1800-12-31T23:59:59Z</str>
    <str name="cs2">1804-06-30T23:59:59Z</str>
  </lst>
  <lst name="mr">
    <long name="count">100</long>
    <double name="mcm">70829.5</double>
    <double name="mean">28.91</double>
    <double name="median">24.5</double>
    <double name="su">104076.0</double>
    <double name="sum">2891.0</double>
    <long name="unique">36</long>
  </lst>
  <lst name="dr">
    <long name="count">100</long>
    <null name="mc"/>
    <null name="mean"/>
    <null name="su"/>
    <null name="sum"/>
    <null name="unique"/>
  </lst>
  <lst name="avr">
    <double name="c">100.0</double>
    <long name="count">100</long>
    <double name="s">2891.0</double>
    <double name="sum">2891.0</double>
  </lst>
  <lst name="pr">
    <long name="count">100</long>
    <null name="mc"/>
    <null name="mean"/>
    <null name="su"/>
    <null name="sum"/>
    <null name="unique"/>
  </lst>
  <lst name="csr">
    <str name="cs1">this is the first</str>
    <str name="cs2">this is the second</str>
    <str name="cs3">this is the third</str>
  </lst>
  <lst name="cr">
    <str name="ccmax">this is the secondstr9</str>
    <str name="ccmin">this is the firststr0</str>
    <str name="csmax">this is the second</str>
    <str name="csmin">this is the first</str>
    <str name="max">str9</str>
    <str name="min">str0</str>
  </lst>
  <lst name="cnr">
    <double name="c10">10.0</double>
    <double name="c8">8.0</double>
  </lst>
  <lst name="dmr">
    <str name="cma">+2MONTHS</str>
    <str name="cme">+2YEARS</str>
    <date name="dmma">1812-02-29T23:59:59Z</date>
    <date name="dmme">1807-12-31T23:59:59Z</date>
    <date name="max">1811-12-31T23:59:59Z</date>
    <date name="median">1805-12-31T23:59:59Z</date>
  </lst>
  <lst name="rr">
    <str name="max">str9</str>
    <str name="min">str0</str>
    <str name="rmax">9rts</str>
    <str name="rmin">0rts</str>
  </lst>
  <lst name="nr">
    <double name="c">-100.0</double>
    <long name="count">100</long>
    <null name="s"/>
    <null name="sum"/>
  </lst>
</lst>
</response>

	at __randomizedtesting.SeedInfo.seed([7994B522A7F98776:719CDD8703D4D7C6]:0)
	at org.junit.Assert.fail(Assert.java:93)
	at org.apache.solr.analytics.AbstractAnalyticsStatsTest.getStatResult(AbstractAnalyticsStatsTest.java:113)
	at org.apache.solr.analytics.expression.ExpressionTest.negateTest(ExpressionTest.java:132)
	at sun.reflect.NativeMethodAccessorImpl.invoke0(Native Method)
	at sun.reflect.NativeMethodAccessorImpl.invoke(NativeMethodAccessorImpl.java:88)
	at sun.reflect.DelegatingMethodAccessorImpl.invoke(DelegatingMethodAccessorImpl.java:55)
	at java.lang.reflect.Method.invoke(Method.java:613)
	at com.carrotsearch.randomizedtesting.RandomizedRunner.invoke(RandomizedRunner.java:1559)
	at com.carrotsearch.randomizedtesting.RandomizedRunner.access$600(RandomizedRunner.java:79)
	at com.carrotsearch.randomizedtesting.RandomizedRunner$6.evaluate(RandomizedRunner.java:737)
	at com.carrotsearch.randomizedtesting.RandomizedRunner$7.evaluate(RandomizedRunner.java:773)
	at com.carrotsearch.randomizedtesting.RandomizedRunner$8.evaluate(RandomizedRunner.java:787)
	at com.carrotsearch.randomizedtesting.rules.SystemPropertiesRestoreRule$1.evaluate(SystemPropertiesRestoreRule.java:53)
	at org.apache.lucene.util.TestRuleSetupTeardownChained$1.evaluate(TestRuleSetupTeardownChained.java:50)
	at org.apache.lucene.util.TestRuleFieldCacheSanity$1.evaluate(TestRuleFieldCacheSanity.java:51)
	at org.apache.lucene.util.AbstractBeforeAfterRule$1.evaluate(AbstractBeforeAfterRule.java:46)
	at com.carrotsearch.randomizedtesting.rules.SystemPropertiesInvariantRule$1.evaluate(SystemPropertiesInvariantRule.java:55)
	at org.apache.lucene.util.TestRuleThreadAndTestName$1.evaluate(TestRuleThreadAndTestName.java:49)
	at org.apache.lucene.util.TestRuleIgnoreAfterMaxFailures$1.evaluate(TestRuleIgnoreAfterMaxFailures.java:70)
	at org.apache.lucene.util.TestRuleMarkFailure$1.evaluate(TestRuleMarkFailure.java:48)
	at com.carrotsearch.randomizedtesting.rules.StatementAdapter.evaluate(StatementAdapter.java:36)
	at com.carrotsearch.randomizedtesting.ThreadLeakControl$StatementRunner.run(ThreadLeakControl.java:358)
	at com.carrotsearch.randomizedtesting.ThreadLeakControl.forkTimeoutingTask(ThreadLeakControl.java:782)
	at com.carrotsearch.randomizedtesting.ThreadLeakControl$3.evaluate(ThreadLeakControl.java:442)
	at com.carrotsearch.randomizedtesting.RandomizedRunner.runSingleTest(RandomizedRunner.java:746)
	at com.carrotsearch.randomizedtesting.RandomizedRunner$3.evaluate(RandomizedRunner.java:648)
	at com.carrotsearch.randomizedtesting.RandomizedRunner$4.evaluate(RandomizedRunner.java:682)
	at com.carrotsearch.randomizedtesting.RandomizedRunner$5.evaluate(RandomizedRunner.java:693)
	at com.carrotsearch.randomizedtesting.rules.StatementAdapter.evaluate(StatementAdapter.java:36)
	at com.carrotsearch.randomizedtesting.rules.SystemPropertiesRestoreRule$1.evaluate(SystemPropertiesRestoreRule.java:53)
	at org.apache.lucene.util.AbstractBeforeAfterRule$1.evaluate(AbstractBeforeAfterRule.java:46)
	at org.apache.lucene.util.TestRuleStoreClassName$1.evaluate(TestRuleStoreClassName.java:42)
	at com.carrotsearch.randomizedtesting.rules.SystemPropertiesInvariantRule$1.evaluate(SystemPropertiesInvariantRule.java:55)
	at com.carrotsearch.randomizedtesting.rules.NoShadowingOrOverridesOnMethodsRule$1.evaluate(NoShadowingOrOverridesOnMethodsRule.java:39)
	at com.carrotsearch.randomizedtesting.rules.NoShadowingOrOverridesOnMethodsRule$1.evaluate(NoShadowingOrOverridesOnMethodsRule.java:39)
	at com.carrotsearch.randomizedtesting.rules.StatementAdapter.evaluate(StatementAdapter.java:36)
	at org.apache.lucene.util.TestRuleAssertionsRequired$1.evaluate(TestRuleAssertionsRequired.java:43)
	at org.apache.lucene.util.TestRuleMarkFailure$1.evaluate(TestRuleMarkFailure.java:48)
	at org.apache.lucene.util.TestRuleIgnoreAfterMaxFailures$1.evaluate(TestRuleIgnoreAfterMaxFailures.java:70)
	at org.apache.lucene.util.TestRuleIgnoreTestSuites$1.evaluate(TestRuleIgnoreTestSuites.java:55)
	at com.carrotsearch.randomizedtesting.rules.StatementAdapter.evaluate(StatementAdapter.java:36)
	at com.carrotsearch.randomizedtesting.ThreadLeakControl$StatementRunner.run(ThreadLeakControl.java:358)
	at java.lang.Thread.run(Thread.java:780)


REGRESSION:  org.apache.solr.analytics.expression.ExpressionTest.divideTest

Error Message:
Caught exception in getStatResult, xPath = /response/lst[@name='stats']/lst[@name='dr']/double[@name='sum']  raw data: <?xml version="1.0" encoding="UTF-8"?> <response>  <lst name="responseHeader">   <int name="status">0</int>   <int name="QTime">10</int> </lst> <result name="response" numFound="100" start="0"> </result> <lst name="stats">   <lst name="stats_fields"/> </lst> <lst name="stats">   <lst name="ar">     <long name="count">100</long>     <null name="mcm"/>     <null name="mean"/>     <null name="median"/>     <null name="su"/>     <null name="sum"/>     <null name="unique"/>   </lst>   <lst name="cdr">     <date name="cd1">1800-12-31T23:59:59Z</date>     <date name="cd2">1804-06-30T23:59:59Z</date>     <str name="cs1">1800-12-31T23:59:59Z</str>     <str name="cs2">1804-06-30T23:59:59Z</str>   </lst>   <lst name="mr">     <long name="count">100</long>     <double name="mcm">70829.5</double>     <double name="mean">28.91</double>     <double name="median">24.5</double>     <double name="su">104076.0</double>     <double name="sum">2891.0</double>     <long name="unique">36</long>   </lst>   <lst name="dr">     <long name="count">100</long>     <null name="mc"/>     <null name="mean"/>     <null name="su"/>     <null name="sum"/>     <null name="unique"/>   </lst>   <lst name="avr">     <double name="c">100.0</double>     <long name="count">100</long>     <double name="s">2891.0</double>     <double name="sum">2891.0</double>   </lst>   <lst name="pr">     <long name="count">100</long>     <null name="mc"/>     <null name="mean"/>     <null name="su"/>     <null name="sum"/>     <null name="unique"/>   </lst>   <lst name="csr">     <str name="cs1">this is the first</str>     <str name="cs2">this is the second</str>     <str name="cs3">this is the third</str>   </lst>   <lst name="cr">     <str name="ccmax">this is the secondstr9</str>     <str name="ccmin">this is the firststr0</str>     <str name="csmax">this is the second</str>     <str name="csmin">this is the first</str>     <str name="max">str9</str>     <str name="min">str0</str>   </lst>   <lst name="cnr">     <double name="c10">10.0</double>     <double name="c8">8.0</double>   </lst>   <lst name="dmr">     <str name="cma">+2MONTHS</str>     <str name="cme">+2YEARS</str>     <date name="dmma">1812-02-29T23:59:59Z</date>     <date name="dmme">1807-12-31T23:59:59Z</date>     <date name="max">1811-12-31T23:59:59Z</date>     <date name="median">1805-12-31T23:59:59Z</date>   </lst>   <lst name="rr">     <str name="max">str9</str>     <str name="min">str0</str>     <str name="rmax">9rts</str>     <str name="rmin">0rts</str>   </lst>   <lst name="nr">     <double name="c">-100.0</double>     <long name="count">100</long>     <null name="s"/>     <null name="sum"/>   </lst> </lst> </response> 

Stack Trace:
java.lang.AssertionError: Caught exception in getStatResult, xPath = /response/lst[@name='stats']/lst[@name='dr']/double[@name='sum'] 
raw data: <?xml version="1.0" encoding="UTF-8"?>
<response>

<lst name="responseHeader">
  <int name="status">0</int>
  <int name="QTime">10</int>
</lst>
<result name="response" numFound="100" start="0">
</result>
<lst name="stats">
  <lst name="stats_fields"/>
</lst>
<lst name="stats">
  <lst name="ar">
    <long name="count">100</long>
    <null name="mcm"/>
    <null name="mean"/>
    <null name="median"/>
    <null name="su"/>
    <null name="sum"/>
    <null name="unique"/>
  </lst>
  <lst name="cdr">
    <date name="cd1">1800-12-31T23:59:59Z</date>
    <date name="cd2">1804-06-30T23:59:59Z</date>
    <str name="cs1">1800-12-31T23:59:59Z</str>
    <str name="cs2">1804-06-30T23:59:59Z</str>
  </lst>
  <lst name="mr">
    <long name="count">100</long>
    <double name="mcm">70829.5</double>
    <double name="mean">28.91</double>
    <double name="median">24.5</double>
    <double name="su">104076.0</double>
    <double name="sum">2891.0</double>
    <long name="unique">36</long>
  </lst>
  <lst name="dr">
    <long name="count">100</long>
    <null name="mc"/>
    <null name="mean"/>
    <null name="su"/>
    <null name="sum"/>
    <null name="unique"/>
  </lst>
  <lst name="avr">
    <double name="c">100.0</double>
    <long name="count">100</long>
    <double name="s">2891.0</double>
    <double name="sum">2891.0</double>
  </lst>
  <lst name="pr">
    <long name="count">100</long>
    <null name="mc"/>
    <null name="mean"/>
    <null name="su"/>
    <null name="sum"/>
    <null name="unique"/>
  </lst>
  <lst name="csr">
    <str name="cs1">this is the first</str>
    <str name="cs2">this is the second</str>
    <str name="cs3">this is the third</str>
  </lst>
  <lst name="cr">
    <str name="ccmax">this is the secondstr9</str>
    <str name="ccmin">this is the firststr0</str>
    <str name="csmax">this is the second</str>
    <str name="csmin">this is the first</str>
    <str name="max">str9</str>
    <str name="min">str0</str>
  </lst>
  <lst name="cnr">
    <double name="c10">10.0</double>
    <double name="c8">8.0</double>
  </lst>
  <lst name="dmr">
    <str name="cma">+2MONTHS</str>
    <str name="cme">+2YEARS</str>
    <date name="dmma">1812-02-29T23:59:59Z</date>
    <date name="dmme">1807-12-31T23:59:59Z</date>
    <date name="max">1811-12-31T23:59:59Z</date>
    <date name="median">1805-12-31T23:59:59Z</date>
  </lst>
  <lst name="rr">
    <str name="max">str9</str>
    <str name="min">str0</str>
    <str name="rmax">9rts</str>
    <str name="rmin">0rts</str>
  </lst>
  <lst name="nr">
    <double name="c">-100.0</double>
    <long name="count">100</long>
    <null name="s"/>
    <null name="sum"/>
  </lst>
</lst>
</response>

	at __randomizedtesting.SeedInfo.seed([7994B522A7F98776:21995ED4833BE5A0]:0)
	at org.junit.Assert.fail(Assert.java:93)
	at org.apache.solr.analytics.AbstractAnalyticsStatsTest.getStatResult(AbstractAnalyticsStatsTest.java:113)
	at org.apache.solr.analytics.expression.ExpressionTest.divideTest(ExpressionTest.java:106)
	at sun.reflect.NativeMethodAccessorImpl.invoke0(Native Method)
	at sun.reflect.NativeMethodAccessorImpl.invoke(NativeMethodAccessorImpl.java:88)
	at sun.reflect.DelegatingMethodAccessorImpl.invoke(DelegatingMethodAccessorImpl.java:55)
	at java.lang.reflect.Method.invoke(Method.java:613)
	at com.carrotsearch.randomizedtesting.RandomizedRunner.invoke(RandomizedRunner.java:1559)
	at com.carrotsearch.randomizedtesting.RandomizedRunner.access$600(RandomizedRunner.java:79)
	at com.carrotsearch.randomizedtesting.RandomizedRunner$6.evaluate(RandomizedRunner.java:737)
	at com.carrotsearch.randomizedtesting.RandomizedRunner$7.evaluate(RandomizedRunner.java:773)
	at com.carrotsearch.randomizedtesting.RandomizedRunner$8.evaluate(RandomizedRunner.java:787)
	at com.carrotsearch.randomizedtesting.rules.SystemPropertiesRestoreRule$1.evaluate(SystemPropertiesRestoreRule.java:53)
	at org.apache.lucene.util.TestRuleSetupTeardownChained$1.evaluate(TestRuleSetupTeardownChained.java:50)
	at org.apache.lucene.util.TestRuleFieldCacheSanity$1.evaluate(TestRuleFieldCacheSanity.java:51)
	at org.apache.lucene.util.AbstractBeforeAfterRule$1.evaluate(AbstractBeforeAfterRule.java:46)
	at com.carrotsearch.randomizedtesting.rules.SystemPropertiesInvariantRule$1.evaluate(SystemPropertiesInvariantRule.java:55)
	at org.apache.lucene.util.TestRuleThreadAndTestName$1.evaluate(TestRuleThreadAndTestName.java:49)
	at org.apache.lucene.util.TestRuleIgnoreAfterMaxFailures$1.evaluate(TestRuleIgnoreAfterMaxFailures.java:70)
	at org.apache.lucene.util.TestRuleMarkFailure$1.evaluate(TestRuleMarkFailure.java:48)
	at com.carrotsearch.randomizedtesting.rules.StatementAdapter.evaluate(StatementAdapter.java:36)
	at com.carrotsearch.randomizedtesting.ThreadLeakControl$StatementRunner.run(ThreadLeakControl.java:358)
	at com.carrotsearch.randomizedtesting.ThreadLeakControl.forkTimeoutingTask(ThreadLeakControl.java:782)
	at com.carrotsearch.randomizedtesting.ThreadLeakControl$3.evaluate(ThreadLeakControl.java:442)
	at com.carrotsearch.randomizedtesting.RandomizedRunner.runSingleTest(RandomizedRunner.java:746)
	at com.carrotsearch.randomizedtesting.RandomizedRunner$3.evaluate(RandomizedRunner.java:648)
	at com.carrotsearch.randomizedtesting.RandomizedRunner$4.evaluate(RandomizedRunner.java:682)
	at com.carrotsearch.randomizedtesting.RandomizedRunner$5.evaluate(RandomizedRunner.java:693)
	at com.carrotsearch.randomizedtesting.rules.StatementAdapter.evaluate(StatementAdapter.java:36)
	at com.carrotsearch.randomizedtesting.rules.SystemPropertiesRestoreRule$1.evaluate(SystemPropertiesRestoreRule.java:53)
	at org.apache.lucene.util.AbstractBeforeAfterRule$1.evaluate(AbstractBeforeAfterRule.java:46)
	at org.apache.lucene.util.TestRuleStoreClassName$1.evaluate(TestRuleStoreClassName.java:42)
	at com.carrotsearch.randomizedtesting.rules.SystemPropertiesInvariantRule$1.evaluate(SystemPropertiesInvariantRule.java:55)
	at com.carrotsearch.randomizedtesting.rules.NoShadowingOrOverridesOnMethodsRule$1.evaluate(NoShadowingOrOverridesOnMethodsRule.java:39)
	at com.carrotsearch.randomizedtesting.rules.NoShadowingOrOverridesOnMethodsRule$1.evaluate(NoShadowingOrOverridesOnMethodsRule.java:39)
	at com.carrotsearch.randomizedtesting.rules.StatementAdapter.evaluate(StatementAdapter.java:36)
	at org.apache.lucene.util.TestRuleAssertionsRequired$1.evaluate(TestRuleAssertionsRequired.java:43)
	at org.apache.lucene.util.TestRuleMarkFailure$1.evaluate(TestRuleMarkFailure.java:48)
	at org.apache.lucene.util.TestRuleIgnoreAfterMaxFailures$1.evaluate(TestRuleIgnoreAfterMaxFailures.java:70)
	at org.apache.lucene.util.TestRuleIgnoreTestSuites$1.evaluate(TestRuleIgnoreTestSuites.java:55)
	at com.carrotsearch.randomizedtesting.rules.StatementAdapter.evaluate(StatementAdapter.java:36)
	at com.carrotsearch.randomizedtesting.ThreadLeakControl$StatementRunner.run(ThreadLeakControl.java:358)
	at java.lang.Thread.run(Thread.java:780)


REGRESSION:  org.apache.solr.update.processor.SignatureUpdateProcessorFactoryTest.testDupeDetection

Error Message:
expected:<1> but was:<2>

Stack Trace:
java.lang.AssertionError: expected:<1> but was:<2>
	at __randomizedtesting.SeedInfo.seed([7994B522A7F98776:22A44EEAA4BE240A]:0)
	at org.junit.Assert.fail(Assert.java:93)
	at org.junit.Assert.failNotEquals(Assert.java:647)
	at org.junit.Assert.assertEquals(Assert.java:128)
	at org.junit.Assert.assertEquals(Assert.java:472)
	at org.junit.Assert.assertEquals(Assert.java:456)
	at org.apache.solr.update.processor.SignatureUpdateProcessorFactoryTest.checkNumDocs(SignatureUpdateProcessorFactoryTest.java:71)
	at org.apache.solr.update.processor.SignatureUpdateProcessorFactoryTest.testDupeDetection(SignatureUpdateProcessorFactoryTest.java:119)
	at sun.reflect.NativeMethodAccessorImpl.invoke0(Native Method)
	at sun.reflect.NativeMethodAccessorImpl.invoke(NativeMethodAccessorImpl.java:88)
	at sun.reflect.DelegatingMethodAccessorImpl.invoke(DelegatingMethodAccessorImpl.java:55)
	at java.lang.reflect.Method.invoke(Method.java:613)
	at com.carrotsearch.randomizedtesting.RandomizedRunner.invoke(RandomizedRunner.java:1559)
	at com.carrotsearch.randomizedtesting.RandomizedRunner.access$600(RandomizedRunner.java:79)
	at com.carrotsearch.randomizedtesting.RandomizedRunner$6.evaluate(RandomizedRunner.java:737)
	at com.carrotsearch.randomizedtesting.RandomizedRunner$7.evaluate(RandomizedRunner.java:773)
	at com.carrotsearch.randomizedtesting.RandomizedRunner$8.evaluate(RandomizedRunner.java:787)
	at com.carrotsearch.randomizedtesting.rules.SystemPropertiesRestoreRule$1.evaluate(SystemPropertiesRestoreRule.java:53)
	at org.apache.lucene.util.TestRuleSetupTeardownChained$1.evaluate(TestRuleSetupTeardownChained.java:50)
	at org.apache.lucene.util.TestRuleFieldCacheSanity$1.evaluate(TestRuleFieldCacheSanity.java:51)
	at org.apache.lucene.util.AbstractBeforeAfterRule$1.evaluate(AbstractBeforeAfterRule.java:46)
	at com.carrotsearch.randomizedtesting.rules.SystemPropertiesInvariantRule$1.evaluate(SystemPropertiesInvariantRule.java:55)
	at org.apache.lucene.util.TestRuleThreadAndTestName$1.evaluate(TestRuleThreadAndTestName.java:49)
	at org.apache.lucene.util.TestRuleIgnoreAfterMaxFailures$1.evaluate(TestRuleIgnoreAfterMaxFailures.java:70)
	at org.apache.lucene.util.TestRuleMarkFailure$1.evaluate(TestRuleMarkFailure.java:48)
	at com.carrotsearch.randomizedtesting.rules.StatementAdapter.evaluate(StatementAdapter.java:36)
	at com.carrotsearch.randomizedtesting.ThreadLeakControl$StatementRunner.run(ThreadLeakControl.java:358)
	at com.carrotsearch.randomizedtesting.ThreadLeakControl.forkTimeoutingTask(ThreadLeakControl.java:782)
	at com.carrotsearch.randomizedtesting.ThreadLeakControl$3.evaluate(ThreadLeakControl.java:442)
	at com.carrotsearch.randomizedtesting.RandomizedRunner.runSingleTest(RandomizedRunner.java:746)
	at com.carrotsearch.randomizedtesting.RandomizedRunner$3.evaluate(RandomizedRunner.java:648)
	at com.carrotsearch.randomizedtesting.RandomizedRunner$4.evaluate(RandomizedRunner.java:682)
	at com.carrotsearch.randomizedtesting.RandomizedRunner$5.evaluate(RandomizedRunner.java:693)
	at com.carrotsearch.randomizedtesting.rules.StatementAdapter.evaluate(StatementAdapter.java:36)
	at com.carrotsearch.randomizedtesting.rules.SystemPropertiesRestoreRule$1.evaluate(SystemPropertiesRestoreRule.java:53)
	at org.apache.lucene.util.AbstractBeforeAfterRule$1.evaluate(AbstractBeforeAfterRule.java:46)
	at org.apache.lucene.util.TestRuleStoreClassName$1.evaluate(TestRuleStoreClassName.java:42)
	at com.carrotsearch.randomizedtesting.rules.SystemPropertiesInvariantRule$1.evaluate(SystemPropertiesInvariantRule.java:55)
	at com.carrotsearch.randomizedtesting.rules.NoShadowingOrOverridesOnMethodsRule$1.evaluate(NoShadowingOrOverridesOnMethodsRule.java:39)
	at com.carrotsearch.randomizedtesting.rules.NoShadowingOrOverridesOnMethodsRule$1.evaluate(NoShadowingOrOverridesOnMethodsRule.java:39)
	at com.carrotsearch.randomizedtesting.rules.StatementAdapter.evaluate(StatementAdapter.java:36)
	at org.apache.lucene.util.TestRuleAssertionsRequired$1.evaluate(TestRuleAssertionsRequired.java:43)
	at org.apache.lucene.util.TestRuleMarkFailure$1.evaluate(TestRuleMarkFailure.java:48)
	at org.apache.lucene.util.TestRuleIgnoreAfterMaxFailures$1.evaluate(TestRuleIgnoreAfterMaxFailures.java:70)
	at org.apache.lucene.util.TestRuleIgnoreTestSuites$1.evaluate(TestRuleIgnoreTestSuites.java:55)
	at com.carrotsearch.randomizedtesting.rules.StatementAdapter.evaluate(StatementAdapter.java:36)
	at com.carrotsearch.randomizedtesting.ThreadLeakControl$StatementRunner.run(ThreadLeakControl.java:358)
	at java.lang.Thread.run(Thread.java:780)




Build Log:
[...truncated 10143 lines...]
   [junit4] Suite: org.apache.solr.update.processor.SignatureUpdateProcessorFactoryTest
   [junit4]   2> 66091 T203 oas.SolrTestCaseJ4.initCore ####initCore
   [junit4]   2> Creating dataDir: /mnt/ssd/jenkins/workspace/Lucene-Solr-trunk-Linux/solr/build/solr-core/test/J1/./solrtest-SignatureUpdateProcessorFactoryTest-1388204829020
   [junit4]   2> 66092 T203 oasc.SolrResourceLoader.<init> new SolrResourceLoader for directory: '/mnt/ssd/jenkins/workspace/Lucene-Solr-trunk-Linux/solr/build/solr-core/test-files/solr/collection1/'
   [junit4]   2> 66093 T203 oasc.SolrResourceLoader.replaceClassLoader Adding 'file:/mnt/ssd/jenkins/workspace/Lucene-Solr-trunk-Linux/solr/build/solr-core/test-files/solr/collection1/lib/classes/' to classloader
   [junit4]   2> 66097 T203 oasc.SolrResourceLoader.replaceClassLoader Adding 'file:/mnt/ssd/jenkins/workspace/Lucene-Solr-trunk-Linux/solr/build/solr-core/test-files/solr/collection1/lib/README' to classloader
   [junit4]   2> 66173 T203 oasc.SolrConfig.<init> Using Lucene MatchVersion: LUCENE_50
   [junit4]   2> 66276 T203 oasc.SolrConfig.<init> Loaded SolrConfig: solrconfig.xml
   [junit4]   2> 66279 T203 oass.IndexSchema.readSchema Reading Solr Schema from schema12.xml
   [junit4]   2> 66303 T203 oass.IndexSchema.readSchema [null] Schema name=test
   [junit4]   2> 67400 T203 oass.IndexSchema.readSchema default search field in schema is text
   [junit4]   2> 67404 T203 oass.IndexSchema.readSchema unique key field: id
   [junit4]   2> 67416 T203 oass.IndexSchema.readSchema WARN Field text is not multivalued and destination for multiple copyFields (2)
   [junit4]   2> 67470 T203 oass.FileExchangeRateProvider.reload Reloading exchange rates from file currency.xml
   [junit4]   2> 67484 T203 oass.FileExchangeRateProvider.reload Reloading exchange rates from file currency.xml
   [junit4]   2> 67497 T203 oasc.SolrResourceLoader.locateSolrHome JNDI not configured for solr (NoInitialContextEx)
   [junit4]   2> 67498 T203 oasc.SolrResourceLoader.locateSolrHome using system property solr.solr.home: /mnt/ssd/jenkins/workspace/Lucene-Solr-trunk-Linux/solr/build/solr-core/test-files/solr
   [junit4]   2> 67499 T203 oasc.SolrResourceLoader.<init> new SolrResourceLoader for directory: '/mnt/ssd/jenkins/workspace/Lucene-Solr-trunk-Linux/solr/build/solr-core/test-files/solr/'
   [junit4]   2> 67529 T203 oasc.SolrResourceLoader.locateSolrHome JNDI not configured for solr (NoInitialContextEx)
   [junit4]   2> 67530 T203 oasc.SolrResourceLoader.locateSolrHome using system property solr.solr.home: /mnt/ssd/jenkins/workspace/Lucene-Solr-trunk-Linux/solr/build/solr-core/test-files/solr
   [junit4]   2> 67531 T203 oasc.SolrResourceLoader.<init> new SolrResourceLoader for deduced Solr Home: '/mnt/ssd/jenkins/workspace/Lucene-Solr-trunk-Linux/solr/build/solr-core/test-files/solr/'
   [junit4]   2> 67659 T203 oasc.CoreContainer.<init> New CoreContainer 125160162
   [junit4]   2> 67660 T203 oasc.CoreContainer.load Loading cores into CoreContainer [instanceDir=/mnt/ssd/jenkins/workspace/Lucene-Solr-trunk-Linux/solr/build/solr-core/test-files/solr/]
   [junit4]   2> 67663 T203 oashc.HttpShardHandlerFactory.getParameter Setting socketTimeout to: 0
   [junit4]   2> 67664 T203 oashc.HttpShardHandlerFactory.getParameter Setting urlScheme to: http://
   [junit4]   2> 67665 T203 oashc.HttpShardHandlerFactory.getParameter Setting connTimeout to: 0
   [junit4]   2> 67666 T203 oashc.HttpShardHandlerFactory.getParameter Setting maxConnectionsPerHost to: 20
   [junit4]   2> 67667 T203 oashc.HttpShardHandlerFactory.getParameter Setting corePoolSize to: 0
   [junit4]   2> 67668 T203 oashc.HttpShardHandlerFactory.getParameter Setting maximumPoolSize to: 2147483647
   [junit4]   2> 67669 T203 oashc.HttpShardHandlerFactory.getParameter Setting maxThreadIdleTime to: 5
   [junit4]   2> 67670 T203 oashc.HttpShardHandlerFactory.getParameter Setting sizeOfQueue to: -1
   [junit4]   2> 67672 T203 oashc.HttpShardHandlerFactory.getParameter Setting fairnessPolicy to: false
   [junit4]   2> 67691 T203 oasl.LogWatcher.createWatcher SLF4J impl is org.slf4j.impl.Log4jLoggerFactory
   [junit4]   2> 67692 T203 oasl.LogWatcher.newRegisteredLogWatcher Registering Log Listener [Log4j (org.slf4j.impl.Log4jLoggerFactory)]
   [junit4]   2> 67693 T203 oasc.CoreContainer.load Host Name: 
   [junit4]   2> 67710 T204 oasc.CoreContainer.create Creating SolrCore 'collection1' using instanceDir: /mnt/ssd/jenkins/workspace/Lucene-Solr-trunk-Linux/solr/build/solr-core/test-files/solr/collection1
   [junit4]   2> 67711 T204 oasc.SolrResourceLoader.<init> new SolrResourceLoader for directory: '/mnt/ssd/jenkins/workspace/Lucene-Solr-trunk-Linux/solr/build/solr-core/test-files/solr/collection1/'
   [junit4]   2> 67712 T204 oasc.SolrResourceLoader.replaceClassLoader Adding 'file:/mnt/ssd/jenkins/workspace/Lucene-Solr-trunk-Linux/solr/build/solr-core/test-files/solr/collection1/lib/classes/' to classloader
   [junit4]   2> 67713 T204 oasc.SolrResourceLoader.replaceClassLoader Adding 'file:/mnt/ssd/jenkins/workspace/Lucene-Solr-trunk-Linux/solr/build/solr-core/test-files/solr/collection1/lib/README' to classloader
   [junit4]   2> 67809 T204 oasc.SolrConfig.<init> Using Lucene MatchVersion: LUCENE_50
   [junit4]   2> 67917 T204 oasc.SolrConfig.<init> Loaded SolrConfig: solrconfig.xml
   [junit4]   2> 67918 T204 oass.IndexSchema.readSchema Reading Solr Schema from schema12.xml
   [junit4]   2> 67929 T204 oass.IndexSchema.readSchema [collection1] Schema name=test
   [junit4]   2> 68699 T204 oass.IndexSchema.readSchema default search field in schema is text
   [junit4]   2> 68704 T204 oass.IndexSchema.readSchema unique key field: id
   [junit4]   2> 68716 T204 oass.IndexSchema.readSchema WARN Field text is not multivalued and destination for multiple copyFields (2)
   [junit4]   2> 68748 T204 oass.FileExchangeRateProvider.reload Reloading exchange rates from file currency.xml
   [junit4]   2> 68763 T204 oass.FileExchangeRateProvider.reload Reloading exchange rates from file currency.xml
   [junit4]   2> 68779 T204 oasc.SolrCore.initDirectoryFactory org.apache.solr.core.MockDirectoryFactory
   [junit4]   2> 68780 T204 oasc.SolrCore.<init> [collection1] Opening new SolrCore at /mnt/ssd/jenkins/workspace/Lucene-Solr-trunk-Linux/solr/build/solr-core/test-files/solr/collection1/, dataDir=/mnt/ssd/jenkins/workspace/Lucene-Solr-trunk-Linux/solr/build/solr-core/test/J1/./solrtest-SignatureUpdateProcessorFactoryTest-1388204829020/
   [junit4]   2> 68780 T204 oasc.JmxMonitoredMap.<init> No JMX servers found, not exposing Solr information with JMX.
   [junit4]   2> 68782 T204 oasc.CachingDirectoryFactory.get return new directory for /mnt/ssd/jenkins/workspace/Lucene-Solr-trunk-Linux/solr/build/solr-core/test/J1/./solrtest-SignatureUpdateProcessorFactoryTest-1388204829020
   [junit4]   2> 68783 T204 oasc.SolrCore.getNewIndexDir New index directory detected: old=null new=/mnt/ssd/jenkins/workspace/Lucene-Solr-trunk-Linux/solr/build/solr-core/test/J1/./solrtest-SignatureUpdateProcessorFactoryTest-1388204829020/index/
   [junit4]   2> 68784 T204 oasc.SolrCore.initIndex WARN [collection1] Solr index directory '/mnt/ssd/jenkins/workspace/Lucene-Solr-trunk-Linux/solr/build/solr-core/test/J1/./solrtest-SignatureUpdateProcessorFactoryTest-1388204829020/index' doesn't exist. Creating new index...
   [junit4]   2> 68788 T204 oasc.CachingDirectoryFactory.get return new directory for /mnt/ssd/jenkins/workspace/Lucene-Solr-trunk-Linux/solr/build/solr-core/test/J1/./solrtest-SignatureUpdateProcessorFactoryTest-1388204829020/index
   [junit4]   2> 68789 T204 oasu.RandomMergePolicy.<init> RandomMergePolicy wrapping class org.apache.lucene.index.LogDocMergePolicy: [LogDocMergePolicy: minMergeSize=1000, mergeFactor=23, maxMergeSize=9223372036854775807, maxMergeSizeForForcedMerge=9223372036854775807, calibrateSizeByDeletes=false, maxMergeDocs=2147483647, maxCFSSegmentSizeMB=8.796093022207999E12, noCFSRatio=0.5667210384001424]
   [junit4]   2> 68792 T204 oasc.SolrDeletionPolicy.onCommit SolrDeletionPolicy.onCommit: commits: num=1
   [junit4]   2> 		commit{dir=RateLimitedDirectoryWrapper(MockDirectoryWrapper(org.apache.lucene.store.RAMDirectory@e209b490 lockFactory=org.apache.lucene.store.SingleInstanceLockFactory@b0b5f519)),segFN=segments_1,generation=1}
   [junit4]   2> 68793 T204 oasc.SolrDeletionPolicy.updateCommits newest commit generation = 1
   [junit4]   2> 68795 T204 oasc.SolrCore.initWriters created xml: solr.XMLResponseWriter
   [junit4]   2> 68797 T204 oasup.UpdateRequestProcessorChain.init creating updateRequestProcessorChain "dedupe"
   [junit4]   2> 68798 T204 oasup.UpdateRequestProcessorChain.init inserting DistributedUpdateProcessorFactory into updateRequestProcessorChain "dedupe"
   [junit4]   2> 68799 T204 oasup.UpdateRequestProcessorChain.init creating updateRequestProcessorChain "dedupe-allfields"
   [junit4]   2> 68800 T204 oasup.UpdateRequestProcessorChain.init inserting DistributedUpdateProcessorFactory into updateRequestProcessorChain "dedupe-allfields"
   [junit4]   2> 68800 T204 oasup.UpdateRequestProcessorChain.init creating updateRequestProcessorChain "stored_sig"
   [junit4]   2> 68801 T204 oasup.UpdateRequestProcessorChain.init inserting DistributedUpdateProcessorFactory into updateRequestProcessorChain "stored_sig"
   [junit4]   2> 68801 T204 oasup.UpdateRequestProcessorChain.init creating updateRequestProcessorChain "uniq-fields"
   [junit4]   2> 68802 T204 oasup.UpdateRequestProcessorChain.init inserting DistributedUpdateProcessorFactory into updateRequestProcessorChain "uniq-fields"
   [junit4]   2> 68803 T204 oasup.UpdateRequestProcessorChain.init creating updateRequestProcessorChain "distrib-dup-test-chain-explicit"
   [junit4]   2> 68803 T204 oasup.UpdateRequestProcessorChain.init creating updateRequestProcessorChain "distrib-dup-test-chain-implicit"
   [junit4]   2> 68804 T204 oasup.UpdateRequestProcessorChain.init inserting DistributedUpdateProcessorFactory into updateRequestProcessorChain "distrib-dup-test-chain-implicit"
   [junit4]   2> 68805 T204 oasc.SolrCore.loadUpdateProcessorChains no updateRequestProcessorChain defined as default, creating implicit default
   [junit4]   2> 68805 T204 oasc.RequestHandlers.initHandlersFromConfig adding lazy requestHandler: solr.ReplicationHandler
   [junit4]   2> 68806 T204 oasc.RequestHandlers.initHandlersFromConfig created /replication: solr.ReplicationHandler
   [junit4]   2> 68808 T204 oasc.RequestHandlers.initHandlersFromConfig created standard: solr.StandardRequestHandler
   [junit4]   2> 68810 T204 oasc.RequestHandlers.initHandlersFromConfig created /get: solr.RealTimeGetHandler
   [junit4]   2> 68813 T204 oasc.RequestHandlers.initHandlersFromConfig created dismax: solr.SearchHandler
   [junit4]   2> 68815 T204 oasc.RequestHandlers.initHandlersFromConfig created mock: org.apache.solr.core.MockQuerySenderListenerReqHandler
   [junit4]   2> 68816 T204 oasc.RequestHandlers.initHandlersFromConfig created /admin/: org.apache.solr.handler.admin.AdminHandlers
   [junit4]   2> 68818 T204 oasc.RequestHandlers.initHandlersFromConfig created /admin/file: solr.admin.ShowFileRequestHandler
   [junit4]   2> 68821 T204 oasc.RequestHandlers.initHandlersFromConfig created /admin/fileedit: solr.admin.EditFileRequestHandler
   [junit4]   2> 68823 T204 oasc.RequestHandlers.initHandlersFromConfig created defaults: solr.StandardRequestHandler
   [junit4]   2> 68824 T204 oasc.RequestHandlers.initHandlersFromConfig adding lazy requestHandler: solr.StandardRequestHandler
   [junit4]   2> 68824 T204 oasc.RequestHandlers.initHandlersFromConfig created lazy: solr.StandardRequestHandler
   [junit4]   2> 68826 T204 oasc.RequestHandlers.initHandlersFromConfig created /update: solr.UpdateRequestHandler
   [junit4]   2> 68828 T204 oasc.RequestHandlers.initHandlersFromConfig created /terms: org.apache.solr.handler.component.SearchHandler
   [junit4]   2> 68830 T204 oasc.RequestHandlers.initHandlersFromConfig created spellCheckCompRH: org.apache.solr.handler.component.SearchHandler
   [junit4]   2> 68830 T204 oasc.RequestHandlers.initHandlersFromConfig created spellCheckCompRH_Direct: org.apache.solr.handler.component.SearchHandler
   [junit4]   2> 68831 T204 oasc.RequestHandlers.initHandlersFromConfig created spellCheckWithWordbreak: org.apache.solr.handler.component.SearchHandler
   [junit4]   2> 68832 T204 oasc.RequestHandlers.initHandlersFromConfig created spellCheckWithWordbreak_Direct: org.apache.solr.handler.component.SearchHandler
   [junit4]   2> 68832 T204 oasc.RequestHandlers.initHandlersFromConfig created spellCheckCompRH1: org.apache.solr.handler.component.SearchHandler
   [junit4]   2> 68833 T204 oasc.RequestHandlers.initHandlersFromConfig created mltrh: org.apache.solr.handler.component.SearchHandler
   [junit4]   2> 68833 T204 oasc.RequestHandlers.initHandlersFromConfig created tvrh: org.apache.solr.handler.component.SearchHandler
   [junit4]   2> 68834 T204 oasc.RequestHandlers.initHandlersFromConfig created /mlt: solr.MoreLikeThisHandler
   [junit4]   2> 68836 T204 oasc.RequestHandlers.initHandlersFromConfig created /debug/dump: solr.DumpRequestHandler
   [junit4]   2> 68843 T204 oashl.XMLLoader.init xsltCacheLifetimeSeconds=60
   [junit4]   2> 68846 T204 oasc.SolrCore.initDeprecatedSupport WARN solrconfig.xml uses deprecated <admin/gettableFiles>, Please update your config to use the ShowFileRequestHandler.
   [junit4]   2> 68849 T204 oasu.CommitTracker.<init> Hard AutoCommit: disabled
   [junit4]   2> 68850 T204 oasu.CommitTracker.<init> Soft AutoCommit: disabled
   [junit4]   2> 68853 T204 oasu.RandomMergePolicy.<init> RandomMergePolicy wrapping class org.apache.lucene.index.TieredMergePolicy: [TieredMergePolicy: maxMergeAtOnce=45, maxMergeAtOnceExplicit=39, maxMergedSegmentMB=74.494140625, floorSegmentMB=0.9658203125, forceMergeDeletesPctAllowed=19.974705808220467, segmentsPerTier=40.0, maxCFSSegmentSizeMB=8.796093022207999E12, noCFSRatio=0.7391871918120901
   [junit4]   2> 68862 T204 oasc.SolrDeletionPolicy.onInit SolrDeletionPolicy.onInit: commits: num=1
   [junit4]   2> 		commit{dir=RateLimitedDirectoryWrapper(MockDirectoryWrapper(org.apache.lucene.store.RAMDirectory@e209b490 lockFactory=org.apache.lucene.store.SingleInstanceLockFactory@b0b5f519)),segFN=segments_1,generation=1}
   [junit4]   2> 68863 T204 oasc.SolrDeletionPolicy.updateCommits newest commit generation = 1
   [junit4]   2> 68864 T204 oass.SolrIndexSearcher.<init> Opening Searcher@6c6e88a5 main
   [junit4]   2> 68865 T204 oashc.SpellCheckComponent.inform Initializing spell checkers
   [junit4]   2> 68950 T204 oass.DirectSolrSpellChecker.init init: {name=direct,classname=DirectSolrSpellChecker,field=lowerfilt,minQueryLength=3}
   [junit4]   2> 69031 T205 oasc.SolrCore.registerSearcher [collection1] Registered new searcher Searcher@6c6e88a5 main{StandardDirectoryReader(segments_1:1:nrt)}
   [junit4]   2> 69032 T204 oasc.CoreContainer.registerCore registering core: collection1
   [junit4]   2> 69036 T203 oas.SolrTestCaseJ4.initCore ####initCore end
   [junit4]   2> 69041 T203 oas.SolrTestCaseJ4.setUp ###Starting testNonStringFieldsValues
   [junit4]   2> ASYNC  NEW_CORE C773 name=collection1 org.apache.solr.core.SolrCore@db7a33c4
   [junit4]   2> 69051 T203 C773 oasu.DirectUpdateHandler2.deleteAll [collection1] REMOVING ALL DOCUMENTS FROM INDEX
   [junit4]   2> 69052 T203 C773 oasup.LogUpdateProcessor.finish [collection1] webapp=null path=null params={} {deleteByQuery=*:*} 0 1
   [junit4]   2> 69066 T203 C773 oasu.DirectUpdateHandler2.commit start commit{,optimize=false,openSearcher=true,waitSearcher=true,expungeDeletes=false,softCommit=false,prepareCommit=false}
   [junit4]   2> 69068 T203 C773 oasc.SolrDeletionPolicy.onCommit SolrDeletionPolicy.onCommit: commits: num=2
   [junit4]   2> 		commit{dir=RateLimitedDirectoryWrapper(MockDirectoryWrapper(org.apache.lucene.store.RAMDirectory@e209b490 lockFactory=org.apache.lucene.store.SingleInstanceLockFactory@b0b5f519)),segFN=segments_1,generation=1}
   [junit4]   2> 		commit{dir=RateLimitedDirectoryWrapper(MockDirectoryWrapper(org.apache.lucene.store.RAMDirectory@e209b490 lockFactory=org.apache.lucene.store.SingleInstanceLockFactory@b0b5f519)),segFN=segments_2,generation=2}
   [junit4]   2> 69069 T203 C773 oasc.SolrDeletionPolicy.updateCommits newest commit generation = 2
   [junit4]   2> 69070 T203 C773 oass.SolrIndexSearcher.<init> Opening Searcher@81f67bce main
   [junit4]   2> 69071 T203 C773 oasu.DirectUpdateHandler2.commit end_commit_flush
   [junit4]   2> 69071 T205 oasc.SolrCore.registerSearcher [collection1] Registered new searcher Searcher@81f67bce main{StandardDirectoryReader(segments_2:2:nrt)}
   [junit4]   2> 69073 T203 C773 oasup.LogUpdateProcessor.finish [collection1] webapp=null path=null params={} {commit=} 0 7
   [junit4]   2> 69083 T203 oashl.XMLLoader.init xsltCacheLifetimeSeconds=60
   [junit4]   2> 69330 T203 oasu.DirectUpdateHandler2.commit start commit{,optimize=false,openSearcher=true,waitSearcher=true,expungeDeletes=false,softCommit=false,prepareCommit=false}
   [junit4]   2> 69337 T203 oasc.SolrDeletionPolicy.onCommit SolrDeletionPolicy.onCommit: commits: num=2
   [junit4]   2> 		commit{dir=RateLimitedDirectoryWrapper(MockDirectoryWrapper(org.apache.lucene.store.RAMDirectory@e209b490 lockFactory=org.apache.lucene.store.SingleInstanceLockFactory@b0b5f519)),segFN=segments_2,generation=2}
   [junit4]   2> 		commit{dir=RateLimitedDirectoryWrapper(MockDirectoryWrapper(org.apache.lucene.store.RAMDirectory@e209b490 lockFactory=org.apache.lucene.store.SingleInstanceLockFactory@b0b5f519)),segFN=segments_3,generation=3}
   [junit4]   2> 69339 T203 oasc.SolrDeletionPolicy.updateCommits newest commit generation = 3
   [junit4]   2> 69347 T203 oass.SolrIndexSearcher.<init> Opening Searcher@e81a261c main
   [junit4]   2> 69348 T203 oasu.DirectUpdateHandler2.commit end_commit_flush
   [junit4]   2> 69348 T205 oasc.SolrCore.registerSearcher [collection1] Registered new searcher Searcher@e81a261c main{StandardDirectoryReader(segments_3:4:nrt _0(5.0):C5/1:delGen=1)}
   [junit4]   2> 69350 T203 oas.SolrTestCaseJ4.tearDown ###Ending testNonStringFieldsValues
   [junit4]   2> 69361 T203 oas.SolrTestCaseJ4.setUp ###Starting testNonIndexedSignatureField
   [junit4]   2> 69396 T203 C773 oasu.DirectUpdateHandler2.deleteAll [collection1] REMOVING ALL DOCUMENTS FROM INDEX
   [junit4]   2> 69397 T203 C773 oasup.LogUpdateProcessor.finish [collection1] webapp=null path=null params={} {deleteByQuery=*:*} 0 2
   [junit4]   2> 69423 T203 C773 oasu.DirectUpdateHandler2.commit start commit{,optimize=false,openSearcher=true,waitSearcher=true,expungeDeletes=false,softCommit=false,prepareCommit=false}
   [junit4]   2> 69424 T203 C773 oasc.SolrDeletionPolicy.onCommit SolrDeletionPolicy.onCommit: commits: num=2
   [junit4]   2> 		commit{dir=RateLimitedDirectoryWrapper(MockDirectoryWrapper(org.apache.lucene.store.RAMDirectory@e209b490 lockFactory=org.apache.lucene.store.SingleInstanceLockFactory@b0b5f519)),segFN=segments_3,generation=3}
   [junit4]   2> 		commit{dir=RateLimitedDirectoryWrapper(MockDirectoryWrapper(org.apache.lucene.store.RAMDirectory@e209b490 lockFactory=org.apache.lucene.store.SingleInstanceLockFactory@b0b5f519)),segFN=segments_4,generation=4}
   [junit4]   2> 69426 T203 C773 oasc.SolrDeletionPolicy.updateCommits newest commit generation = 4
   [junit4]   2> 69428 T203 C773 oass.SolrIndexSearcher.<init> Opening Searcher@7821cddc main
   [junit4]   2> 69429 T203 C773 oasu.DirectUpdateHandler2.commit end_commit_flush
   [junit4]   2> 69429 T205 oasc.SolrCore.registerSearcher [collection1] Registered new searcher Searcher@7821cddc main{StandardDirectoryReader(segments_4:5:nrt)}
   [junit4]   2> 69431 T203 C773 oasup.LogUpdateProcessor.finish [collection1] webapp=null path=null params={} {commit=} 0 9
   [junit4]   2> 69443 T203 oasu.DirectUpdateHandler2.commit start commit{,optimize=false,openSearcher=true,waitSearcher=true,expungeDeletes=false,softCommit=false,prepareCommit=false}
   [junit4]   2> 69449 T203 oasc.SolrDeletionPolicy.onCommit SolrDeletionPolicy.onCommit: commits: num=2
   [junit4]   2> 		commit{dir=RateLimitedDirectoryWrapper(MockDirectoryWrapper(org.apache.lucene.store.RAMDirectory@e209b490 lockFactory=org.apache.lucene.store.SingleInstanceLockFactory@b0b5f519)),segFN=segments_4,generation=4}
   [junit4]   2> 		commit{dir=RateLimitedDirectoryWrapper(MockDirectoryWrapper(org.apache.lucene.store.RAMDirectory@e209b490 lockFactory=org.apache.lucene.store.SingleInstanceLockFactory@b0b5f519)),segFN=segments_5,generation=5}
   [junit4]   2> 69450 T203 oasc.SolrDeletionPolicy.updateCommits newest commit generation = 5
   [junit4]   2> 69454 T203 oass.SolrIndexSearcher.<init> Opening Searcher@de26ebc6 main
   [junit4]   2> 69460 T205 oasc.SolrCore.registerSearcher [collection1] Registered new searcher Searcher@de26ebc6 main{StandardDirectoryReader(segments_5:7:nrt _1(5.0):C2)}
   [junit4]   2> 69460 T203 oasu.DirectUpdateHandler2.commit end_commit_flush
   [junit4]   2> 69461 T203 oas.SolrTestCaseJ4.tearDown ###Ending testNonIndexedSignatureField
   [junit4]   2> 69486 T203 oas.SolrTestCaseJ4.setUp ###Starting testDupeAllFieldsDetection
   [junit4]   2> 69495 T203 C773 oasu.DirectUpdateHandler2.deleteAll [collection1] REMOVING ALL DOCUMENTS FROM INDEX
   [junit4]   2> 69496 T203 C773 oasup.LogUpdateProcessor.finish [collection1] webapp=null path=null params={} {deleteByQuery=*:*} 0 2
   [junit4]   2> 69509 T203 C773 oasu.DirectUpdateHandler2.commit start commit{,optimize=false,openSearcher=true,waitSearcher=true,expungeDeletes=false,softCommit=false,prepareCommit=false}
   [junit4]   2> 69511 T203 C773 oasc.SolrDeletionPolicy.onCommit SolrDeletionPolicy.onCommit: commits: num=2
   [junit4]   2> 		commit{dir=RateLimitedDirectoryWrapper(MockDirectoryWrapper(org.apache.lucene.store.RAMDirectory@e209b490 lockFactory=org.apache.lucene.store.SingleInstanceLockFactory@b0b5f519)),segFN=segments_5,generation=5}
   [junit4]   2> 		commit{dir=RateLimitedDirectoryWrapper(MockDirectoryWrapper(org.apache.lucene.store.RAMDirectory@e209b490 lockFactory=org.apache.lucene.store.SingleInstanceLockFactory@b0b5f519)),segFN=segments_6,generation=6}
   [junit4]   2> 69512 T203 C773 oasc.SolrDeletionPolicy.updateCommits newest commit generation = 6
   [junit4]   2> 69519 T203 C773 oass.SolrIndexSearcher.<init> Opening Searcher@36e01b35 main
   [junit4]   2> 69520 T203 C773 oasu.DirectUpdateHandler2.commit end_commit_flush
   [junit4]   2> 69520 T205 oasc.SolrCore.registerSearcher [collection1] Registered new searcher Searcher@36e01b35 main{StandardDirectoryReader(segments_6:8:nrt)}
   [junit4]   2> 69522 T203 C773 oasup.LogUpdateProcessor.finish [collection1] webapp=null path=null params={} {commit=} 0 13
   [junit4]   2> 69540 T203 oasu.DirectUpdateHandler2.commit start commit{,optimize=false,openSearcher=true,waitSearcher=true,expungeDeletes=false,softCommit=false,prepareCommit=false}
   [junit4]   2> 69544 T203 oasc.SolrDeletionPolicy.onCommit SolrDeletionPolicy.onCommit: commits: num=2
   [junit4]   2> 		commit{dir=RateLimitedDirectoryWrapper(MockDirectoryWrapper(org.apache.lucene.store.RAMDirectory@e209b490 lockFactory=org.apache.lucene.store.SingleInstanceLockFactory@b0b5f519)),segFN=segments_6,generation=6}
   [junit4]   2> 		commit{dir=RateLimitedDirectoryWrapper(MockDirectoryWrapper(org.apache.lucene.store.RAMDirectory@e209b490 lockFactory=org.apache.lucene.store.SingleInstanceLockFactory@b0b5f519)),segFN=segments_7,generation=7}
   [junit4]   2> 69545 T203 oasc.SolrDeletionPolicy.updateCommits newest commit generation = 7
   [junit4]   2> 69548 T203 oass.SolrIndexSearcher.<init> Opening Searcher@c2eb7f20 main
   [junit4]   2> 69550 T203 oasu.DirectUpdateHandler2.commit end_commit_flush
   [junit4]   2> 69550 T205 oasc.SolrCore.registerSearcher [collection1] Registered new searcher Searcher@c2eb7f20 main{StandardDirectoryReader(segments_7:10:nrt _2(5.0):C3)}
   [junit4]   2> 69552 T203 oas.SolrTestCaseJ4.tearDown ###Ending testDupeAllFieldsDetection
   [junit4]   2> 69569 T203 oas.SolrTestCaseJ4.setUp ###Starting testMultiThreaded
   [junit4]   2> 69581 T203 C773 oasu.DirectUpdateHandler2.deleteAll [collection1] REMOVING ALL DOCUMENTS FROM INDEX
   [junit4]   2> 69582 T203 C773 oasup.LogUpdateProcessor.finish [collection1] webapp=null path=null params={} {deleteByQuery=*:*} 0 3
   [junit4]   2> 69600 T203 C773 oasu.DirectUpdateHandler2.commit start commit{,optimize=false,openSearcher=true,waitSearcher=true,expungeDeletes=false,softCommit=false,prepareCommit=false}
   [junit4]   2> 69609 T203 C773 oasc.SolrDeletionPolicy.onCommit SolrDeletionPolicy.onCommit: commits: num=2
   [junit4]   2> 		commit{dir=RateLimitedDirectoryWrapper(MockDirectoryWrapper(org.apache.lucene.store.RAMDirectory@e209b490 lockFactory=org.apache.lucene.store.SingleInstanceLockFactory@b0b5f519)),segFN=segments_7,generation=7}
   [junit4]   2> 		commit{dir=RateLimitedDirectoryWrapper(MockDirectoryWrapper(org.apache.lucene.store.RAMDirectory@e209b490 lockFactory=org.apache.lucene.store.SingleInstanceLockFactory@b0b5f519)),segFN=segments_8,generation=8}
   [junit4]   2> 69610 T203 C773 oasc.SolrDeletionPolicy.updateCommits newest commit generation = 8
   [junit4]   2> 69616 T203 C773 oass.SolrIndexSearcher.<init> Opening Searcher@a4d61b29 main
   [junit4]   2> 69620 T205 oasc.SolrCore.registerSearcher [collection1] Registered new searcher Searcher@a4d61b29 main{StandardDirectoryReader(segments_8:11:nrt)}
   [junit4]   2> 69621 T203 C773 oasu.DirectUpdateHandler2.commit end_commit_flush
   [junit4]   2> 69622 T203 C773 oasup.LogUpdateProcessor.finish [collection1] webapp=null path=null params={} {commit=} 0 23
   [junit4]   2> 69654 T214 oasu.DirectUpdateHandler2.commit start commit{,optimize=false,openSearcher=true,waitSearcher=true,expungeDeletes=false,softCommit=false,prepareCommit=false}
   [junit4]   2> 69680 T214 oasc.SolrDeletionPolicy.onCommit SolrDeletionPolicy.onCommit: commits: num=2
   [junit4]   2> 		commit{dir=RateLimitedDirectoryWrapper(MockDirectoryWrapper(org.apache.lucene.store.RAMDirectory@e209b490 lockFactory=org.apache.lucene.store.SingleInstanceLockFactory@b0b5f519)),segFN=segments_8,generation=8}
   [junit4]   2> 		commit{dir=RateLimitedDirectoryWrapper(MockDirectoryWrapper(org.apache.lucene.store.RAMDirectory@e209b490 lockFactory=org.apache.lucene.store.SingleInstanceLockFactory@b0b5f519)),segFN=segments_9,generation=9}
   [junit4]   2> 69680 T214 oasc.SolrDeletionPolicy.updateCommits newest commit generation = 9
   [junit4]   2> 69826 T214 oass.SolrIndexSearcher.<init> Opening Searcher@649ffe64 main
   [junit4]   2> 69829 T205 oasc.SolrCore.registerSearcher [collection1] Registered new searcher Searcher@649ffe64 main{StandardDirectoryReader(segments_9:30:nrt _8(5.0):C14/13:delGen=1 _6(5.0):C17/16:delGen=1)}
   [junit4]   2> 69830 T214 oasu.DirectUpdateHandler2.commit end_commit_flush
   [junit4]   2> 69831 T215 oasu.DirectUpdateHandler2.commit start commit{,optimize=false,openSearcher=true,waitSearcher=true,expungeDeletes=false,softCommit=false,prepareCommit=false}
   [junit4]   2> 70002 T215 oasc.SolrDeletionPolicy.onCommit SolrDeletionPolicy.onCommit: commits: num=2
   [junit4]   2> 		commit{dir=RateLimitedDirectoryWrapper(MockDirectoryWrapper(org.apache.lucene.store.RAMDirectory@e209b490 lockFactory=org.apache.lucene.store.SingleInstanceLockFactory@b0b5f519)),segFN=segments_9,generation=9}
   [junit4]   2> 		commit{dir=RateLimitedDirectoryWrapper(MockDirectoryWrapper(org.apache.lucene.store.RAMDirectory@e209b490 lockFactory=org.apache.lucene.store.SingleInstanceLockFactory@b0b5f519)),segFN=segments_a,generation=10}
   [junit4]   2> 70003 T215 oasc.SolrDeletionPolicy.updateCommits newest commit generation = 10
   [junit4]   2> 70080 T215 oass.SolrIndexSearcher.<init> Opening Searcher@f9a8b3ed main
   [junit4]   2> 70084 T205 oasc.SolrCore.registerSearcher [collection1] Registered new searcher Searcher@f9a8b3ed main{StandardDirectoryReader(segments_a:43:nrt _c(5.0):C21/20:delGen=1)}
   [junit4]   2> 70085 T215 oasu.DirectUpdateHandler2.commit end_commit_flush
   [junit4]   2> 70086 T216 oasu.DirectUpdateHandler2.commit start commit{,optimize=false,openSearcher=true,waitSearcher=true,expungeDeletes=false,softCommit=false,prepareCommit=false}
   [junit4]   2> 70088 T216 oasc.SolrDeletionPolicy.onCommit SolrDeletionPolicy.onCommit: commits: num=2
   [junit4]   2> 		commit{dir=RateLimitedDirectoryWrapper(MockDirectoryWrapper(org.apache.lucene.store.RAMDirectory@e209b490 lockFactory=org.apache.lucene.store.SingleInstanceLockFactory@b0b5f519)),segFN=segments_a,generation=10}
   [junit4]   2> 		commit{dir=RateLimitedDirectoryWrapper(MockDirectoryWrapper(org.apache.lucene.store.RAMDirectory@e209b490 lockFactory=org.apache.lucene.store.SingleInstanceLockFactory@b0b5f519)),segFN=segments_b,generation=11}
   [junit4]   2> 70089 T216 oasc.SolrDeletionPolicy.updateCommits newest commit generation = 11
   [junit4]   2> 70090 T216 oass.SolrIndexSearcher.<init> Opening Searcher@929e0ea main
   [junit4]   2> 70091 T216 oasu.DirectUpdateHandler2.commit end_commit_flush
   [junit4]   2> 70093 T214 oasu.DirectUpdateHandler2.commit start commit{,optimize=false,openSearcher=true,waitSearcher=true,expungeDeletes=false,softCommit=false,prepareCommit=false}
   [junit4]   2> 70093 T214 oasu.DirectUpdateHandler2.commit No uncommitted changes. Skipping IW.commit.
   [junit4]   2> 70091 T205 oasc.SolrCore.registerSearcher [collection1] Registered new searcher Searcher@929e0ea main{StandardDirectoryReader(segments_a:43:nrt _c(5.0):C21/20:delGen=2)}
   [junit4]   2> 70094 T214 oass.SolrIndexSearcher.<init> Opening Searcher@3236c9f5 main
   [junit4]   2> 70095 T214 oasu.DirectUpdateHandler2.commit end_commit_flush
   [junit4]   2> 70096 T205 oasc.SolrCore.registerSearcher [collection1] Registered new searcher Searcher@3236c9f5 main{StandardDirectoryReader(segments_a:43:nrt _c(5.0):C21/20:delGen=2)}
   [junit4]   2> 70099 T216 oasu.DirectUpdateHandler2.commit start commit{,optimize=false,openSearcher=true,waitSearcher=true,expungeDeletes=false,softCommit=false,prepareCommit=false}
   [junit4]   2> 70111 T216 oasc.SolrDeletionPolicy.onCommit SolrDeletionPolicy.onCommit: commits: num=2
   [junit4]   2> 		commit{dir=RateLimitedDirectoryWrapper(MockDirectoryWrapper(org.apache.lucene.store.RAMDirectory@e209b490 lockFactory=org.apache.lucene.store.SingleInstanceLockFactory@b0b5f519)),segFN=segments_b,generation=11}
   [junit4]   2> 		commit{dir=RateLimitedDirectoryWrapper(MockDirectoryWrapper(org.apache.lucene.store.RAMDirectory@e209b490 lockFactory=org.apache.lucene.store.SingleInstanceLockFactory@b0b5f519)),segFN=segments_c,generation=12}
   [junit4]   2> 70111 T216 oasc.SolrDeletionPolicy.updateCommits newest commit generation = 12
   [junit4]   2> 70127 T216 oass.SolrIndexSearcher.<init> Opening Searcher@18f55281 main
   [junit4]   2> 70128 T216 oasu.DirectUpdateHandler2.commit end_commit_flush
   [junit4]   2> 70128 T205 oasc.SolrCore.registerSearcher [collection1] Registered new searcher Searcher@18f55281 main{StandardDirectoryReader(segments_c:51:nrt _g(5.0):C1)}
   [junit4]   2> 70130 T214 oasu.DirectUpdateHandler2.commit start commit{,optimize=false,openSearcher=true,waitSearcher=true,expungeDeletes=false,softCommit=false,prepareCommit=false}
   [junit4]   2> 70132 T214 oasc.SolrDeletionPolicy.onCommit SolrDeletionPolicy.onCommit: commits: num=2
   [junit4]   2> 		commit{dir=RateLimitedDirectoryWrapper(MockDirectoryWrapper(org.apache.lucene.store.RAMDirectory@e209b490 lockFactory=org.apache.lucene.store.SingleInstanceLockFactory@b0b5f519)),segFN=segments_c,generation=12}
   [junit4]   2> 		commit{dir=RateLimitedDirectoryWrapper(MockDirectoryWrapper(org.apache.lucene.store.RAMDirectory@e209b490 lockFactory=org.apache.lucene.store.SingleInstanceLockFactory@b0b5f519)),segFN=segments_d,generation=13}
   [junit4]   2> 70132 T214 oasc.SolrDeletionPolicy.updateCommits newest commit generation = 13
   [junit4]   2> 70134 T214 oass.SolrIndexSearcher.<init> Opening Searcher@57ed9355 main
   [junit4]   2> 70134 T214 oasu.DirectUpdateHandler2.commit end_commit_flush
   [junit4]   2> 70135 T205 oasc.SolrCore.registerSearcher [collection1] Registered new searcher Searcher@57ed9355 main{StandardDirectoryReader(segments_c:51:nrt _g(5.0):C1)}
   [junit4]   2> 70136 T215 oasu.DirectUpdateHandler2.commit start commit{,optimize=false,openSearcher=true,waitSearcher=true,expungeDeletes=false,softCommit=false,prepareCommit=false}
   [junit4]   2> 70136 T215 oasu.DirectUpdateHandler2.commit No uncommitted changes. Skipping IW.commit.
   [junit4]   2> 70137 T215 oass.SolrIndexSearcher.<init> Opening Searcher@282c891e main
   [junit4]   2> 70138 T215 oasu.DirectUpdateHandler2.commit end_commit_flush
   [junit4]   2> 70139 T205 oasc.SolrCore.registerSearcher [collection1] Registered new searcher Searcher@282c891e main{StandardDirectoryReader(segments_c:51:nrt _g(5.0):C1)}
   [junit4]   2> 70143 T214 oasu.DirectUpdateHandler2.commit start commit{,optimize=false,openSearcher=true,waitSearcher=true,expungeDeletes=false,softCommit=false,prepareCommit=false}
   [junit4]   2> 70152 T214 oasc.SolrDeletionPolicy.onCommit SolrDeletionPolicy.onCommit: commits: num=2
   [junit4]   2> 		commit{dir=RateLimitedDirectoryWrapper(MockDirectoryWrapper(org.apache.lucene.store.RAMDirectory@e209b490 lockFactory=org.apache.lucene.store.SingleInstanceLockFactory@b0b5f519)),segFN=segments_d,generation=13}
   [junit4]   2> 		commit{dir=RateLimitedDirectoryWrapper(MockDirectoryWrapper(org.apache.lucene.store.RAMDirectory@e209b490 lockFactory=org.apache.lucene.store.SingleInstanceLockFactory@b0b5f519)),segFN=segments_e,generation=14}
   [junit4]   2> 70153 T214 oasc.SolrDeletionPolicy.updateCommits newest commit generation = 14
   [junit4]   2> 70158 T214 oass.SolrIndexSearcher.<init> Opening Searcher@62541b86 main
   [junit4]   2> 70162 T205 oasc.SolrCore.registerSearcher [collection1] Registered new searcher Searcher@62541b86 main{StandardDirectoryReader(segments_e:58:nrt _h(5.0):C2/1 _i(5.0):C1)}
   [junit4]   2> 70162 T214 oasu.DirectUpdateHandler2.commit end_commit_flush
   [junit4]   2> 70163 T215 oasu.DirectUpdateHandler2.commit start commit{,optimize=false,openSearcher=true,waitSearcher=true,expungeDeletes=false,softCommit=false,prepareCommit=false}
   [junit4]   2> 70167 T215 oasc.SolrDeletionPolicy.onCommit SolrDeletionPolicy.onCommit: commits: num=2
   [junit4]   2> 		commit{dir=RateLimitedDirectoryWrapper(MockDirectoryWrapper(org.apache.lucene.store.RAMDirectory@e209b490 lockFactory=org.apache.lucene.store.SingleInstanceLockFactory@b0b5f519)),segFN=segments_e,generation=14}
   [junit4]   2> 		commit{dir=RateLimitedDirectoryWrapper(MockDirectoryWrapper(org.apache.lucene.store.RAMDirectory@e209b490 lockFactory=org.apache.lucene.store.SingleInstanceLockFactory@b0b5f519)),segFN=segments_f,generation=15}
   [junit4]   2> 70168 T215 oasc.SolrDeletionPolicy.updateCommits newest commit generation = 15
   [junit4]   2> 70176 T215 oass.SolrIndexSearcher.<init> Opening Searcher@f3dea041 main
   [junit4]   2> 70179 T205 oasc.SolrCore.registerSearcher [collection1] Registered new searcher Searcher@f3dea041 main{StandardDirectoryReader(segments_f:62:nrt _i(5.0):C1 _j(5.0):C1)}
   [junit4]   2> 70181 T215 oasu.DirectUpdateHandler2.commit end_commit_flush
   [junit4]   2> 70182 T216 oasu.DirectUpdateHandler2.commit start commit{,optimize=false,openSearcher=true,waitSearcher=true,expungeDeletes=false,softCommit=false,prepareCommit=false}
   [junit4]   2> 70185 T216 oasc.SolrDeletionPolicy.onCommit SolrDeletionPolicy.onCommit: commits: num=2
   [junit4]   2> 		commit{dir=RateLimitedDirectoryWrapper(MockDirectoryWrapper(org.apache.lucene.store.RAMDirectory@e209b490 lockFactory=org.apache.lucene.store.SingleInstanceLockFactory@b0b5f519)),segFN=segments_f,generation=15}
   [junit4]   2> 		commit{dir=RateLimitedDirectoryWrapper(MockDirectoryWrapper(org.apache.lucene.store.RAMDirectory@e209b490 lockFactory=org.apache.lucene.store.SingleInstanceLockFactory@b0b5f519)),segFN=segments_g,generation=16}
   [junit4]   2> 70186 T216 oasc.SolrDeletionPolicy.updateCommits newest commit generation = 16
   [junit4]   2> 70187 T216 oass.SolrIndexSearcher.<init> Opening Searcher@b8f098bf main
   [junit4]   2> 70189 T216 oasu.DirectUpdateHandler2.commit end_commit_flush
   [junit4]   2> 70190 T205 oasc.SolrCore.registerSearcher [collection1] Registered new searcher Searcher@b8f098bf main{StandardDirectoryReader(segments_f:62:nrt _i(5.0):C1 _j(5.0):C1)}
   [junit4]   2> 70199 T214 oasu.DirectUpdateHandler2.commit start commit{,optimize=false,openSearcher=true,waitSearcher=true,expungeDeletes=false,softCommit=false,prepareCommit=false}
   [junit4]   2> 70228 T214 oasc.SolrDeletionPolicy.onCommit SolrDeletionPolicy.onCommit: commits: num=2
   [junit4]   2> 		commit{dir=RateLimitedDirectoryWrapper(MockDirectoryWrapper(org.apache.lucene.store.RAMDirectory@e209b490 lockFactory=org.apache.lucene.store.SingleInstanceLockFactory@b0b5f519)),segFN=segments_g,generation=16}
   [junit4]   2> 		commit{dir=RateLimitedDirectoryWrapper(MockDirectoryWrapper(org.apache.lucene.store.RAMDirectory@e209b490 lockFactory=org.apache.lucene.store.SingleInstanceLockFactory@b0b5f519)),segFN=segments_h,generation=17}
   [junit4]   2> 70229 T214 oasc.SolrDeletionPolicy.updateCommits newest commit generation = 17
   [junit4]   2> 70235 T214 oass.SolrIndexSearcher.<init> Opening Searcher@28627c2f main
   [junit4]   2> 70236 T214 oasu.DirectUpdateHandler2.commit end_commit_flush
   [junit4]   2> 70236 T205 oasc.SolrCore.registerSearcher [collection1] Registered new searcher Searcher@28627c2f main{StandardDirectoryReader(segments_h:66:nrt _i(5.0):C1 _k(5.0):C2/1:delGen=1)}
   [junit4]   2> 70238 T216 oasu.DirectUpdateHandler2.commit start commit{,optimize=false,openSearcher=true,waitSearcher=true,expungeDeletes=false,softCommit=false,prepareCommit=false}
   [junit4]   2> 70239 T216 oasu.DirectUpdateHandler2.commit No uncommitted changes. Skipping IW.commit.
   [junit4]   2> 70239 T216 oass.SolrIndexSearcher.<init> Opening Searcher@e3fd2811 main
   [junit4]   2> 70242 T205 oasc.SolrCore.registerSearcher [collection1] Registered new searcher Searcher@e3fd2811 main{StandardDirectoryReader(segments_h:66:nrt _i(5.0):C1 _k(5.0):C2/1:delGen=1)}
   [junit4]   2> 70244 T216 oasu.DirectUpdateHandler2.commit end_commit_flush
   [junit4]   2> 70245 T215 oasu.DirectUpdateHandler2.commit start commit{,optimize=false,openSearcher=true,waitSearcher=true,expungeDeletes=false,softCommit=false,prepareCommit=false}
   [junit4]   2> 70303 T215 oasc.SolrDeletionPolicy.onCommit SolrDeletionPolicy.onCommit: commits: num=2
   [junit4]   2> 		commit{dir=RateLimitedDirectoryWrapper(MockDirectoryWrapper(org.apache.lucene.store.RAMDirectory@e209b490 lockFactory=org.apache.lucene.store.SingleInstanceLockFactory@b0b5f519)),segFN=segments_h,generation=17}
   [junit4]   2> 		commit{dir=RateLimitedDirectoryWrapper(MockDirectoryWrapper(org.apache.lucene.store.RAMDirectory@e209b490 lockFactory=org.apache.lucene.store.SingleInstanceLockFactory@b0b5f519)),segFN=segments_i,generation=18}
   [junit4]   2> 70304 T215 oasc.SolrDeletionPolicy.updateCommits newest commit generation = 18
   [junit4]   2> 70310 T215 oass.SolrIndexSearcher.<init> Opening Searcher@bd214e5c main
   [junit4]   2> 70311 T215 oasu.DirectUpdateHandler2.commit end_commit_flush
   [junit4]   2> 70311 T205 oasc.SolrCore.registerSearcher [collection1] Registered new searcher Searcher@bd214e5c main{StandardDirectoryReader(segments_i:74:nrt _k(5.0):C2/1:delGen=1 _m(5.0):C1)}
   [junit4]   2> 70311 T214 oasu.DirectUpdateHandler2.commit start commit{,optimize=false,openSearcher=true,waitSearcher=true,expungeDeletes=false,softCommit=false,prepareCommit=false}
   [junit4]   2> 70313 T214 oasc.SolrDeletionPolicy.onCommit SolrDeletionPolicy.onCommit: commits: num=2
   [junit4]   2> 		commit{dir=RateLimitedDirectoryWrapper(MockDirectoryWrapper(org.apache.lucene.store.RAMDirectory@e209b490 lockFactory=org.apache.lucene.store.SingleInstanceLockFactory@b0b5f519)),segFN=segments_i,generation=18}
   [junit4]   2> 		commit{dir=RateLimitedDirectoryWrapper(MockDirectoryWrapper(org.apache.lucene.store.RAMDirectory@e209b490 lockFactory=org.apache.lucene.store.SingleInstanceLockFactory@b0b5f519)),segFN=segments_j,generation=19}
   [junit4]   2> 70313 T214 oasc.SolrDeletionPolicy.updateCommits newest commit generation = 19
   [junit4]   2> 70314 T214 oass.SolrIndexSearcher.<init> Opening Searcher@a16561c1 main
   [junit4]   2> 70315 T214 oasu.DirectUpdateHandler2.commit end_commit_flush
   [junit4]   2> 70315 T205 oasc.SolrCore.registerSearcher [collection1] Registered new searcher Searcher@a16561c1 main{StandardDirectoryReader(segments_i:74:nrt _k(5.0):C2/1:delGen=1 _m(5.0):C1)}
   [junit4]   2> 70316 T216 oasu.DirectUpdateHandler2.commit start commit{,optimize=false,openSearcher=true,waitSearcher=true,expungeDeletes=false,softCommit=false,prepareCommit=false}
   [junit4]   2> 70322 T216 oasc.SolrDeletionPolicy.onCommit SolrDeletionPolicy.onCommit: commits: num=2
   [junit4]   2> 		commit{dir=RateLimitedDirectoryWrapper(MockDirectoryWrapper(org.apache.lucene.store.RAMDirectory@e209b490 lockFactory=org.apache.lucene.store.SingleInstanceLockFactory@b0b5f519)),segFN=segments_j,generation=19}
   [junit4]   2> 		commit{dir=RateLimitedDirectoryWrapper(MockDirectoryWrapper(org.apache.lucene.store.RAMDirectory@e209b490 lockFactory=org.apache.lucene.store.SingleInstanceLockFactory@b0b5f519)),segFN=segments_k,generation=20}
   [junit4]   2> 70323 T216 oasc.SolrDeletionPolicy.updateCommits newest commit generation = 20
   [junit4]   2> 70330 T216 oass.SolrIndexSearcher.<init> Opening Searcher@1b88d8ee main
   [junit4]   2> 70333 T205 oasc.SolrCore.registerSearcher [collection1] Registered new searcher Searcher@1b88d8ee main{StandardDirectoryReader(segments_k:82:nrt _o(5.0):C1)}
   [junit4]   2> 70334 T216 oasu.DirectUpdateHandler2.commit end_commit_flush
   [junit4]   2> 70335 T215 oasu.DirectUpdateHandler2.commit start commit{,optimize=false,openSearcher=true,waitSearcher=true,expungeDeletes=false,softCommit=false,prepareCommit=false}
   [junit4]   2> 70336 T215 oasc.SolrDeletionPolicy.onCommit SolrDeletionPolicy.onCommit: commits: num=2
   [junit4]   2> 		commit{dir=RateLimitedDirectoryWrapper(MockDirectoryWrapper(org.apache.lucene.store.RAMDirectory@e209b490 lockFactory=org.apache.lucene.store.SingleInstanceLockFactory@b0b5f519)),segFN=segments_k,generation=20}
   [junit4]   2> 		commit{dir=RateLimitedDirectoryWrapper(MockDirectoryWrapper(org.apache.lucene.store.RAMDirectory@e209b490 lockFactory=org.apache.lucene.store.SingleInstanceLockFactory@b0b5f519)),segFN=segments_l,generation=21}
   [junit4]   2> 70337 T215 oasc.SolrDeletionPolicy.updateCommits newest commit generation = 21
   [junit4]   2> 70344 T215 oass.SolrIndexSearcher.<init> Opening Searcher@2034778e main
   [junit4]   2> 70345 T215 oasu.DirectUpdateHandler2.commit end_commit_flush
   [junit4]   2> 70345 T205 oasc.SolrCore.registerSearcher [collection1] Registered new searcher Searcher@2034778e main{StandardDirectoryReader(segments_l:86:nrt _p(5.0):C1)}
   [junit4]   2> 70345 T214 oasu.DirectUpdateHandler2.commit start commit{,optimize=false,openSearcher=true,waitSearcher=true,expungeDeletes=false,softCommit=false,prepareCommit=false}
   [junit4]   2> 70347 T214 oasc.SolrDeletionPolicy.onCommit SolrDeletionPolicy.onCommit: commits: num=2
   [junit4]   2> 		commit{dir=RateLimitedDirectoryWrapper(MockDirectoryWrapper(org.apache.lucene.store.RAMDirectory@e209b490 lockFactory=org.apache.lucene.store.SingleInstanceLockFactory@b0b5f519)),segFN=segments_l,generation=21}
   [junit4]   2> 		commit{dir=RateLimitedDirectoryWrapper(MockDirectoryWrapper(org.apache.lucene.store.RAMDirectory@e209b490 lockFactory=org.apache.lucene.store.SingleInstanceLockFactory@b0b5f519)),segFN=segments_m,generation=22}
   [junit4]   2> 70348 T214 oasc.SolrDeletionPolicy.updateCommits newest commit generation = 22
   [junit4]   2> 70354 T214 oass.SolrIndexSearcher.<init> Opening Searcher@81de6e9f main
   [junit4]   2> 70355 T214 oasu.DirectUpdateHandler2.commit end_commit_flush
   [junit4]   2> 70356 T205 oasc.SolrCore.registerSearcher [collection1] Registered new searcher Searcher@81de6e9f main{StandardDirectoryReader(segments_m:88:nrt _p(5.0):C1 _q(5.0):C1)}
   [junit4]   2> 70356 T216 oasu.DirectUpdateHandler2.commit start commit{,optimize=false,openSearcher=true,waitSearcher=true,expungeDeletes=false,softCommit=false,prepareCommit=false}
   [junit4]   2> 70360 T216 oasc.SolrDeletionPolicy.onCommit SolrDeletionPolicy.onCommit: commits: num=2
   [junit4]   2> 		commit{dir=RateLimitedDirectoryWrapper(MockDirectoryWrapper(org.apache.lucene.store.RAMDirectory@e209b490 lockFactory=org.apache.lucene.store.SingleInstanceLockFactory@b0b5f519)),segFN=segments_m,generation=22}
   [junit4]   2> 		commit{dir=RateLimitedDirectoryWrapper(MockDirectoryWrapper(org.apache.lucene.store.RAMDirectory@e209b490 lockFactory=o

[...truncated too long message...]

<date name="median">1805-12-31T23:59:59Z</date>
   [junit4]    >   </lst>
   [junit4]    >   <lst name="rr">
   [junit4]    >     <str name="max">str9</str>
   [junit4]    >     <str name="min">str0</str>
   [junit4]    >     <str name="rmax">9rts</str>
   [junit4]    >     <str name="rmin">0rts</str>
   [junit4]    >   </lst>
   [junit4]    >   <lst name="nr">
   [junit4]    >     <double name="c">-100.0</double>
   [junit4]    >     <long name="count">100</long>
   [junit4]    >     <null name="s"/>
   [junit4]    >     <null name="sum"/>
   [junit4]    >   </lst>
   [junit4]    > </lst>
   [junit4]    > </response>
   [junit4]    > 	at __randomizedtesting.SeedInfo.seed([7994B522A7F98776:21995ED4833BE5A0]:0)
   [junit4]    > 	at org.apache.solr.analytics.AbstractAnalyticsStatsTest.getStatResult(AbstractAnalyticsStatsTest.java:113)
   [junit4]    > 	at org.apache.solr.analytics.expression.ExpressionTest.divideTest(ExpressionTest.java:106)
   [junit4]    > 	at java.lang.Thread.run(Thread.java:780)
   [junit4]   2> 656530 T3124 oas.SolrTestCaseJ4.setUp ###Starting concatenateTest
   [junit4]   2> 656537 T3124 oas.SolrTestCaseJ4.tearDown ###Ending concatenateTest
   [junit4]   2> 656541 T3124 oas.SolrTestCaseJ4.deleteCore ###deleteCore
   [junit4]   2> 656541 T3124 oasc.CoreContainer.shutdown Shutting down CoreContainer instance=-585279336
   [junit4]   2> 656541 T3124 oasc.SolrCore.close [collection1]  CLOSING SolrCore org.apache.solr.core.SolrCore@86c48cfd
   [junit4]   2> 656542 T3124 oasu.DirectUpdateHandler2.close closing DirectUpdateHandler2{commits=1,autocommits=0,soft autocommits=0,optimizes=0,rollbacks=0,expungeDeletes=0,docsPending=0,adds=0,deletesById=0,deletesByQuery=0,errors=0,cumulative_adds=100,cumulative_deletesById=0,cumulative_deletesByQuery=1,cumulative_errors=0}
   [junit4]   2> 656543 T3124 oasu.SolrCoreState.decrefSolrCoreState Closing SolrCoreState
   [junit4]   2> 656544 T3124 oasu.DefaultSolrCoreState.closeIndexWriter SolrCoreState ref count has reached 0 - closing IndexWriter
   [junit4]   2> 656544 T3124 oasu.DefaultSolrCoreState.closeIndexWriter closing IndexWriter with IndexWriterCloser
   [junit4]   2> 656545 T3124 oasc.SolrCore.closeSearcher [collection1] Closing main searcher on request.
   [junit4]   2> 656546 T3124 oasc.CachingDirectoryFactory.close Closing MockDirectoryFactory - 2 directories currently being tracked
   [junit4]   2> 656546 T3124 oasc.CachingDirectoryFactory.closeCacheValue looking to close /mnt/ssd/jenkins/workspace/Lucene-Solr-trunk-Linux/solr/build/solr-core/test/J0/./solrtest-ExpressionTest-1388205418340 [CachedDir<<refCount=0;path=/mnt/ssd/jenkins/workspace/Lucene-Solr-trunk-Linux/solr/build/solr-core/test/J0/./solrtest-ExpressionTest-1388205418340;done=false>>]
   [junit4]   2> 656547 T3124 oasc.CachingDirectoryFactory.close Closing directory: /mnt/ssd/jenkins/workspace/Lucene-Solr-trunk-Linux/solr/build/solr-core/test/J0/./solrtest-ExpressionTest-1388205418340
   [junit4]   2> 656547 T3124 oasc.CachingDirectoryFactory.closeCacheValue looking to close /mnt/ssd/jenkins/workspace/Lucene-Solr-trunk-Linux/solr/build/solr-core/test/J0/./solrtest-ExpressionTest-1388205418340/index [CachedDir<<refCount=0;path=/mnt/ssd/jenkins/workspace/Lucene-Solr-trunk-Linux/solr/build/solr-core/test/J0/./solrtest-ExpressionTest-1388205418340/index;done=false>>]
   [junit4]   2> 656548 T3124 oasc.CachingDirectoryFactory.close Closing directory: /mnt/ssd/jenkins/workspace/Lucene-Solr-trunk-Linux/solr/build/solr-core/test/J0/./solrtest-ExpressionTest-1388205418340/index
   [junit4]   2> NOTE: test params are: codec=Lucene46: {id=PostingsFormat(name=MockRandom), string_sd=PostingsFormat(name=FSTOrdPulsing41), int_id=PostingsFormat(name=FSTOrdPulsing41), double_dd=PostingsFormat(name=Memory doPackFST= true), date_dtd=PostingsFormat(name=MockRandom), float_fd=PostingsFormat(name=FSTOrdPulsing41), long_ld=PostingsFormat(name=MockRandom)}, docValues:{floatdv=DocValuesFormat(name=SimpleText), double_dd=DocValuesFormat(name=SimpleText), doubledv=DocValuesFormat(name=Lucene45), datedv=DocValuesFormat(name=Disk), stringdv=DocValuesFormat(name=Lucene45), int_id=DocValuesFormat(name=Memory), date_dtd=DocValuesFormat(name=Lucene45), float_fd=DocValuesFormat(name=Memory), long_ld=DocValuesFormat(name=Lucene45), string_sd=DocValuesFormat(name=Memory), intdv=DocValuesFormat(name=Memory), longdv=DocValuesFormat(name=SimpleText), stringdvm=DocValuesFormat(name=SimpleText)}, sim=RandomSimilarityProvider(queryNorm=true,coord=no): {}, locale=el_CY, timezone=Atlantic/Canary
   [junit4]   2> NOTE: Linux 3.8.0-34-generic amd64/IBM Corporation 1.7.0 (64-bit)/cpus=8,threads=1,free=59301640,total=195559424
   [junit4]   2> NOTE: All tests run in this JVM: [QueryEqualityTest, TestSurroundQueryParser, LeaderElectionTest, ZkCLITest, TestSystemIdResolver, AnalysisAfterCoreReloadTest, TestReplicationHandler, SOLR749Test, TestExtendedDismaxParser, URLClassifyProcessorTest, TestFunctionQuery, RangeFacetTest, ClusterStateUpdateTest, SyncSliceTest, TestQueryUtils, EchoParamsTest, OverseerTest, TestGroupingSearch, TestRandomMergePolicy, DOMUtilTest, TestManagedSchema, SearchHandlerTest, ResponseLogComponentTest, ReturnFieldsTest, TestSort, TestBadConfig, TestDocBasedVersionConstraints, TestSchemaVersionResource, DateMathParserTest, HdfsUnloadDistributedZkTest, PrimitiveFieldTypeTest, SliceStateTest, LukeRequestHandlerTest, BadComponentTest, ResourceLoaderTest, CircularListTest, TestCollationFieldDocValues, DocumentBuilderTest, DistributedSpellCheckComponentTest, BasicFunctionalityTest, TestAddFieldRealTimeGet, RegexBoostProcessorTest, TestLMJelinekMercerSimilarityFactory, SchemaVersionSpecificBehaviorTest, TestLFUCache, JsonLoaderTest, WordBreakSolrSpellCheckerTest, ModifyConfFileTest, TermVectorComponentTest, SpatialFilterTest, TestStressUserVersions, QueryFacetTest, QueryParsingTest, TestManagedSchemaFieldResource, TestAnalyzeInfixSuggestions, TestCoreContainer, CachingDirectoryFactoryTest, UUIDFieldTest, TestLRUCache, TestStressVersions, RecoveryZkTest, BasicDistributedZkTest, AutoCommitTest, ScriptEngineTest, ChangedSchemaMergeTest, UpdateRequestProcessorFactoryTest, TestModifyConfFiles, AddSchemaFieldsUpdateProcessorFactoryTest, TestFieldTypeResource, TestElisionMultitermQuery, SliceStateUpdateTest, DeleteReplicaTest, TestSolrQueryParser, TestInfoStreamLogging, ShowFileRequestHandlerTest, SimpleFacetsTest, TestValueSourceCache, SystemInfoHandlerTest, TestCopyFieldCollectionResource, TestRemoteStreaming, TestRandomDVFaceting, TestPerFieldSimilarity, MBeansHandlerTest, CacheHeaderTest, SuggesterTest, TestHashPartitioner, ZkControllerTest, TestStressReorder, TestMultiCoreConfBootstrap, HardAutoCommitTest, DistributedTermsComponentTest, TestSolr4Spatial, SolrCoreTest, StatsComponentTest, QueryElevationComponentTest, PeerSyncTest, ConvertedLegacyTest, TestFiltering, SimplePostToolTest, TestCoreDiscovery, SpellCheckCollatorTest, DocValuesTest, TestCSVLoader, TestPseudoReturnFields, FieldMutatingUpdateProcessorTest, TestWordDelimiterFilterFactory, StatelessScriptUpdateProcessorFactoryTest, DocValuesMultiTest, TestSolrDeletionPolicy1, XsltUpdateRequestHandlerTest, TestWriterPerf, TestReversedWildcardFilterFactory, DocumentAnalysisRequestHandlerTest, FileBasedSpellCheckerTest, RequestHandlersTest, MoreLikeThisHandlerTest, FieldAnalysisRequestHandlerTest, FastVectorHighlighterTest, LoggingHandlerTest, TestJmxIntegration, BinaryUpdateRequestHandlerTest, PingRequestHandlerTest, CoreContainerCoreInitFailuresTest, HighlighterConfigTest, UpdateParamsTest, TestSolrIndexConfig, CopyFieldTest, TestMergePolicyConfig, TestSolrDeletionPolicy2, SampleTest, TestDocSet, TestBinaryField, TestSearchPerf, NumericFieldsTest, MinimalSchemaTest, TestConfig, TestFuzzyAnalyzedSuggestions, ExternalFileFieldSortTest, TestPostingsSolrHighlighter, TestLuceneMatchVersion, TestPhraseSuggestions, SpellPossibilityIteratorTest, TestCharFilters, SynonymTokenizerTest, TestXIncludeConfig, TestDFRSimilarityFactory, TestNumberUtils, TestLMDirichletSimilarityFactory, TestBM25SimilarityFactory, TestDefaultSimilarityFactory, LegacyHTMLStripCharFilterTest, TestJmxMonitoredMap, TestFastOutputStream, ChaosMonkeyNothingIsSafeTest, TestSolrXMLSerializer, PrimUtilsTest, TestSuggestSpellingConverter, DateFieldTest, SpellingQueryConverterTest, ClusterStateTest, TestSolrJ, TestUtils, TestDocumentBuilder, FileUtilsTest, TestRTGBase, SolrTestCaseJ4Test, TestDistributedMissingSort, ExpressionTest]
   [junit4] Completed on J0 in 1.21s, 12 tests, 4 failures <<< FAILURES!

[...truncated 158 lines...]
BUILD FAILED
/mnt/ssd/jenkins/workspace/Lucene-Solr-trunk-Linux/build.xml:453: The following error occurred while executing this line:
/mnt/ssd/jenkins/workspace/Lucene-Solr-trunk-Linux/build.xml:446: The following error occurred while executing this line:
/mnt/ssd/jenkins/workspace/Lucene-Solr-trunk-Linux/build.xml:39: The following error occurred while executing this line:
/mnt/ssd/jenkins/workspace/Lucene-Solr-trunk-Linux/extra-targets.xml:37: The following error occurred while executing this line:
/mnt/ssd/jenkins/workspace/Lucene-Solr-trunk-Linux/solr/build.xml:189: The following error occurred while executing this line:
/mnt/ssd/jenkins/workspace/Lucene-Solr-trunk-Linux/solr/common-build.xml:491: The following error occurred while executing this line:
/mnt/ssd/jenkins/workspace/Lucene-Solr-trunk-Linux/lucene/common-build.xml:1304: The following error occurred while executing this line:
/mnt/ssd/jenkins/workspace/Lucene-Solr-trunk-Linux/lucene/common-build.xml:937: There were test failures: 357 suites, 1573 tests, 5 failures, 67 ignored (6 assumptions)

Total time: 37 minutes 32 seconds
Build step 'Invoke Ant' marked build as failure
Description set: Java: 64bit/ibm-j9-jdk7 -Xjit:exclude={org/apache/lucene/util/fst/FST.pack(IIF)Lorg/apache/lucene/util/fst/FST;}
Archiving artifacts
Recording test results
Email was triggered for: Failure
Sending email for trigger: Failure



Mime
View raw message