lucene-dev mailing list archives

Site index · List index
Message view « Date » · « Thread »
Top « Date » · « Thread »
From Policeman Jenkins Server <jenk...@thetaphi.de>
Subject [JENKINS] Lucene-Solr-4.x-Linux (32bit/ibm-j9-jdk7) - Build # 8776 - Failure!
Date Sun, 29 Dec 2013 19:16:21 GMT
Build: http://jenkins.thetaphi.de/job/Lucene-Solr-4.x-Linux/8776/
Java: 32bit/ibm-j9-jdk7 -Xjit:exclude={org/apache/lucene/util/fst/FST.pack(IIF)Lorg/apache/lucene/util/fst/FST;}

6 tests failed.
REGRESSION:  org.apache.solr.cloud.CollectionsAPIDistributedZkTest.testDistribSearch

Error Message:


Stack Trace:
java.lang.AssertionError
	at __randomizedtesting.SeedInfo.seed([ABD3CEB039C3F2D9:2A3540A84E9C92E5]:0)
	at org.junit.Assert.fail(Assert.java:92)
	at org.junit.Assert.assertTrue(Assert.java:43)
	at org.junit.Assert.assertFalse(Assert.java:68)
	at org.junit.Assert.assertFalse(Assert.java:79)
	at org.apache.solr.cloud.CollectionsAPIDistributedZkTest.deleteCollectionWithDownNodes(CollectionsAPIDistributedZkTest.java:390)
	at org.apache.solr.cloud.CollectionsAPIDistributedZkTest.doTest(CollectionsAPIDistributedZkTest.java:203)
	at org.apache.solr.BaseDistributedSearchTestCase.testDistribSearch(BaseDistributedSearchTestCase.java:849)
	at sun.reflect.NativeMethodAccessorImpl.invoke0(Native Method)
	at sun.reflect.NativeMethodAccessorImpl.invoke(NativeMethodAccessorImpl.java:88)
	at sun.reflect.DelegatingMethodAccessorImpl.invoke(DelegatingMethodAccessorImpl.java:55)
	at java.lang.reflect.Method.invoke(Method.java:613)
	at com.carrotsearch.randomizedtesting.RandomizedRunner.invoke(RandomizedRunner.java:1559)
	at com.carrotsearch.randomizedtesting.RandomizedRunner.access$600(RandomizedRunner.java:79)
	at com.carrotsearch.randomizedtesting.RandomizedRunner$6.evaluate(RandomizedRunner.java:737)
	at com.carrotsearch.randomizedtesting.RandomizedRunner$7.evaluate(RandomizedRunner.java:773)
	at com.carrotsearch.randomizedtesting.RandomizedRunner$8.evaluate(RandomizedRunner.java:787)
	at com.carrotsearch.randomizedtesting.rules.SystemPropertiesRestoreRule$1.evaluate(SystemPropertiesRestoreRule.java:53)
	at org.apache.lucene.util.TestRuleSetupTeardownChained$1.evaluate(TestRuleSetupTeardownChained.java:50)
	at org.apache.lucene.util.TestRuleFieldCacheSanity$1.evaluate(TestRuleFieldCacheSanity.java:51)
	at org.apache.lucene.util.AbstractBeforeAfterRule$1.evaluate(AbstractBeforeAfterRule.java:46)
	at com.carrotsearch.randomizedtesting.rules.SystemPropertiesInvariantRule$1.evaluate(SystemPropertiesInvariantRule.java:55)
	at org.apache.lucene.util.TestRuleThreadAndTestName$1.evaluate(TestRuleThreadAndTestName.java:49)
	at org.apache.lucene.util.TestRuleIgnoreAfterMaxFailures$1.evaluate(TestRuleIgnoreAfterMaxFailures.java:70)
	at org.apache.lucene.util.TestRuleMarkFailure$1.evaluate(TestRuleMarkFailure.java:48)
	at com.carrotsearch.randomizedtesting.rules.StatementAdapter.evaluate(StatementAdapter.java:36)
	at com.carrotsearch.randomizedtesting.ThreadLeakControl$StatementRunner.run(ThreadLeakControl.java:358)
	at com.carrotsearch.randomizedtesting.ThreadLeakControl.forkTimeoutingTask(ThreadLeakControl.java:782)
	at com.carrotsearch.randomizedtesting.ThreadLeakControl$3.evaluate(ThreadLeakControl.java:442)
	at com.carrotsearch.randomizedtesting.RandomizedRunner.runSingleTest(RandomizedRunner.java:746)
	at com.carrotsearch.randomizedtesting.RandomizedRunner$3.evaluate(RandomizedRunner.java:648)
	at com.carrotsearch.randomizedtesting.RandomizedRunner$4.evaluate(RandomizedRunner.java:682)
	at com.carrotsearch.randomizedtesting.RandomizedRunner$5.evaluate(RandomizedRunner.java:693)
	at com.carrotsearch.randomizedtesting.rules.StatementAdapter.evaluate(StatementAdapter.java:36)
	at com.carrotsearch.randomizedtesting.rules.SystemPropertiesRestoreRule$1.evaluate(SystemPropertiesRestoreRule.java:53)
	at org.apache.lucene.util.AbstractBeforeAfterRule$1.evaluate(AbstractBeforeAfterRule.java:46)
	at org.apache.lucene.util.TestRuleStoreClassName$1.evaluate(TestRuleStoreClassName.java:42)
	at com.carrotsearch.randomizedtesting.rules.SystemPropertiesInvariantRule$1.evaluate(SystemPropertiesInvariantRule.java:55)
	at com.carrotsearch.randomizedtesting.rules.NoShadowingOrOverridesOnMethodsRule$1.evaluate(NoShadowingOrOverridesOnMethodsRule.java:39)
	at com.carrotsearch.randomizedtesting.rules.NoShadowingOrOverridesOnMethodsRule$1.evaluate(NoShadowingOrOverridesOnMethodsRule.java:39)
	at com.carrotsearch.randomizedtesting.rules.StatementAdapter.evaluate(StatementAdapter.java:36)
	at org.apache.lucene.util.TestRuleAssertionsRequired$1.evaluate(TestRuleAssertionsRequired.java:43)
	at org.apache.lucene.util.TestRuleMarkFailure$1.evaluate(TestRuleMarkFailure.java:48)
	at org.apache.lucene.util.TestRuleIgnoreAfterMaxFailures$1.evaluate(TestRuleIgnoreAfterMaxFailures.java:70)
	at org.apache.lucene.util.TestRuleIgnoreTestSuites$1.evaluate(TestRuleIgnoreTestSuites.java:55)
	at com.carrotsearch.randomizedtesting.rules.StatementAdapter.evaluate(StatementAdapter.java:36)
	at com.carrotsearch.randomizedtesting.ThreadLeakControl$StatementRunner.run(ThreadLeakControl.java:358)
	at java.lang.Thread.run(Thread.java:780)


REGRESSION:  org.apache.solr.handler.component.DistributedQueryElevationComponentTest.testDistribSearch

Error Message:
.responseHeader.params.version!=sort (unordered or missing)

Stack Trace:
junit.framework.AssertionFailedError: .responseHeader.params.version!=sort (unordered or missing)
	at __randomizedtesting.SeedInfo.seed([ABD3CEB039C3F2D9:2A3540A84E9C92E5]:0)
	at junit.framework.Assert.fail(Assert.java:50)
	at org.apache.solr.BaseDistributedSearchTestCase.compareSolrResponses(BaseDistributedSearchTestCase.java:822)
	at org.apache.solr.BaseDistributedSearchTestCase.compareResponses(BaseDistributedSearchTestCase.java:841)
	at org.apache.solr.BaseDistributedSearchTestCase.query(BaseDistributedSearchTestCase.java:544)
	at org.apache.solr.BaseDistributedSearchTestCase.query(BaseDistributedSearchTestCase.java:521)
	at org.apache.solr.handler.component.DistributedQueryElevationComponentTest.doTest(DistributedQueryElevationComponentTest.java:81)
	at org.apache.solr.BaseDistributedSearchTestCase.testDistribSearch(BaseDistributedSearchTestCase.java:849)
	at sun.reflect.NativeMethodAccessorImpl.invoke0(Native Method)
	at sun.reflect.NativeMethodAccessorImpl.invoke(NativeMethodAccessorImpl.java:88)
	at sun.reflect.DelegatingMethodAccessorImpl.invoke(DelegatingMethodAccessorImpl.java:55)
	at java.lang.reflect.Method.invoke(Method.java:613)
	at com.carrotsearch.randomizedtesting.RandomizedRunner.invoke(RandomizedRunner.java:1559)
	at com.carrotsearch.randomizedtesting.RandomizedRunner.access$600(RandomizedRunner.java:79)
	at com.carrotsearch.randomizedtesting.RandomizedRunner$6.evaluate(RandomizedRunner.java:737)
	at com.carrotsearch.randomizedtesting.RandomizedRunner$7.evaluate(RandomizedRunner.java:773)
	at com.carrotsearch.randomizedtesting.RandomizedRunner$8.evaluate(RandomizedRunner.java:787)
	at com.carrotsearch.randomizedtesting.rules.SystemPropertiesRestoreRule$1.evaluate(SystemPropertiesRestoreRule.java:53)
	at org.apache.lucene.util.TestRuleSetupTeardownChained$1.evaluate(TestRuleSetupTeardownChained.java:50)
	at org.apache.lucene.util.TestRuleFieldCacheSanity$1.evaluate(TestRuleFieldCacheSanity.java:51)
	at org.apache.lucene.util.AbstractBeforeAfterRule$1.evaluate(AbstractBeforeAfterRule.java:46)
	at com.carrotsearch.randomizedtesting.rules.SystemPropertiesInvariantRule$1.evaluate(SystemPropertiesInvariantRule.java:55)
	at org.apache.lucene.util.TestRuleThreadAndTestName$1.evaluate(TestRuleThreadAndTestName.java:49)
	at org.apache.lucene.util.TestRuleIgnoreAfterMaxFailures$1.evaluate(TestRuleIgnoreAfterMaxFailures.java:70)
	at org.apache.lucene.util.TestRuleMarkFailure$1.evaluate(TestRuleMarkFailure.java:48)
	at com.carrotsearch.randomizedtesting.rules.StatementAdapter.evaluate(StatementAdapter.java:36)
	at com.carrotsearch.randomizedtesting.ThreadLeakControl$StatementRunner.run(ThreadLeakControl.java:358)
	at com.carrotsearch.randomizedtesting.ThreadLeakControl.forkTimeoutingTask(ThreadLeakControl.java:782)
	at com.carrotsearch.randomizedtesting.ThreadLeakControl$3.evaluate(ThreadLeakControl.java:442)
	at com.carrotsearch.randomizedtesting.RandomizedRunner.runSingleTest(RandomizedRunner.java:746)
	at com.carrotsearch.randomizedtesting.RandomizedRunner$3.evaluate(RandomizedRunner.java:648)
	at com.carrotsearch.randomizedtesting.RandomizedRunner$4.evaluate(RandomizedRunner.java:682)
	at com.carrotsearch.randomizedtesting.RandomizedRunner$5.evaluate(RandomizedRunner.java:693)
	at com.carrotsearch.randomizedtesting.rules.StatementAdapter.evaluate(StatementAdapter.java:36)
	at com.carrotsearch.randomizedtesting.rules.SystemPropertiesRestoreRule$1.evaluate(SystemPropertiesRestoreRule.java:53)
	at org.apache.lucene.util.AbstractBeforeAfterRule$1.evaluate(AbstractBeforeAfterRule.java:46)
	at org.apache.lucene.util.TestRuleStoreClassName$1.evaluate(TestRuleStoreClassName.java:42)
	at com.carrotsearch.randomizedtesting.rules.SystemPropertiesInvariantRule$1.evaluate(SystemPropertiesInvariantRule.java:55)
	at com.carrotsearch.randomizedtesting.rules.NoShadowingOrOverridesOnMethodsRule$1.evaluate(NoShadowingOrOverridesOnMethodsRule.java:39)
	at com.carrotsearch.randomizedtesting.rules.NoShadowingOrOverridesOnMethodsRule$1.evaluate(NoShadowingOrOverridesOnMethodsRule.java:39)
	at com.carrotsearch.randomizedtesting.rules.StatementAdapter.evaluate(StatementAdapter.java:36)
	at org.apache.lucene.util.TestRuleAssertionsRequired$1.evaluate(TestRuleAssertionsRequired.java:43)
	at org.apache.lucene.util.TestRuleMarkFailure$1.evaluate(TestRuleMarkFailure.java:48)
	at org.apache.lucene.util.TestRuleIgnoreAfterMaxFailures$1.evaluate(TestRuleIgnoreAfterMaxFailures.java:70)
	at org.apache.lucene.util.TestRuleIgnoreTestSuites$1.evaluate(TestRuleIgnoreTestSuites.java:55)
	at com.carrotsearch.randomizedtesting.rules.StatementAdapter.evaluate(StatementAdapter.java:36)
	at com.carrotsearch.randomizedtesting.ThreadLeakControl$StatementRunner.run(ThreadLeakControl.java:358)
	at java.lang.Thread.run(Thread.java:780)


REGRESSION:  org.apache.solr.handler.component.TermVectorComponentDistributedTest.testDistribSearch

Error Message:
.termVectors.0.test_offtv!=test_basictv (unordered or missing)

Stack Trace:
junit.framework.AssertionFailedError: .termVectors.0.test_offtv!=test_basictv (unordered or missing)
	at __randomizedtesting.SeedInfo.seed([ABD3CEB039C3F2D9:2A3540A84E9C92E5]:0)
	at junit.framework.Assert.fail(Assert.java:50)
	at org.apache.solr.BaseDistributedSearchTestCase.compareSolrResponses(BaseDistributedSearchTestCase.java:822)
	at org.apache.solr.BaseDistributedSearchTestCase.compareResponses(BaseDistributedSearchTestCase.java:841)
	at org.apache.solr.BaseDistributedSearchTestCase.query(BaseDistributedSearchTestCase.java:544)
	at org.apache.solr.BaseDistributedSearchTestCase.query(BaseDistributedSearchTestCase.java:521)
	at org.apache.solr.handler.component.TermVectorComponentDistributedTest.doTest(TermVectorComponentDistributedTest.java:127)
	at org.apache.solr.BaseDistributedSearchTestCase.testDistribSearch(BaseDistributedSearchTestCase.java:855)
	at sun.reflect.NativeMethodAccessorImpl.invoke0(Native Method)
	at sun.reflect.NativeMethodAccessorImpl.invoke(NativeMethodAccessorImpl.java:88)
	at sun.reflect.DelegatingMethodAccessorImpl.invoke(DelegatingMethodAccessorImpl.java:55)
	at java.lang.reflect.Method.invoke(Method.java:613)
	at com.carrotsearch.randomizedtesting.RandomizedRunner.invoke(RandomizedRunner.java:1559)
	at com.carrotsearch.randomizedtesting.RandomizedRunner.access$600(RandomizedRunner.java:79)
	at com.carrotsearch.randomizedtesting.RandomizedRunner$6.evaluate(RandomizedRunner.java:737)
	at com.carrotsearch.randomizedtesting.RandomizedRunner$7.evaluate(RandomizedRunner.java:773)
	at com.carrotsearch.randomizedtesting.RandomizedRunner$8.evaluate(RandomizedRunner.java:787)
	at com.carrotsearch.randomizedtesting.rules.SystemPropertiesRestoreRule$1.evaluate(SystemPropertiesRestoreRule.java:53)
	at org.apache.lucene.util.TestRuleSetupTeardownChained$1.evaluate(TestRuleSetupTeardownChained.java:50)
	at org.apache.lucene.util.TestRuleFieldCacheSanity$1.evaluate(TestRuleFieldCacheSanity.java:51)
	at org.apache.lucene.util.AbstractBeforeAfterRule$1.evaluate(AbstractBeforeAfterRule.java:46)
	at com.carrotsearch.randomizedtesting.rules.SystemPropertiesInvariantRule$1.evaluate(SystemPropertiesInvariantRule.java:55)
	at org.apache.lucene.util.TestRuleThreadAndTestName$1.evaluate(TestRuleThreadAndTestName.java:49)
	at org.apache.lucene.util.TestRuleIgnoreAfterMaxFailures$1.evaluate(TestRuleIgnoreAfterMaxFailures.java:70)
	at org.apache.lucene.util.TestRuleMarkFailure$1.evaluate(TestRuleMarkFailure.java:48)
	at com.carrotsearch.randomizedtesting.rules.StatementAdapter.evaluate(StatementAdapter.java:36)
	at com.carrotsearch.randomizedtesting.ThreadLeakControl$StatementRunner.run(ThreadLeakControl.java:358)
	at com.carrotsearch.randomizedtesting.ThreadLeakControl.forkTimeoutingTask(ThreadLeakControl.java:782)
	at com.carrotsearch.randomizedtesting.ThreadLeakControl$3.evaluate(ThreadLeakControl.java:442)
	at com.carrotsearch.randomizedtesting.RandomizedRunner.runSingleTest(RandomizedRunner.java:746)
	at com.carrotsearch.randomizedtesting.RandomizedRunner$3.evaluate(RandomizedRunner.java:648)
	at com.carrotsearch.randomizedtesting.RandomizedRunner$4.evaluate(RandomizedRunner.java:682)
	at com.carrotsearch.randomizedtesting.RandomizedRunner$5.evaluate(RandomizedRunner.java:693)
	at com.carrotsearch.randomizedtesting.rules.StatementAdapter.evaluate(StatementAdapter.java:36)
	at com.carrotsearch.randomizedtesting.rules.SystemPropertiesRestoreRule$1.evaluate(SystemPropertiesRestoreRule.java:53)
	at org.apache.lucene.util.AbstractBeforeAfterRule$1.evaluate(AbstractBeforeAfterRule.java:46)
	at org.apache.lucene.util.TestRuleStoreClassName$1.evaluate(TestRuleStoreClassName.java:42)
	at com.carrotsearch.randomizedtesting.rules.SystemPropertiesInvariantRule$1.evaluate(SystemPropertiesInvariantRule.java:55)
	at com.carrotsearch.randomizedtesting.rules.NoShadowingOrOverridesOnMethodsRule$1.evaluate(NoShadowingOrOverridesOnMethodsRule.java:39)
	at com.carrotsearch.randomizedtesting.rules.NoShadowingOrOverridesOnMethodsRule$1.evaluate(NoShadowingOrOverridesOnMethodsRule.java:39)
	at com.carrotsearch.randomizedtesting.rules.StatementAdapter.evaluate(StatementAdapter.java:36)
	at org.apache.lucene.util.TestRuleAssertionsRequired$1.evaluate(TestRuleAssertionsRequired.java:43)
	at org.apache.lucene.util.TestRuleMarkFailure$1.evaluate(TestRuleMarkFailure.java:48)
	at org.apache.lucene.util.TestRuleIgnoreAfterMaxFailures$1.evaluate(TestRuleIgnoreAfterMaxFailures.java:70)
	at org.apache.lucene.util.TestRuleIgnoreTestSuites$1.evaluate(TestRuleIgnoreTestSuites.java:55)
	at com.carrotsearch.randomizedtesting.rules.StatementAdapter.evaluate(StatementAdapter.java:36)
	at com.carrotsearch.randomizedtesting.ThreadLeakControl$StatementRunner.run(ThreadLeakControl.java:358)
	at java.lang.Thread.run(Thread.java:780)


REGRESSION:  org.apache.solr.update.AutoCommitTest.testMaxTime

Error Message:
Exception during query

Stack Trace:
java.lang.RuntimeException: Exception during query
	at __randomizedtesting.SeedInfo.seed([ABD3CEB039C3F2D9:3127B352A7596EE5]:0)
	at org.apache.solr.SolrTestCaseJ4.assertQ(SolrTestCaseJ4.java:644)
	at org.apache.solr.update.AutoCommitTest.testMaxTime(AutoCommitTest.java:227)
	at sun.reflect.NativeMethodAccessorImpl.invoke0(Native Method)
	at sun.reflect.NativeMethodAccessorImpl.invoke(NativeMethodAccessorImpl.java:88)
	at sun.reflect.DelegatingMethodAccessorImpl.invoke(DelegatingMethodAccessorImpl.java:55)
	at java.lang.reflect.Method.invoke(Method.java:613)
	at com.carrotsearch.randomizedtesting.RandomizedRunner.invoke(RandomizedRunner.java:1559)
	at com.carrotsearch.randomizedtesting.RandomizedRunner.access$600(RandomizedRunner.java:79)
	at com.carrotsearch.randomizedtesting.RandomizedRunner$6.evaluate(RandomizedRunner.java:737)
	at com.carrotsearch.randomizedtesting.RandomizedRunner$7.evaluate(RandomizedRunner.java:773)
	at com.carrotsearch.randomizedtesting.RandomizedRunner$8.evaluate(RandomizedRunner.java:787)
	at com.carrotsearch.randomizedtesting.rules.SystemPropertiesRestoreRule$1.evaluate(SystemPropertiesRestoreRule.java:53)
	at org.apache.lucene.util.TestRuleSetupTeardownChained$1.evaluate(TestRuleSetupTeardownChained.java:50)
	at org.apache.lucene.util.TestRuleFieldCacheSanity$1.evaluate(TestRuleFieldCacheSanity.java:51)
	at org.apache.lucene.util.AbstractBeforeAfterRule$1.evaluate(AbstractBeforeAfterRule.java:46)
	at com.carrotsearch.randomizedtesting.rules.SystemPropertiesInvariantRule$1.evaluate(SystemPropertiesInvariantRule.java:55)
	at org.apache.lucene.util.TestRuleThreadAndTestName$1.evaluate(TestRuleThreadAndTestName.java:49)
	at org.apache.lucene.util.TestRuleIgnoreAfterMaxFailures$1.evaluate(TestRuleIgnoreAfterMaxFailures.java:70)
	at org.apache.lucene.util.TestRuleMarkFailure$1.evaluate(TestRuleMarkFailure.java:48)
	at com.carrotsearch.randomizedtesting.rules.StatementAdapter.evaluate(StatementAdapter.java:36)
	at com.carrotsearch.randomizedtesting.ThreadLeakControl$StatementRunner.run(ThreadLeakControl.java:358)
	at com.carrotsearch.randomizedtesting.ThreadLeakControl.forkTimeoutingTask(ThreadLeakControl.java:782)
	at com.carrotsearch.randomizedtesting.ThreadLeakControl$3.evaluate(ThreadLeakControl.java:442)
	at com.carrotsearch.randomizedtesting.RandomizedRunner.runSingleTest(RandomizedRunner.java:746)
	at com.carrotsearch.randomizedtesting.RandomizedRunner$3.evaluate(RandomizedRunner.java:648)
	at com.carrotsearch.randomizedtesting.RandomizedRunner$4.evaluate(RandomizedRunner.java:682)
	at com.carrotsearch.randomizedtesting.RandomizedRunner$5.evaluate(RandomizedRunner.java:693)
	at com.carrotsearch.randomizedtesting.rules.StatementAdapter.evaluate(StatementAdapter.java:36)
	at com.carrotsearch.randomizedtesting.rules.SystemPropertiesRestoreRule$1.evaluate(SystemPropertiesRestoreRule.java:53)
	at org.apache.lucene.util.AbstractBeforeAfterRule$1.evaluate(AbstractBeforeAfterRule.java:46)
	at org.apache.lucene.util.TestRuleStoreClassName$1.evaluate(TestRuleStoreClassName.java:42)
	at com.carrotsearch.randomizedtesting.rules.SystemPropertiesInvariantRule$1.evaluate(SystemPropertiesInvariantRule.java:55)
	at com.carrotsearch.randomizedtesting.rules.NoShadowingOrOverridesOnMethodsRule$1.evaluate(NoShadowingOrOverridesOnMethodsRule.java:39)
	at com.carrotsearch.randomizedtesting.rules.NoShadowingOrOverridesOnMethodsRule$1.evaluate(NoShadowingOrOverridesOnMethodsRule.java:39)
	at com.carrotsearch.randomizedtesting.rules.StatementAdapter.evaluate(StatementAdapter.java:36)
	at org.apache.lucene.util.TestRuleAssertionsRequired$1.evaluate(TestRuleAssertionsRequired.java:43)
	at org.apache.lucene.util.TestRuleMarkFailure$1.evaluate(TestRuleMarkFailure.java:48)
	at org.apache.lucene.util.TestRuleIgnoreAfterMaxFailures$1.evaluate(TestRuleIgnoreAfterMaxFailures.java:70)
	at org.apache.lucene.util.TestRuleIgnoreTestSuites$1.evaluate(TestRuleIgnoreTestSuites.java:55)
	at com.carrotsearch.randomizedtesting.rules.StatementAdapter.evaluate(StatementAdapter.java:36)
	at com.carrotsearch.randomizedtesting.ThreadLeakControl$StatementRunner.run(ThreadLeakControl.java:358)
	at java.lang.Thread.run(Thread.java:780)
Caused by: java.lang.RuntimeException: REQUEST FAILED: xpath=//result[@numFound=0]
	xml response was: <?xml version="1.0" encoding="UTF-8"?>
<response>
<lst name="responseHeader"><int name="status">0</int><int name="QTime">1724</int></lst><result name="response" numFound="1" start="0"><doc><int name="id">529</int><int name="range_facet_si">529</int><arr name="range_facet_l"><long>529</long></arr><arr name="range_facet_sl"><long>529</long></arr><arr name="field_t"><str>what's inside?</str></arr><arr name="subject"><str>info</str></arr><long name="_version_">1455783977115713536</long><int name="intDefault">42</int><date name="timestamp">2013-12-29T19:03:09.211Z</date><arr name="multiDefault"><str>muLti-Default</str></arr></doc></result>
</response>

	request was:qt=standard&rows=20&version=2.2&start=0&q=id:529
	at org.apache.solr.SolrTestCaseJ4.assertQ(SolrTestCaseJ4.java:637)
	... 41 more


REGRESSION:  org.apache.solr.update.processor.SignatureUpdateProcessorFactoryTest.testDupeDetection

Error Message:
expected:<1> but was:<2>

Stack Trace:
java.lang.AssertionError: expected:<1> but was:<2>
	at __randomizedtesting.SeedInfo.seed([ABD3CEB039C3F2D9:F0E335783A8451A5]:0)
	at org.junit.Assert.fail(Assert.java:93)
	at org.junit.Assert.failNotEquals(Assert.java:647)
	at org.junit.Assert.assertEquals(Assert.java:128)
	at org.junit.Assert.assertEquals(Assert.java:472)
	at org.junit.Assert.assertEquals(Assert.java:456)
	at org.apache.solr.update.processor.SignatureUpdateProcessorFactoryTest.checkNumDocs(SignatureUpdateProcessorFactoryTest.java:71)
	at org.apache.solr.update.processor.SignatureUpdateProcessorFactoryTest.testDupeDetection(SignatureUpdateProcessorFactoryTest.java:119)
	at sun.reflect.NativeMethodAccessorImpl.invoke0(Native Method)
	at sun.reflect.NativeMethodAccessorImpl.invoke(NativeMethodAccessorImpl.java:88)
	at sun.reflect.DelegatingMethodAccessorImpl.invoke(DelegatingMethodAccessorImpl.java:55)
	at java.lang.reflect.Method.invoke(Method.java:613)
	at com.carrotsearch.randomizedtesting.RandomizedRunner.invoke(RandomizedRunner.java:1559)
	at com.carrotsearch.randomizedtesting.RandomizedRunner.access$600(RandomizedRunner.java:79)
	at com.carrotsearch.randomizedtesting.RandomizedRunner$6.evaluate(RandomizedRunner.java:737)
	at com.carrotsearch.randomizedtesting.RandomizedRunner$7.evaluate(RandomizedRunner.java:773)
	at com.carrotsearch.randomizedtesting.RandomizedRunner$8.evaluate(RandomizedRunner.java:787)
	at com.carrotsearch.randomizedtesting.rules.SystemPropertiesRestoreRule$1.evaluate(SystemPropertiesRestoreRule.java:53)
	at org.apache.lucene.util.TestRuleSetupTeardownChained$1.evaluate(TestRuleSetupTeardownChained.java:50)
	at org.apache.lucene.util.TestRuleFieldCacheSanity$1.evaluate(TestRuleFieldCacheSanity.java:51)
	at org.apache.lucene.util.AbstractBeforeAfterRule$1.evaluate(AbstractBeforeAfterRule.java:46)
	at com.carrotsearch.randomizedtesting.rules.SystemPropertiesInvariantRule$1.evaluate(SystemPropertiesInvariantRule.java:55)
	at org.apache.lucene.util.TestRuleThreadAndTestName$1.evaluate(TestRuleThreadAndTestName.java:49)
	at org.apache.lucene.util.TestRuleIgnoreAfterMaxFailures$1.evaluate(TestRuleIgnoreAfterMaxFailures.java:70)
	at org.apache.lucene.util.TestRuleMarkFailure$1.evaluate(TestRuleMarkFailure.java:48)
	at com.carrotsearch.randomizedtesting.rules.StatementAdapter.evaluate(StatementAdapter.java:36)
	at com.carrotsearch.randomizedtesting.ThreadLeakControl$StatementRunner.run(ThreadLeakControl.java:358)
	at com.carrotsearch.randomizedtesting.ThreadLeakControl.forkTimeoutingTask(ThreadLeakControl.java:782)
	at com.carrotsearch.randomizedtesting.ThreadLeakControl$3.evaluate(ThreadLeakControl.java:442)
	at com.carrotsearch.randomizedtesting.RandomizedRunner.runSingleTest(RandomizedRunner.java:746)
	at com.carrotsearch.randomizedtesting.RandomizedRunner$3.evaluate(RandomizedRunner.java:648)
	at com.carrotsearch.randomizedtesting.RandomizedRunner$4.evaluate(RandomizedRunner.java:682)
	at com.carrotsearch.randomizedtesting.RandomizedRunner$5.evaluate(RandomizedRunner.java:693)
	at com.carrotsearch.randomizedtesting.rules.StatementAdapter.evaluate(StatementAdapter.java:36)
	at com.carrotsearch.randomizedtesting.rules.SystemPropertiesRestoreRule$1.evaluate(SystemPropertiesRestoreRule.java:53)
	at org.apache.lucene.util.AbstractBeforeAfterRule$1.evaluate(AbstractBeforeAfterRule.java:46)
	at org.apache.lucene.util.TestRuleStoreClassName$1.evaluate(TestRuleStoreClassName.java:42)
	at com.carrotsearch.randomizedtesting.rules.SystemPropertiesInvariantRule$1.evaluate(SystemPropertiesInvariantRule.java:55)
	at com.carrotsearch.randomizedtesting.rules.NoShadowingOrOverridesOnMethodsRule$1.evaluate(NoShadowingOrOverridesOnMethodsRule.java:39)
	at com.carrotsearch.randomizedtesting.rules.NoShadowingOrOverridesOnMethodsRule$1.evaluate(NoShadowingOrOverridesOnMethodsRule.java:39)
	at com.carrotsearch.randomizedtesting.rules.StatementAdapter.evaluate(StatementAdapter.java:36)
	at org.apache.lucene.util.TestRuleAssertionsRequired$1.evaluate(TestRuleAssertionsRequired.java:43)
	at org.apache.lucene.util.TestRuleMarkFailure$1.evaluate(TestRuleMarkFailure.java:48)
	at org.apache.lucene.util.TestRuleIgnoreAfterMaxFailures$1.evaluate(TestRuleIgnoreAfterMaxFailures.java:70)
	at org.apache.lucene.util.TestRuleIgnoreTestSuites$1.evaluate(TestRuleIgnoreTestSuites.java:55)
	at com.carrotsearch.randomizedtesting.rules.StatementAdapter.evaluate(StatementAdapter.java:36)
	at com.carrotsearch.randomizedtesting.ThreadLeakControl$StatementRunner.run(ThreadLeakControl.java:358)
	at java.lang.Thread.run(Thread.java:780)


REGRESSION:  org.apache.solr.update.processor.SignatureUpdateProcessorFactoryTest.testMultiThreaded

Error Message:
expected:<1> but was:<2>

Stack Trace:
java.lang.AssertionError: expected:<1> but was:<2>
	at __randomizedtesting.SeedInfo.seed([ABD3CEB039C3F2D9:CA461450D112F82F]:0)
	at org.junit.Assert.fail(Assert.java:93)
	at org.junit.Assert.failNotEquals(Assert.java:647)
	at org.junit.Assert.assertEquals(Assert.java:128)
	at org.junit.Assert.assertEquals(Assert.java:472)
	at org.junit.Assert.assertEquals(Assert.java:456)
	at org.apache.solr.update.processor.SignatureUpdateProcessorFactoryTest.checkNumDocs(SignatureUpdateProcessorFactoryTest.java:71)
	at org.apache.solr.update.processor.SignatureUpdateProcessorFactoryTest.testMultiThreaded(SignatureUpdateProcessorFactoryTest.java:222)
	at sun.reflect.NativeMethodAccessorImpl.invoke0(Native Method)
	at sun.reflect.NativeMethodAccessorImpl.invoke(NativeMethodAccessorImpl.java:88)
	at sun.reflect.DelegatingMethodAccessorImpl.invoke(DelegatingMethodAccessorImpl.java:55)
	at java.lang.reflect.Method.invoke(Method.java:613)
	at com.carrotsearch.randomizedtesting.RandomizedRunner.invoke(RandomizedRunner.java:1559)
	at com.carrotsearch.randomizedtesting.RandomizedRunner.access$600(RandomizedRunner.java:79)
	at com.carrotsearch.randomizedtesting.RandomizedRunner$6.evaluate(RandomizedRunner.java:737)
	at com.carrotsearch.randomizedtesting.RandomizedRunner$7.evaluate(RandomizedRunner.java:773)
	at com.carrotsearch.randomizedtesting.RandomizedRunner$8.evaluate(RandomizedRunner.java:787)
	at com.carrotsearch.randomizedtesting.rules.SystemPropertiesRestoreRule$1.evaluate(SystemPropertiesRestoreRule.java:53)
	at org.apache.lucene.util.TestRuleSetupTeardownChained$1.evaluate(TestRuleSetupTeardownChained.java:50)
	at org.apache.lucene.util.TestRuleFieldCacheSanity$1.evaluate(TestRuleFieldCacheSanity.java:51)
	at org.apache.lucene.util.AbstractBeforeAfterRule$1.evaluate(AbstractBeforeAfterRule.java:46)
	at com.carrotsearch.randomizedtesting.rules.SystemPropertiesInvariantRule$1.evaluate(SystemPropertiesInvariantRule.java:55)
	at org.apache.lucene.util.TestRuleThreadAndTestName$1.evaluate(TestRuleThreadAndTestName.java:49)
	at org.apache.lucene.util.TestRuleIgnoreAfterMaxFailures$1.evaluate(TestRuleIgnoreAfterMaxFailures.java:70)
	at org.apache.lucene.util.TestRuleMarkFailure$1.evaluate(TestRuleMarkFailure.java:48)
	at com.carrotsearch.randomizedtesting.rules.StatementAdapter.evaluate(StatementAdapter.java:36)
	at com.carrotsearch.randomizedtesting.ThreadLeakControl$StatementRunner.run(ThreadLeakControl.java:358)
	at com.carrotsearch.randomizedtesting.ThreadLeakControl.forkTimeoutingTask(ThreadLeakControl.java:782)
	at com.carrotsearch.randomizedtesting.ThreadLeakControl$3.evaluate(ThreadLeakControl.java:442)
	at com.carrotsearch.randomizedtesting.RandomizedRunner.runSingleTest(RandomizedRunner.java:746)
	at com.carrotsearch.randomizedtesting.RandomizedRunner$3.evaluate(RandomizedRunner.java:648)
	at com.carrotsearch.randomizedtesting.RandomizedRunner$4.evaluate(RandomizedRunner.java:682)
	at com.carrotsearch.randomizedtesting.RandomizedRunner$5.evaluate(RandomizedRunner.java:693)
	at com.carrotsearch.randomizedtesting.rules.StatementAdapter.evaluate(StatementAdapter.java:36)
	at com.carrotsearch.randomizedtesting.rules.SystemPropertiesRestoreRule$1.evaluate(SystemPropertiesRestoreRule.java:53)
	at org.apache.lucene.util.AbstractBeforeAfterRule$1.evaluate(AbstractBeforeAfterRule.java:46)
	at org.apache.lucene.util.TestRuleStoreClassName$1.evaluate(TestRuleStoreClassName.java:42)
	at com.carrotsearch.randomizedtesting.rules.SystemPropertiesInvariantRule$1.evaluate(SystemPropertiesInvariantRule.java:55)
	at com.carrotsearch.randomizedtesting.rules.NoShadowingOrOverridesOnMethodsRule$1.evaluate(NoShadowingOrOverridesOnMethodsRule.java:39)
	at com.carrotsearch.randomizedtesting.rules.NoShadowingOrOverridesOnMethodsRule$1.evaluate(NoShadowingOrOverridesOnMethodsRule.java:39)
	at com.carrotsearch.randomizedtesting.rules.StatementAdapter.evaluate(StatementAdapter.java:36)
	at org.apache.lucene.util.TestRuleAssertionsRequired$1.evaluate(TestRuleAssertionsRequired.java:43)
	at org.apache.lucene.util.TestRuleMarkFailure$1.evaluate(TestRuleMarkFailure.java:48)
	at org.apache.lucene.util.TestRuleIgnoreAfterMaxFailures$1.evaluate(TestRuleIgnoreAfterMaxFailures.java:70)
	at org.apache.lucene.util.TestRuleIgnoreTestSuites$1.evaluate(TestRuleIgnoreTestSuites.java:55)
	at com.carrotsearch.randomizedtesting.rules.StatementAdapter.evaluate(StatementAdapter.java:36)
	at com.carrotsearch.randomizedtesting.ThreadLeakControl$StatementRunner.run(ThreadLeakControl.java:358)
	at java.lang.Thread.run(Thread.java:780)




Build Log:
[...truncated 10148 lines...]
   [junit4] Suite: org.apache.solr.handler.component.DistributedQueryElevationComponentTest
   [junit4]   2> 49511 T316 oas.BaseDistributedSearchTestCase.initHostContext Setting hostContext system property: /
   [junit4]   2> 49517 T316 oas.SolrTestCaseJ4.setUp ###Starting testDistribSearch
   [junit4]   2> 49519 T316 oejs.Server.doStart jetty-8.1.10.v20130312
   [junit4]   2> 49523 T316 oejs.AbstractConnector.doStart Started SelectChannelConnector@127.0.0.1:?????
   [junit4]   2> 49525 T316 oass.SolrDispatchFilter.init SolrDispatchFilter.init()
   [junit4]   2> 49526 T316 oasc.SolrResourceLoader.locateSolrHome JNDI not configured for solr (NoInitialContextEx)
   [junit4]   2> 49527 T316 oasc.SolrResourceLoader.locateSolrHome using system property solr.solr.home: /mnt/ssd/jenkins/workspace/Lucene-Solr-4.x-Linux/solr/build/solr-core/test-files/solr
   [junit4]   2> 49528 T316 oasc.SolrResourceLoader.<init> new SolrResourceLoader for directory: '/mnt/ssd/jenkins/workspace/Lucene-Solr-4.x-Linux/solr/build/solr-core/test-files/solr/'
   [junit4]   2> 49542 T316 oasc.ConfigSolr.fromFile Loading container configuration from /mnt/ssd/jenkins/workspace/Lucene-Solr-4.x-Linux/solr/build/solr-core/test-files/solr/solr.xml
   [junit4]   2> 49597 T316 oasc.CoreContainer.<init> New CoreContainer 271840178
   [junit4]   2> 49598 T316 oasc.CoreContainer.load Loading cores into CoreContainer [instanceDir=/mnt/ssd/jenkins/workspace/Lucene-Solr-4.x-Linux/solr/build/solr-core/test-files/solr/]
   [junit4]   2> 49599 T316 oashc.HttpShardHandlerFactory.getParameter Setting socketTimeout to: 90000
   [junit4]   2> 49600 T316 oashc.HttpShardHandlerFactory.getParameter Setting urlScheme to: http://
   [junit4]   2> 49600 T316 oashc.HttpShardHandlerFactory.getParameter Setting connTimeout to: 15000
   [junit4]   2> 49601 T316 oashc.HttpShardHandlerFactory.getParameter Setting maxConnectionsPerHost to: 20
   [junit4]   2> 49602 T316 oashc.HttpShardHandlerFactory.getParameter Setting corePoolSize to: 0
   [junit4]   2> 49602 T316 oashc.HttpShardHandlerFactory.getParameter Setting maximumPoolSize to: 2147483647
   [junit4]   2> 49603 T316 oashc.HttpShardHandlerFactory.getParameter Setting maxThreadIdleTime to: 5
   [junit4]   2> 49603 T316 oashc.HttpShardHandlerFactory.getParameter Setting sizeOfQueue to: -1
   [junit4]   2> 49604 T316 oashc.HttpShardHandlerFactory.getParameter Setting fairnessPolicy to: false
   [junit4]   2> 49612 T316 oasl.LogWatcher.createWatcher SLF4J impl is org.slf4j.impl.Log4jLoggerFactory
   [junit4]   2> 49612 T316 oasl.LogWatcher.newRegisteredLogWatcher Registering Log Listener [Log4j (org.slf4j.impl.Log4jLoggerFactory)]
   [junit4]   2> 49613 T316 oasc.CoreContainer.load Host Name: 127.0.0.1
   [junit4]   2> 49617 T326 oasc.CoreContainer.create Creating SolrCore 'collection1' using instanceDir: /mnt/ssd/jenkins/workspace/Lucene-Solr-4.x-Linux/solr/build/solr-core/test-files/solr/collection1
   [junit4]   2> 49618 T326 oasc.SolrResourceLoader.<init> new SolrResourceLoader for directory: '/mnt/ssd/jenkins/workspace/Lucene-Solr-4.x-Linux/solr/build/solr-core/test-files/solr/collection1/'
   [junit4]   2> 49618 T326 oasc.SolrResourceLoader.replaceClassLoader Adding 'file:/mnt/ssd/jenkins/workspace/Lucene-Solr-4.x-Linux/solr/build/solr-core/test-files/solr/collection1/lib/classes/' to classloader
   [junit4]   2> 49619 T326 oasc.SolrResourceLoader.replaceClassLoader Adding 'file:/mnt/ssd/jenkins/workspace/Lucene-Solr-4.x-Linux/solr/build/solr-core/test-files/solr/collection1/lib/README' to classloader
   [junit4]   2> 49652 T326 oasc.SolrConfig.<init> Using Lucene MatchVersion: LUCENE_47
   [junit4]   2> 49694 T326 oasc.SolrConfig.<init> Loaded SolrConfig: solrconfig-elevate.xml
   [junit4]   2> 49695 T326 oass.IndexSchema.readSchema Reading Solr Schema from schema11.xml
   [junit4]   2> 49705 T326 oass.IndexSchema.readSchema [collection1] Schema name=example
   [junit4]   2> 49937 T326 oass.IndexSchema.readSchema default search field in schema is text
   [junit4]   2> 49940 T326 oass.IndexSchema.readSchema unique key field: id
   [junit4]   2> 49950 T326 oasc.SolrCore.initDirectoryFactory org.apache.solr.core.MockDirectoryFactory
   [junit4]   2> 49951 T326 oasc.SolrCore.<init> [collection1] Opening new SolrCore at /mnt/ssd/jenkins/workspace/Lucene-Solr-4.x-Linux/solr/build/solr-core/test-files/solr/collection1/, dataDir=./org.apache.solr.handler.component.DistributedQueryElevationComponentTest-1388343311546/control/data/
   [junit4]   2> 49952 T326 oasc.JmxMonitoredMap.<init> JMX monitoring is enabled. Adding Solr mbeans to JMX Server: com.sun.jmx.mbeanserver.JmxMBeanServer@88d4e57f
   [junit4]   2> 49953 T326 oasc.CachingDirectoryFactory.get return new directory for ./org.apache.solr.handler.component.DistributedQueryElevationComponentTest-1388343311546/control/data
   [junit4]   2> 49954 T326 oasc.SolrCore.getNewIndexDir New index directory detected: old=null new=./org.apache.solr.handler.component.DistributedQueryElevationComponentTest-1388343311546/control/data/index/
   [junit4]   2> 49954 T326 oasc.SolrCore.initIndex WARN [collection1] Solr index directory './org.apache.solr.handler.component.DistributedQueryElevationComponentTest-1388343311546/control/data/index' doesn't exist. Creating new index...
   [junit4]   2> 49955 T326 oasc.CachingDirectoryFactory.get return new directory for ./org.apache.solr.handler.component.DistributedQueryElevationComponentTest-1388343311546/control/data/index
   [junit4]   2> 49956 T326 oasu.RandomMergePolicy.<init> RandomMergePolicy wrapping class org.apache.lucene.index.TieredMergePolicy: [TieredMergePolicy: maxMergeAtOnce=37, maxMergeAtOnceExplicit=11, maxMergedSegmentMB=51.470703125, floorSegmentMB=1.6025390625, forceMergeDeletesPctAllowed=14.80106111350754, segmentsPerTier=38.0, maxCFSSegmentSizeMB=8.796093022207999E12, noCFSRatio=0.5895303463940323
   [junit4]   2> 49957 T326 oasc.SolrDeletionPolicy.onCommit SolrDeletionPolicy.onCommit: commits: num=1
   [junit4]   2> 		commit{dir=MockDirectoryWrapper(org.apache.lucene.store.RAMDirectory@5ea5ec1a lockFactory=org.apache.lucene.store.SingleInstanceLockFactory@ce838c22),segFN=segments_1,generation=1}
   [junit4]   2> 49958 T326 oasc.SolrDeletionPolicy.updateCommits newest commit generation = 1
   [junit4]   2> 49967 T326 oasc.SolrCore.loadUpdateProcessorChains no updateRequestProcessorChain defined as default, creating implicit default
   [junit4]   2> 49968 T326 oasc.RequestHandlers.initHandlersFromConfig created /update: solr.UpdateRequestHandler
   [junit4]   2> 49969 T326 oasc.RequestHandlers.initHandlersFromConfig created /elevate: org.apache.solr.handler.component.SearchHandler
   [junit4]   2> 49970 T326 oasc.RequestHandlers.initHandlersFromConfig created /dataElevate: org.apache.solr.handler.component.SearchHandler
   [junit4]   2> 49972 T326 oashl.XMLLoader.init xsltCacheLifetimeSeconds=60
   [junit4]   2> 49973 T326 oasc.RequestHandlers.initHandlersFromConfig WARN no default request handler is registered (either '/select' or 'standard')
   [junit4]   2> 49975 T326 oasc.SolrCore.initDeprecatedSupport WARN solrconfig.xml uses deprecated <admin/gettableFiles>, Please update your config to use the ShowFileRequestHandler.
   [junit4]   2> 49987 T326 oasc.SolrCore.initDeprecatedSupport WARN adding ShowFileRequestHandler with hidden files: [SOLRCONFIG_CODEC.XML, SOLRCONFIG-DELPOLICY1.XML, BAD-SOLRCONFIG-MULTIPLE-DIRFACTORY.XML, SOLRCONFIG-SLAVE1.XML, SOLRCONFIG-UPDATE-PROCESSOR-CHAINS.XML, STOP-1.TXT, STOPWORDS.TXT, BAD-SCHEMA-MISPLACED-ASTERISK-COPYFIELD-DEST-SHOULD-FAIL-TEST.XML, XSLT, BAD-SCHEMA-EXTERNAL-FILEFIELD.XML, SOLRCONFIG-NOOPREGEN.XML, SOLRCONFIG-INFOSTREAM-LOGGING.XML, CONDITIONAL.UPDATEPROCESSOR.JS, SCHEMA-REST-LUCENE-MATCH-VERSION.XML, BAD-SCHEMA-DYNAMICFIELD-DEFAULT-VAL.XML, SOLRCONFIG-FUNCTIONQUERY.XML, SOLRCONFIG-MANAGED-SCHEMA.XML, SOLRCONFIG-PARSING-UPDATE-PROCESSOR-CHAINS.XML, STOPWITHBOM.TXT, SOLRCONFIG-ADD-SCHEMA-FIELDS-UPDATE-PROCESSOR-CHAINS.XML, CURRENCY.XML, SCHEMA-DFR.XML, SOLRCONFIG-TLOG.XML, BAD-SCHEMA-OMIT-TF-BUT-NOT-POS.XML, SOLRCONFIG-DELPOLICY2.XML, COMPOUNDDICTIONARY.TXT, FUZZYSUGGEST.TXT, STOP-2.TXT, SCHEMA-PHRASESUGGEST.XML, BAD-SCHEMA-BOGUS-FIELD-PARAMETERS.XML, SCHEMA-SIM.XML, SOLRCONFIG-SOLR-749.XML, SCHEMA-REPLICATION1.XML, BAD-SCHEMA-SIM-GLOBAL-VS-FT-MISMATCH.XML, SCHEMA-BM25.XML, SCHEMA-ID-AND-VERSION-FIELDS-ONLY.XML, SCHEMA-BINARYFIELD.XML, BAD-SCHEMA-NONTEXT-ANALYZER.XML, MISSLEADING.EXTENSION.UPDATEPROCESSOR.JS.TXT, ADDFIELDS.UPDATEPROCESSOR.JS, STOPTYPES-1.TXT, BAD-SCHEMA-CURRENCY-MULTIVALUED.XML, REGEX-BOOST-PROCESSOR-TEST.TXT, SCHEMA-REVERSED.XML, SOLRCONFIG-COLLAPSEQPARSER.XML, SCHEMA-DOCVALUESMULTI.XML, SCHEMA-TFIDF.XML, MISSING.FUNCTIONS.UPDATEPROCESSOR.JS, SOLRCONFIG-TEST-MISC.XML, SOLRCONFIG-SLAVE.XML, BAD-SOLRCONFIG-SCHEMA-MUTABLE-BUT-NOT-MANAGED.XML, BAD-SCHEMA-SWEETSPOT-PARTIAL-HYPERBOLIC.XML, SOLRCONFIG-LOGMERGEPOLICY.XML, SOLRCONFIG_PERF.XML, SOLRCONFIG-SUGGESTERCOMPONENT.XML, BAD-SCHEMA-CURRENCY-DYNAMIC-MULTIVALUED.XML, SOLRCONFIG-LAZYWRITER.XML, BAD-SCHEMA-NOT-INDEXED-BUT-TF.XML, SOLRCONFIG-MASTER3.XML, SCHEMA-XINCLUDE.XML, BAD-SOLRCONFIG-MANAGED-SCHEMA-NAMED-SCHEMA.XML.XML, SCHEMA-ONE-FIELD-NO-DYNAMIC-FIELD-UNIQUE-KEY.XML, SCHEMA_CODEC.XML, SOLRCONFIG-SNIPPET-PROCESSOR.XML, SCHEMA-POSTINGSHIGHLIGHT.XML, HUNSPELL-TEST.AFF, FRENCHARTICLES.TXT, SCHEMA-SYNONYM-TOKENIZER.XML, BAD-SCHEMA-DUP-FIELDTYPE.XML, SOLRCONFIG-SPELLCHECKCOMPONENT.XML, MAPPING-ISOLATIN1ACCENT.TXT, PROTWORDS.TXT, DA_COMPOUNDDICTIONARY.TXT, BAD-SCHEMA-UNIQUEKEY-IS-COPYFIELD-DEST.XML, ENUMSCONFIG.XML, SOLRCONFIG-REPEATER.XML, SOLRCONFIG-HIGHLIGHT.XML, SOLRCONFIG-MASTER1.XML, SOLRCONFIG-DEFAULTS.XML, SOLRCONFIG-WARMER.XML, SCHEMA-ADD-SCHEMA-FIELDS-UPDATE-PROCESSOR.XML, SOLRCONFIG-SPELLCHECKER.XML, DA_UTF8.XML, BAD-SCHEMA-UNIQUEKEY-MULTIVALUED.XML, SOLRCONFIG-NOCACHE.XML, BAD-SCHEMA-CURRENCY-FT-OER-NORATES.XML, SCHEMA-BEHAVIOR.XML, SCHEMA15.XML, SCHEMA-ENUMS.XML, SCHEMA-SIMPLEQPPLUGIN.XML, HUNSPELL-TEST.DIC, SOLRCONFIG-MASTER1-KEEPONEBACKUP.XML, SCHEMA-SNIPPET-TYPE.XML, SCHEMA-CLASS-NAME-SHORTENING-ON-SERIALIZATION.XML, BAD-SCHEMA-MISPLACED-ASTERISK-COPYFIELD-SOURCE-SHOULD-FAIL-TEST.XML, SOLRCONFIG-REQHANDLER.INCL, SCHEMA-SNIPPET-FIELD.XML, SCHEMA-COPYFIELD-TEST.XML, BAD-SCHEMA-BOGUS-ANALYSIS-PARAMETERS.XML, SCHEMA-NUMERIC.XML, SCHEMA-SWEETSPOT.XML, BAD-SOLRCONFIG-WARMER-NO-REOPEN.XML, HYPHENATION.DTD, BAD-SCHEMA-CODEC-GLOBAL-VS-FT-MISMATCH.XML, SCHEMA-STOP-KEEP.XML, SCHEMA-DOCVALUES.XML, STOP-SNOWBALL.TXT, SCHEMA11.XML, BAD-SOLRCONFIG-UNEXPECTED-SCHEMA-ATTRIBUTE.XML, BAD-SCHEMA-MULTIPLE-ASTERISK-COPYFIELD-SOURCE-SHOULD-FAIL-TEST.XML, SOLRCONFIG.SNIPPET.RANDOMINDEXCONFIG.XML, SOLRCONFIG-MERGEPOLICY-LEGACY.XML, SOLRCONFIG-INDEXCONFIG.XML, BAD-SOLRCONFIG-INVALID-SCRIPTFILE.XML, BAD-SCHEMA-DUP-DYNAMICFIELD.XML, STOPTYPES-2.TXT, TRIVIAL.UPDATEPROCESSOR1.JS, BAD-SCHEMA-CURRENCY-FT-MULTIVALUED.XML, WDFTYPES.TXT, STEMDICT.TXT, BAD-SCHEMA-DUP-FIELD.XML, SOLRCONFIG-MERGEPOLICY-DEFAULTS.XML, SCHEMA-DOCVALUESFACETING.XML, SCHEMA-DISTRIBUTED-MISSING-SORT.XML, BAD-SOLRCONFIG-MULTIPLE-CFS.XML, PHRASESUGGEST.TXT, BAD-MP-SOLRCONFIG.XML, SCHEMA-EFF.XML, SCHEMA-TINY.XML, BAD-SOLRCONFIG-BOGUS-SCRIPTENGINE-NAME.XML, SCHEMA-TRIE.XML, SCHEMA-SNIPPET-TYPES.INCL, SOLRCONFIG-ELEVATE.XML, BAD-SCHEMA-SWEETSPOT-PARTIAL-BASELINE.XML, SCHEMA-COLLATEFILTER.XML, SCHEMA-LUCENEMATCHVERSION.XML, SOLRCONFIG-CACHING.XML, ANALYZINGINFIXSUGGEST.TXT, BAD-SCHEMA-MULTIPLE-ASTERISK-COPYFIELD-DEST-SHOULD-FAIL-TEST.XML, SOLRCONFIG-POSTINGSHIGHLIGHT.XML, SOLRCONFIG-QUERYSENDER-NOQUERY.XML, THROW.ERROR.ON.ADD.UPDATEPROCESSOR.JS, SOLRCONFIG-BASIC.XML, SOLRCONFIG-SOLCOREPROPERTIES.XML, OPEN-EXCHANGE-RATES.JSON, SOLRCONFIG-COMPONENTS-NAME.XML, SOLRCONFIG-IMPLICITPROPERTIES.XML, SOLRCONFIG-ALTDIRECTORY.XML, ELEVATE.XML, SYNONYMS.TXT, SCHEMA-CHARFILTERS.XML, SCHEMA-REQUIRED-FIELDS.XML, SCHEMA-DOCVALUESMISSING.XML, SCHEMA-SPATIAL.XML, SOLRCONFIG-RESPONSE-LOG-COMPONENT.XML, SOLRCONFIG-BASIC-LUCENEVERSION31.XML, SCHEMA-CUSTOM-FIELD.XML, BAD-SCHEMA-SWEETSPOT-BOTH-TF.XML, BAD-SCHEMA-NOT-INDEXED-BUT-NORMS.XML, BAD-SCHEMA-ANALYZER-CLASS-AND-NESTED.XML, SOLRCONFIG-MINIMAL.XML, SOLRCONFIG-QUERYSENDER.XML, SOLRCONFIG-TIEREDMERGEPOLICY.XML, SOLRCONFIG-TERMINDEX.XML, BAD-SCHEMA-NOT-INDEXED-BUT-POS.XML, BAD-SCHEMA-CURRENCY-FT-BOGUS-CODE-IN-XML.XML, BAD-SOLRCONFIG-MULTIPLE-INDEXCONFIGS.XML, BAD_SOLRCONFIG.XML, SOLRCONFIG-SCRIPT-UPDATEPROCESSOR.XML, BAD-SCHEMA-UNIQUEKEY-USES-DEFAULT.XML, SOLRCONFIG-TRANSFORMERS.XML, BAD-SOLRCONFIG-MISSING-SCRIPTFILE.XML, SOLRCONFIG-XINCLUDE.XML, SOLRCONFIG-MASTER.XML, BAD-SCHEMA-NON-GLOB-COPYFIELD-SOURCE-MATCHING-NOTHING-SHOULD-FAIL-TEST.XML, SCHEMA-FOLDING.XML, KEEP-1.TXT, BAD-CURRENCY.XML, SCHEMA-NOT-REQUIRED-UNIQUE-KEY.XML, SCHEMA12.XML, JASUGGEST.TXT, TRIVIAL.UPDATEPROCESSOR0.JS, BAD-SCHEMA-CURRENCY-FT-BOGUS-DEFAULT-CODE.XML, SCHEMA-SPELLCHECKER.XML, SCHEMA-ONE-FIELD-NO-DYNAMIC-FIELD.XML, SCHEMA-MINIMAL.XML, SCHEMA-COLLATE-DV.XML, SCHEMA-IB.XML, SCHEMA-COLLATE.XML, SCHEMA-REST.XML, BAD-SCHEMA-SWEETSPOT-PARTIAL-NORMS.XML, STOPWORDSWRONGENCODING.TXT, SCHEMA-REPLICATION2.XML, BAD-SCHEMA-UNSUPPORTED-DOCVALUES.XML, SOLRCONFIG-MASTER2.XML, BAD-SCHEMA-DYNAMICFIELD-REQUIRED.XML, SOLRCONFIG-PHRASESUGGEST.XML, SCHEMA-LMDIRICHLET.XML, KEEP-2.TXT, SOLRCONFIG-EXTERNALVERSIONCONSTRAINT.XML, SCHEMASURROUND.XML, OLD_SYNONYMS.TXT, SCHEMA-LMJELINEKMERCER.XML]
   [junit4]   2> 49990 T326 oasu.CommitTracker.<init> Hard AutoCommit: disabled
   [junit4]   2> 49990 T326 oasu.CommitTracker.<init> Soft AutoCommit: disabled
   [junit4]   2> 49993 T326 oasu.RandomMergePolicy.<init> RandomMergePolicy wrapping class org.apache.lucene.index.TieredMergePolicy: [TieredMergePolicy: maxMergeAtOnce=14, maxMergeAtOnceExplicit=19, maxMergedSegmentMB=56.1865234375, floorSegmentMB=0.6455078125, forceMergeDeletesPctAllowed=7.732173800717246, segmentsPerTier=22.0, maxCFSSegmentSizeMB=8.796093022207999E12, noCFSRatio=0.6232846189598426
   [junit4]   2> 49995 T326 oasc.SolrDeletionPolicy.onInit SolrDeletionPolicy.onInit: commits: num=1
   [junit4]   2> 		commit{dir=MockDirectoryWrapper(org.apache.lucene.store.RAMDirectory@5ea5ec1a lockFactory=org.apache.lucene.store.SingleInstanceLockFactory@ce838c22),segFN=segments_1,generation=1}
   [junit4]   2> 49996 T326 oasc.SolrDeletionPolicy.updateCommits newest commit generation = 1
   [junit4]   2> 49996 T326 oass.SolrIndexSearcher.<init> Opening Searcher@187cd431 main
   [junit4]   2> 49999 T326 oashc.QueryElevationComponent.inform Loading QueryElevation from: /mnt/ssd/jenkins/workspace/Lucene-Solr-4.x-Linux/solr/build/solr-core/test-files/solr/collection1/conf/elevate.xml
   [junit4]   2> 50028 T326 oashc.QueryElevationComponent.inform Loading QueryElevation from: /mnt/ssd/jenkins/workspace/Lucene-Solr-4.x-Linux/solr/build/solr-core/test-files/solr/collection1/conf/elevate.xml
   [junit4]   2> 50046 T327 oasc.SolrCore.registerSearcher [collection1] Registered new searcher Searcher@187cd431 main{StandardDirectoryReader(segments_1:1:nrt)}
   [junit4]   2> 50050 T326 oasc.CoreContainer.registerCore registering core: collection1
   [junit4]   2> 50050 T316 oass.SolrDispatchFilter.init user.dir=/mnt/ssd/jenkins/workspace/Lucene-Solr-4.x-Linux/solr/build/solr-core/test/J0
   [junit4]   2> 50051 T316 oass.SolrDispatchFilter.init SolrDispatchFilter.init() done
   [junit4]   2> 50053 T316 oejs.Server.doStart jetty-8.1.10.v20130312
   [junit4]   2> 50056 T316 oejs.AbstractConnector.doStart Started SelectChannelConnector@127.0.0.1:?????
   [junit4]   2> 50057 T316 oass.SolrDispatchFilter.init SolrDispatchFilter.init()
   [junit4]   2> 50058 T316 oasc.SolrResourceLoader.locateSolrHome JNDI not configured for solr (NoInitialContextEx)
   [junit4]   2> 50058 T316 oasc.SolrResourceLoader.locateSolrHome using system property solr.solr.home: /mnt/ssd/jenkins/workspace/Lucene-Solr-4.x-Linux/solr/build/solr-core/test-files/solr
   [junit4]   2> 50059 T316 oasc.SolrResourceLoader.<init> new SolrResourceLoader for directory: '/mnt/ssd/jenkins/workspace/Lucene-Solr-4.x-Linux/solr/build/solr-core/test-files/solr/'
   [junit4]   2> 50071 T316 oasc.ConfigSolr.fromFile Loading container configuration from /mnt/ssd/jenkins/workspace/Lucene-Solr-4.x-Linux/solr/build/solr-core/test-files/solr/solr.xml
   [junit4]   2> 50110 T316 oasc.CoreContainer.<init> New CoreContainer 728654952
   [junit4]   2> 50111 T316 oasc.CoreContainer.load Loading cores into CoreContainer [instanceDir=/mnt/ssd/jenkins/workspace/Lucene-Solr-4.x-Linux/solr/build/solr-core/test-files/solr/]
   [junit4]   2> 50113 T316 oashc.HttpShardHandlerFactory.getParameter Setting socketTimeout to: 90000
   [junit4]   2> 50113 T316 oashc.HttpShardHandlerFactory.getParameter Setting urlScheme to: http://
   [junit4]   2> 50114 T316 oashc.HttpShardHandlerFactory.getParameter Setting connTimeout to: 15000
   [junit4]   2> 50115 T316 oashc.HttpShardHandlerFactory.getParameter Setting maxConnectionsPerHost to: 20
   [junit4]   2> 50115 T316 oashc.HttpShardHandlerFactory.getParameter Setting corePoolSize to: 0
   [junit4]   2> 50116 T316 oashc.HttpShardHandlerFactory.getParameter Setting maximumPoolSize to: 2147483647
   [junit4]   2> 50117 T316 oashc.HttpShardHandlerFactory.getParameter Setting maxThreadIdleTime to: 5
   [junit4]   2> 50117 T316 oashc.HttpShardHandlerFactory.getParameter Setting sizeOfQueue to: -1
   [junit4]   2> 50118 T316 oashc.HttpShardHandlerFactory.getParameter Setting fairnessPolicy to: false
   [junit4]   2> 50127 T316 oasl.LogWatcher.createWatcher SLF4J impl is org.slf4j.impl.Log4jLoggerFactory
   [junit4]   2> 50128 T316 oasl.LogWatcher.newRegisteredLogWatcher Registering Log Listener [Log4j (org.slf4j.impl.Log4jLoggerFactory)]
   [junit4]   2> 50130 T316 oasc.CoreContainer.load Host Name: 127.0.0.1
   [junit4]   2> 50141 T338 oasc.CoreContainer.create Creating SolrCore 'collection1' using instanceDir: /mnt/ssd/jenkins/workspace/Lucene-Solr-4.x-Linux/solr/build/solr-core/test-files/solr/collection1
   [junit4]   2> 50142 T338 oasc.SolrResourceLoader.<init> new SolrResourceLoader for directory: '/mnt/ssd/jenkins/workspace/Lucene-Solr-4.x-Linux/solr/build/solr-core/test-files/solr/collection1/'
   [junit4]   2> 50144 T338 oasc.SolrResourceLoader.replaceClassLoader Adding 'file:/mnt/ssd/jenkins/workspace/Lucene-Solr-4.x-Linux/solr/build/solr-core/test-files/solr/collection1/lib/classes/' to classloader
   [junit4]   2> 50150 T338 oasc.SolrResourceLoader.replaceClassLoader Adding 'file:/mnt/ssd/jenkins/workspace/Lucene-Solr-4.x-Linux/solr/build/solr-core/test-files/solr/collection1/lib/README' to classloader
   [junit4]   2> 50199 T338 oasc.SolrConfig.<init> Using Lucene MatchVersion: LUCENE_47
   [junit4]   2> 50256 T338 oasc.SolrConfig.<init> Loaded SolrConfig: solrconfig-elevate.xml
   [junit4]   2> 50257 T338 oass.IndexSchema.readSchema Reading Solr Schema from schema11.xml
   [junit4]   2> 50264 T338 oass.IndexSchema.readSchema [collection1] Schema name=example
   [junit4]   2> 50404 T338 oass.IndexSchema.readSchema default search field in schema is text
   [junit4]   2> 50406 T338 oass.IndexSchema.readSchema unique key field: id
   [junit4]   2> 50415 T338 oasc.SolrCore.initDirectoryFactory org.apache.solr.core.MockDirectoryFactory
   [junit4]   2> 50415 T338 oasc.SolrCore.<init> [collection1] Opening new SolrCore at /mnt/ssd/jenkins/workspace/Lucene-Solr-4.x-Linux/solr/build/solr-core/test-files/solr/collection1/, dataDir=./org.apache.solr.handler.component.DistributedQueryElevationComponentTest-1388343311546/shard0/data/
   [junit4]   2> 50415 T338 oasc.JmxMonitoredMap.<init> JMX monitoring is enabled. Adding Solr mbeans to JMX Server: com.sun.jmx.mbeanserver.JmxMBeanServer@88d4e57f
   [junit4]   2> 50417 T338 oasc.CachingDirectoryFactory.get return new directory for ./org.apache.solr.handler.component.DistributedQueryElevationComponentTest-1388343311546/shard0/data
   [junit4]   2> 50417 T338 oasc.SolrCore.getNewIndexDir New index directory detected: old=null new=./org.apache.solr.handler.component.DistributedQueryElevationComponentTest-1388343311546/shard0/data/index/
   [junit4]   2> 50417 T338 oasc.SolrCore.initIndex WARN [collection1] Solr index directory './org.apache.solr.handler.component.DistributedQueryElevationComponentTest-1388343311546/shard0/data/index' doesn't exist. Creating new index...
   [junit4]   2> 50418 T338 oasc.CachingDirectoryFactory.get return new directory for ./org.apache.solr.handler.component.DistributedQueryElevationComponentTest-1388343311546/shard0/data/index
   [junit4]   2> 50418 T338 oasu.RandomMergePolicy.<init> RandomMergePolicy wrapping class org.apache.lucene.index.TieredMergePolicy: [TieredMergePolicy: maxMergeAtOnce=37, maxMergeAtOnceExplicit=11, maxMergedSegmentMB=51.470703125, floorSegmentMB=1.6025390625, forceMergeDeletesPctAllowed=14.80106111350754, segmentsPerTier=38.0, maxCFSSegmentSizeMB=8.796093022207999E12, noCFSRatio=0.5895303463940323
   [junit4]   2> 50420 T338 oasc.SolrDeletionPolicy.onCommit SolrDeletionPolicy.onCommit: commits: num=1
   [junit4]   2> 		commit{dir=MockDirectoryWrapper(org.apache.lucene.store.RAMDirectory@5126928 lockFactory=org.apache.lucene.store.SingleInstanceLockFactory@25d495de),segFN=segments_1,generation=1}
   [junit4]   2> 50420 T338 oasc.SolrDeletionPolicy.updateCommits newest commit generation = 1
   [junit4]   2> 50426 T338 oasc.SolrCore.loadUpdateProcessorChains no updateRequestProcessorChain defined as default, creating implicit default
   [junit4]   2> 50427 T338 oasc.RequestHandlers.initHandlersFromConfig created /update: solr.UpdateRequestHandler
   [junit4]   2> 50428 T338 oasc.RequestHandlers.initHandlersFromConfig created /elevate: org.apache.solr.handler.component.SearchHandler
   [junit4]   2> 50428 T338 oasc.RequestHandlers.initHandlersFromConfig created /dataElevate: org.apache.solr.handler.component.SearchHandler
   [junit4]   2> 50430 T338 oashl.XMLLoader.init xsltCacheLifetimeSeconds=60
   [junit4]   2> 50430 T338 oasc.RequestHandlers.initHandlersFromConfig WARN no default request handler is registered (either '/select' or 'standard')
   [junit4]   2> 50432 T338 oasc.SolrCore.initDeprecatedSupport WARN solrconfig.xml uses deprecated <admin/gettableFiles>, Please update your config to use the ShowFileRequestHandler.
   [junit4]   2> 50434 T338 oasc.SolrCore.initDeprecatedSupport WARN adding ShowFileRequestHandler with hidden files: [SOLRCONFIG-HIGHLIGHT.XML, SOLRCONFIG-MASTER1.XML, SCHEMA-ADD-SCHEMA-FIELDS-UPDATE-PROCESSOR.XML, SOLRCONFIG-DEFAULTS.XML, SOLRCONFIG-WARMER.XML, ENUMSCONFIG.XML, SOLRCONFIG-REPEATER.XML, DA_COMPOUNDDICTIONARY.TXT, BAD-SCHEMA-UNIQUEKEY-IS-COPYFIELD-DEST.XML, DA_UTF8.XML, BAD-SCHEMA-UNIQUEKEY-MULTIVALUED.XML, SOLRCONFIG-NOCACHE.XML, SOLRCONFIG-SPELLCHECKER.XML, HUNSPELL-TEST.DIC, BAD-SCHEMA-CURRENCY-FT-OER-NORATES.XML, SCHEMA-BEHAVIOR.XML, SCHEMA15.XML, SCHEMA-ENUMS.XML, SCHEMA-SIMPLEQPPLUGIN.XML, BAD-SCHEMA-MISPLACED-ASTERISK-COPYFIELD-SOURCE-SHOULD-FAIL-TEST.XML, SOLRCONFIG-MASTER1-KEEPONEBACKUP.XML, SCHEMA-SNIPPET-TYPE.XML, SCHEMA-CLASS-NAME-SHORTENING-ON-SERIALIZATION.XML, SCHEMA-COPYFIELD-TEST.XML, BAD-SCHEMA-BOGUS-ANALYSIS-PARAMETERS.XML, SCHEMA-NUMERIC.XML, SCHEMA-SWEETSPOT.XML, SOLRCONFIG-REQHANDLER.INCL, SCHEMA-SNIPPET-FIELD.XML, BAD-SOLRCONFIG-WARMER-NO-REOPEN.XML, SCHEMA-STOP-KEEP.XML, HYPHENATION.DTD, BAD-SCHEMA-CODEC-GLOBAL-VS-FT-MISMATCH.XML, SCHEMA-DOCVALUES.XML, STOP-SNOWBALL.TXT, SOLRCONFIG-MERGEPOLICY-LEGACY.XML, SOLRCONFIG-INDEXCONFIG.XML, SCHEMA11.XML, BAD-SCHEMA-MULTIPLE-ASTERISK-COPYFIELD-SOURCE-SHOULD-FAIL-TEST.XML, SOLRCONFIG.SNIPPET.RANDOMINDEXCONFIG.XML, BAD-SOLRCONFIG-UNEXPECTED-SCHEMA-ATTRIBUTE.XML, BAD-SOLRCONFIG-SCHEMA-MUTABLE-BUT-NOT-MANAGED.XML, BAD-SCHEMA-SWEETSPOT-PARTIAL-HYPERBOLIC.XML, SOLRCONFIG-TEST-MISC.XML, SOLRCONFIG-SLAVE.XML, SOLRCONFIG-LOGMERGEPOLICY.XML, SOLRCONFIG_PERF.XML, BAD-SCHEMA-CURRENCY-DYNAMIC-MULTIVALUED.XML, SOLRCONFIG-SUGGESTERCOMPONENT.XML, SOLRCONFIG-LAZYWRITER.XML, SCHEMA-XINCLUDE.XML, BAD-SCHEMA-NOT-INDEXED-BUT-TF.XML, SOLRCONFIG-MASTER3.XML, BAD-SOLRCONFIG-MANAGED-SCHEMA-NAMED-SCHEMA.XML.XML, SCHEMA-ONE-FIELD-NO-DYNAMIC-FIELD-UNIQUE-KEY.XML, SCHEMA_CODEC.XML, SCHEMA-SYNONYM-TOKENIZER.XML, BAD-SCHEMA-DUP-FIELDTYPE.XML, SOLRCONFIG-SPELLCHECKCOMPONENT.XML, PROTWORDS.TXT, MAPPING-ISOLATIN1ACCENT.TXT, SCHEMA-POSTINGSHIGHLIGHT.XML, SOLRCONFIG-SNIPPET-PROCESSOR.XML, HUNSPELL-TEST.AFF, FRENCHARTICLES.TXT, SOLRCONFIG-DELPOLICY2.XML, BAD-SCHEMA-OMIT-TF-BUT-NOT-POS.XML, SOLRCONFIG-TLOG.XML, COMPOUNDDICTIONARY.TXT, FUZZYSUGGEST.TXT, SCHEMA-SIM.XML, SOLRCONFIG-SOLR-749.XML, BAD-SCHEMA-SIM-GLOBAL-VS-FT-MISMATCH.XML, SCHEMA-REPLICATION1.XML, STOP-2.TXT, BAD-SCHEMA-BOGUS-FIELD-PARAMETERS.XML, SCHEMA-PHRASESUGGEST.XML, SCHEMA-ID-AND-VERSION-FIELDS-ONLY.XML, SCHEMA-BM25.XML, ADDFIELDS.UPDATEPROCESSOR.JS, BAD-SCHEMA-NONTEXT-ANALYZER.XML, MISSLEADING.EXTENSION.UPDATEPROCESSOR.JS.TXT, STOPTYPES-1.TXT, SCHEMA-BINARYFIELD.XML, SCHEMA-DOCVALUESMULTI.XML, REGEX-BOOST-PROCESSOR-TEST.TXT, BAD-SCHEMA-CURRENCY-MULTIVALUED.XML, SCHEMA-REVERSED.XML, SOLRCONFIG-COLLAPSEQPARSER.XML, SCHEMA-TFIDF.XML, MISSING.FUNCTIONS.UPDATEPROCESSOR.JS, SOLRCONFIG_CODEC.XML, SOLRCONFIG-DELPOLICY1.XML, SOLRCONFIG-SLAVE1.XML, SOLRCONFIG-UPDATE-PROCESSOR-CHAINS.XML, BAD-SOLRCONFIG-MULTIPLE-DIRFACTORY.XML, STOPWORDS.TXT, STOP-1.TXT, BAD-SCHEMA-EXTERNAL-FILEFIELD.XML, SOLRCONFIG-NOOPREGEN.XML, SOLRCONFIG-INFOSTREAM-LOGGING.XML, BAD-SCHEMA-MISPLACED-ASTERISK-COPYFIELD-DEST-SHOULD-FAIL-TEST.XML, XSLT, BAD-SCHEMA-DYNAMICFIELD-DEFAULT-VAL.XML, SCHEMA-REST-LUCENE-MATCH-VERSION.XML, SOLRCONFIG-FUNCTIONQUERY.XML, CONDITIONAL.UPDATEPROCESSOR.JS, CURRENCY.XML, SCHEMA-DFR.XML, STOPWITHBOM.TXT, SOLRCONFIG-ADD-SCHEMA-FIELDS-UPDATE-PROCESSOR-CHAINS.XML, SOLRCONFIG-MANAGED-SCHEMA.XML, SOLRCONFIG-PARSING-UPDATE-PROCESSOR-CHAINS.XML, BAD-SCHEMA-SWEETSPOT-PARTIAL-NORMS.XML, SCHEMA-REST.XML, SCHEMA-IB.XML, SCHEMA-COLLATE.XML, STOPWORDSWRONGENCODING.TXT, SCHEMA-REPLICATION2.XML, BAD-SCHEMA-DYNAMICFIELD-REQUIRED.XML, BAD-SCHEMA-UNSUPPORTED-DOCVALUES.XML, SOLRCONFIG-MASTER2.XML, SOLRCONFIG-PHRASESUGGEST.XML, KEEP-2.TXT, SCHEMA-LMDIRICHLET.XML, SOLRCONFIG-EXTERNALVERSIONCONSTRAINT.XML, OLD_SYNONYMS.TXT, SCHEMASURROUND.XML, SCHEMA-LMJELINEKMERCER.XML, BAD-SCHEMA-NOT-INDEXED-BUT-POS.XML, BAD-SCHEMA-CURRENCY-FT-BOGUS-CODE-IN-XML.XML, BAD-SCHEMA-ANALYZER-CLASS-AND-NESTED.XML, SOLRCONFIG-MINIMAL.XML, SOLRCONFIG-QUERYSENDER.XML, SOLRCONFIG-TERMINDEX.XML, SOLRCONFIG-TIEREDMERGEPOLICY.XML, BAD-SOLRCONFIG-MULTIPLE-INDEXCONFIGS.XML, BAD_SOLRCONFIG.XML, SOLRCONFIG-SCRIPT-UPDATEPROCESSOR.XML, BAD-SOLRCONFIG-MISSING-SCRIPTFILE.XML, BAD-SCHEMA-UNIQUEKEY-USES-DEFAULT.XML, SOLRCONFIG-TRANSFORMERS.XML, SOLRCONFIG-XINCLUDE.XML, SOLRCONFIG-MASTER.XML, SCHEMA-FOLDING.XML, BAD-SCHEMA-NON-GLOB-COPYFIELD-SOURCE-MATCHING-NOTHING-SHOULD-FAIL-TEST.XML, TRIVIAL.UPDATEPROCESSOR0.JS, JASUGGEST.TXT, SCHEMA-NOT-REQUIRED-UNIQUE-KEY.XML, KEEP-1.TXT, BAD-CURRENCY.XML, SCHEMA12.XML, SCHEMA-SPELLCHECKER.XML, BAD-SCHEMA-CURRENCY-FT-BOGUS-DEFAULT-CODE.XML, SCHEMA-COLLATE-DV.XML, SCHEMA-ONE-FIELD-NO-DYNAMIC-FIELD.XML, SCHEMA-MINIMAL.XML, SCHEMA-LUCENEMATCHVERSION.XML, SOLRCONFIG-CACHING.XML, ANALYZINGINFIXSUGGEST.TXT, BAD-SCHEMA-SWEETSPOT-PARTIAL-BASELINE.XML, SCHEMA-COLLATEFILTER.XML, SOLRCONFIG-POSTINGSHIGHLIGHT.XML, SOLRCONFIG-QUERYSENDER-NOQUERY.XML, BAD-SCHEMA-MULTIPLE-ASTERISK-COPYFIELD-DEST-SHOULD-FAIL-TEST.XML, THROW.ERROR.ON.ADD.UPDATEPROCESSOR.JS, SOLRCONFIG-SOLCOREPROPERTIES.XML, SOLRCONFIG-BASIC.XML, SOLRCONFIG-COMPONENTS-NAME.XML, OPEN-EXCHANGE-RATES.JSON, SOLRCONFIG-ALTDIRECTORY.XML, SOLRCONFIG-IMPLICITPROPERTIES.XML, SYNONYMS.TXT, SCHEMA-CHARFILTERS.XML, ELEVATE.XML, SCHEMA-SPATIAL.XML, SCHEMA-REQUIRED-FIELDS.XML, SCHEMA-DOCVALUESMISSING.XML, BAD-SCHEMA-NOT-INDEXED-BUT-NORMS.XML, SOLRCONFIG-BASIC-LUCENEVERSION31.XML, SOLRCONFIG-RESPONSE-LOG-COMPONENT.XML, SCHEMA-CUSTOM-FIELD.XML, BAD-SCHEMA-SWEETSPOT-BOTH-TF.XML, BAD-SCHEMA-DUP-DYNAMICFIELD.XML, BAD-SOLRCONFIG-INVALID-SCRIPTFILE.XML, BAD-SCHEMA-CURRENCY-FT-MULTIVALUED.XML, TRIVIAL.UPDATEPROCESSOR1.JS, STOPTYPES-2.TXT, STEMDICT.TXT, WDFTYPES.TXT, BAD-SCHEMA-DUP-FIELD.XML, SOLRCONFIG-MERGEPOLICY-DEFAULTS.XML, BAD-SOLRCONFIG-MULTIPLE-CFS.XML, PHRASESUGGEST.TXT, BAD-MP-SOLRCONFIG.XML, SCHEMA-DOCVALUESFACETING.XML, SCHEMA-DISTRIBUTED-MISSING-SORT.XML, SCHEMA-TINY.XML, SCHEMA-EFF.XML, SCHEMA-TRIE.XML, BAD-SOLRCONFIG-BOGUS-SCRIPTENGINE-NAME.XML, SOLRCONFIG-ELEVATE.XML, SCHEMA-SNIPPET-TYPES.INCL]
   [junit4]   2> 50440 T338 oasu.CommitTracker.<init> Hard AutoCommit: disabled
   [junit4]   2> 50440 T338 oasu.CommitTracker.<init> Soft AutoCommit: disabled
   [junit4]   2> 50441 T338 oasu.RandomMergePolicy.<init> RandomMergePolicy wrapping class org.apache.lucene.index.TieredMergePolicy: [TieredMergePolicy: maxMergeAtOnce=14, maxMergeAtOnceExplicit=19, maxMergedSegmentMB=56.1865234375, floorSegmentMB=0.6455078125, forceMergeDeletesPctAllowed=7.732173800717246, segmentsPerTier=22.0, maxCFSSegmentSizeMB=8.796093022207999E12, noCFSRatio=0.6232846189598426
   [junit4]   2> 50442 T338 oasc.SolrDeletionPolicy.onInit SolrDeletionPolicy.onInit: commits: num=1
   [junit4]   2> 		commit{dir=MockDirectoryWrapper(org.apache.lucene.store.RAMDirectory@5126928 lockFactory=org.apache.lucene.store.SingleInstanceLockFactory@25d495de),segFN=segments_1,generation=1}
   [junit4]   2> 50443 T338 oasc.SolrDeletionPolicy.updateCommits newest commit generation = 1
   [junit4]   2> 50443 T338 oass.SolrIndexSearcher.<init> Opening Searcher@485f9e91 main
   [junit4]   2> 50444 T338 oashc.QueryElevationComponent.inform Loading QueryElevation from: /mnt/ssd/jenkins/workspace/Lucene-Solr-4.x-Linux/solr/build/solr-core/test-files/solr/collection1/conf/elevate.xml
   [junit4]   2> 50453 T338 oashc.QueryElevationComponent.inform Loading QueryElevation from: /mnt/ssd/jenkins/workspace/Lucene-Solr-4.x-Linux/solr/build/solr-core/test-files/solr/collection1/conf/elevate.xml
   [junit4]   2> 50465 T339 oasc.SolrCore.registerSearcher [collection1] Registered new searcher Searcher@485f9e91 main{StandardDirectoryReader(segments_1:1:nrt)}
   [junit4]   2> 50468 T338 oasc.CoreContainer.registerCore registering core: collection1
   [junit4]   2> 50469 T316 oass.SolrDispatchFilter.init user.dir=/mnt/ssd/jenkins/workspace/Lucene-Solr-4.x-Linux/solr/build/solr-core/test/J0
   [junit4]   2> 50470 T316 oass.SolrDispatchFilter.init SolrDispatchFilter.init() done
   [junit4]   2> 50473 T316 oejs.Server.doStart jetty-8.1.10.v20130312
   [junit4]   2> 50475 T316 oejs.AbstractConnector.doStart Started SelectChannelConnector@127.0.0.1:?????
   [junit4]   2> 50477 T316 oass.SolrDispatchFilter.init SolrDispatchFilter.init()
   [junit4]   2> 50478 T316 oasc.SolrResourceLoader.locateSolrHome JNDI not configured for solr (NoInitialContextEx)
   [junit4]   2> 50478 T316 oasc.SolrResourceLoader.locateSolrHome using system property solr.solr.home: /mnt/ssd/jenkins/workspace/Lucene-Solr-4.x-Linux/solr/build/solr-core/test-files/solr
   [junit4]   2> 50479 T316 oasc.SolrResourceLoader.<init> new SolrResourceLoader for directory: '/mnt/ssd/jenkins/workspace/Lucene-Solr-4.x-Linux/solr/build/solr-core/test-files/solr/'
   [junit4]   2> 50488 T316 oasc.ConfigSolr.fromFile Loading container configuration from /mnt/ssd/jenkins/workspace/Lucene-Solr-4.x-Linux/solr/build/solr-core/test-files/solr/solr.xml
   [junit4]   2> 50526 T316 oasc.CoreContainer.<init> New CoreContainer -2019526810
   [junit4]   2> 50526 T316 oasc.CoreContainer.load Loading cores into CoreContainer [instanceDir=/mnt/ssd/jenkins/workspace/Lucene-Solr-4.x-Linux/solr/build/solr-core/test-files/solr/]
   [junit4]   2> 50528 T316 oashc.HttpShardHandlerFactory.getParameter Setting socketTimeout to: 90000
   [junit4]   2> 50528 T316 oashc.HttpShardHandlerFactory.getParameter Setting urlScheme to: http://
   [junit4]   2> 50529 T316 oashc.HttpShardHandlerFactory.getParameter Setting connTimeout to: 15000
   [junit4]   2> 50530 T316 oashc.HttpShardHandlerFactory.getParameter Setting maxConnectionsPerHost to: 20
   [junit4]   2> 50530 T316 oashc.HttpShardHandlerFactory.getParameter Setting corePoolSize to: 0
   [junit4]   2> 50531 T316 oashc.HttpShardHandlerFactory.getParameter Setting maximumPoolSize to: 2147483647
   [junit4]   2> 50532 T316 oashc.HttpShardHandlerFactory.getParameter Setting maxThreadIdleTime to: 5
   [junit4]   2> 50532 T316 oashc.HttpShardHandlerFactory.getParameter Setting sizeOfQueue to: -1
   [junit4]   2> 50533 T316 oashc.HttpShardHandlerFactory.getParameter Setting fairnessPolicy to: false
   [junit4]   2> 50539 T316 oasl.LogWatcher.createWatcher SLF4J impl is org.slf4j.impl.Log4jLoggerFactory
   [junit4]   2> 50539 T316 oasl.LogWatcher.newRegisteredLogWatcher Registering Log Listener [Log4j (org.slf4j.impl.Log4jLoggerFactory)]
   [junit4]   2> 50540 T316 oasc.CoreContainer.load Host Name: 127.0.0.1
   [junit4]   2> 50544 T350 oasc.CoreContainer.create Creating SolrCore 'collection1' using instanceDir: /mnt/ssd/jenkins/workspace/Lucene-Solr-4.x-Linux/solr/build/solr-core/test-files/solr/collection1
   [junit4]   2> 50544 T350 oasc.SolrResourceLoader.<init> new SolrResourceLoader for directory: '/mnt/ssd/jenkins/workspace/Lucene-Solr-4.x-Linux/solr/build/solr-core/test-files/solr/collection1/'
   [junit4]   2> 50545 T350 oasc.SolrResourceLoader.replaceClassLoader Adding 'file:/mnt/ssd/jenkins/workspace/Lucene-Solr-4.x-Linux/solr/build/solr-core/test-files/solr/collection1/lib/classes/' to classloader
   [junit4]   2> 50545 T350 oasc.SolrResourceLoader.replaceClassLoader Adding 'file:/mnt/ssd/jenkins/workspace/Lucene-Solr-4.x-Linux/solr/build/solr-core/test-files/solr/collection1/lib/README' to classloader
   [junit4]   2> 50585 T350 oasc.SolrConfig.<init> Using Lucene MatchVersion: LUCENE_47
   [junit4]   2> 50625 T350 oasc.SolrConfig.<init> Loaded SolrConfig: solrconfig-elevate.xml
   [junit4]   2> 50626 T350 oass.IndexSchema.readSchema Reading Solr Schema from schema11.xml
   [junit4]   2> 50632 T350 oass.IndexSchema.readSchema [collection1] Schema name=example
   [junit4]   2> 50769 T350 oass.IndexSchema.readSchema default search field in schema is text
   [junit4]   2> 50770 T350 oass.IndexSchema.readSchema unique key field: id
   [junit4]   2> 50781 T350 oasc.SolrCore.initDirectoryFactory org.apache.solr.core.MockDirectoryFactory
   [junit4]   2> 50781 T350 oasc.SolrCore.<init> [collection1] Opening new SolrCore at /mnt/ssd/jenkins/workspace/Lucene-Solr-4.x-Linux/solr/build/solr-core/test-files/solr/collection1/, dataDir=./org.apache.solr.handler.component.DistributedQueryElevationComponentTest-1388343311546/shard1/data/
   [junit4]   2> 50782 T350 oasc.JmxMonitoredMap.<init> JMX monitoring is enabled. Adding Solr mbeans to JMX Server: com.sun.jmx.mbeanserver.JmxMBeanServer@88d4e57f
   [junit4]   2> 50783 T350 oasc.CachingDirectoryFactory.get return new directory for ./org.apache.solr.handler.component.DistributedQueryElevationComponentTest-1388343311546/shard1/data
   [junit4]   2> 50783 T350 oasc.SolrCore.getNewIndexDir New index directory detected: old=null new=./org.apache.solr.handler.component.DistributedQueryElevationComponentTest-1388343311546/shard1/data/index/
   [junit4]   2> 50783 T350 oasc.SolrCore.initIndex WARN [collection1] Solr index directory './org.apache.solr.handler.component.DistributedQueryElevationComponentTest-1388343311546/shard1/data/index' doesn't exist. Creating new index...
   [junit4]   2> 50784 T350 oasc.CachingDirectoryFactory.get return new directory for ./org.apache.solr.handler.component.DistributedQueryElevationComponentTest-1388343311546/shard1/data/index
   [junit4]   2> 50784 T350 oasu.RandomMergePolicy.<init> RandomMergePolicy wrapping class org.apache.lucene.index.TieredMergePolicy: [TieredMergePolicy: maxMergeAtOnce=37, maxMergeAtOnceExplicit=11, maxMergedSegmentMB=51.470703125, floorSegmentMB=1.6025390625, forceMergeDeletesPctAllowed=14.80106111350754, segmentsPerTier=38.0, maxCFSSegmentSizeMB=8.796093022207999E12, noCFSRatio=0.5895303463940323
   [junit4]   2> 50785 T350 oasc.SolrDeletionPolicy.onCommit SolrDeletionPolicy.onCommit: commits: num=1
   [junit4]   2> 		commit{dir=MockDirectoryWrapper(org.apache.lucene.store.RAMDirectory@c00c682b lockFactory=org.apache.lucene.store.SingleInstanceLockFactory@42b1dfa2),segFN=segments_1,generation=1}
   [junit4]   2> 50786 T350 oasc.SolrDeletionPolicy.updateCommits newest commit generation = 1
   [junit4]   2> 50790 T350 oasc.SolrCore.loadUpdateProcessorChains no updateRequestProcessorChain defined as default, creating implicit default
   [junit4]   2> 50791 T350 oasc.RequestHandlers.initHandlersFromConfig created /update: solr.UpdateRequestHandler
   [junit4]   2> 50792 T350 oasc.RequestHandlers.initHandlersFromConfig created /elevate: org.apache.solr.handler.component.SearchHandler
   [junit4]   2> 50792 T350 oasc.RequestHandlers.initHandlersFromConfig created /dataElevate: org.apache.solr.handler.component.SearchHandler
   [junit4]   2> 50794 T350 oashl.XMLLoader.init xsltCacheLifetimeSeconds=60
   [junit4]   2> 50794 T350 oasc.RequestHandlers.initHandlersFromConfig WARN no default request handler is registered (either '/select' or 'standard')
   [junit4]   2> 50795 T350 oasc.SolrCore.initDeprecatedSupport WARN solrconfig.xml uses deprecated <admin/gettableFiles>, Please update your config to use the ShowFileRequestHandler.
   [junit4]   2> 50797 T350 oasc.SolrCore.initDeprecatedSupport WARN adding ShowFileRequestHandler with hidden files: [BAD-SOLRCONFIG-MANAGED-SCHEMA-NAMED-SCHEMA.XML.XML, SCHEMA-ONE-FIELD-NO-DYNAMIC-FIELD-UNIQUE-KEY.XML, SCHEMA-XINCLUDE.XML, BAD-SCHEMA-NOT-INDEXED-BUT-TF.XML, SOLRCONFIG-MASTER3.XML, MAPPING-ISOLATIN1ACCENT.TXT, PROTWORDS.TXT, SCHEMA-SYNONYM-TOKENIZER.XML, BAD-SCHEMA-DUP-FIELDTYPE.XML, SOLRCONFIG-SPELLCHECKCOMPONENT.XML, HUNSPELL-TEST.AFF, FRENCHARTICLES.TXT, SOLRCONFIG-SNIPPET-PROCESSOR.XML, SCHEMA-POSTINGSHIGHLIGHT.XML, SCHEMA_CODEC.XML, SOLRCONFIG_PERF.XML, SOLRCONFIG-LOGMERGEPOLICY.XML, BAD-SCHEMA-SWEETSPOT-PARTIAL-HYPERBOLIC.XML, BAD-SOLRCONFIG-SCHEMA-MUTABLE-BUT-NOT-MANAGED.XML, SOLRCONFIG-SLAVE.XML, SOLRCONFIG-TEST-MISC.XML, SOLRCONFIG-LAZYWRITER.XML, SOLRCONFIG-SUGGESTERCOMPONENT.XML, BAD-SCHEMA-CURRENCY-DYNAMIC-MULTIVALUED.XML, HYPHENATION.DTD, BAD-SCHEMA-CODEC-GLOBAL-VS-FT-MISMATCH.XML, SCHEMA-STOP-KEEP.XML, BAD-SOLRCONFIG-WARMER-NO-REOPEN.XML, SCHEMA-NUMERIC.XML, SCHEMA-SWEETSPOT.XML, SCHEMA-COPYFIELD-TEST.XML, BAD-SCHEMA-BOGUS-ANALYSIS-PARAMETERS.XML, SCHEMA-SNIPPET-FIELD.XML, SOLRCONFIG-REQHANDLER.INCL, SOLRCONFIG-INDEXCONFIG.XML, SOLRCONFIG-MERGEPOLICY-LEGACY.XML, BAD-SOLRCONFIG-UNEXPECTED-SCHEMA-ATTRIBUTE.XML, BAD-SCHEMA-MULTIPLE-ASTERISK-COPYFIELD-SOURCE-SHOULD-FAIL-TEST.XML, SOLRCONFIG.SNIPPET.RANDOMINDEXCONFIG.XML, SCHEMA11.XML, SCHEMA-DOCVALUES.XML, STOP-SNOWBALL.TXT, BAD-SCHEMA-UNIQUEKEY-MULTIVALUED.XML, SOLRCONFIG-NOCACHE.XML, DA_UTF8.XML, SOLRCONFIG-SPELLCHECKER.XML, SOLRCONFIG-DEFAULTS.XML, SOLRCONFIG-WARMER.XML, SCHEMA-ADD-SCHEMA-FIELDS-UPDATE-PROCESSOR.XML, SOLRCONFIG-HIGHLIGHT.XML, SOLRCONFIG-MASTER1.XML, DA_COMPOUNDDICTIONARY.TXT, BAD-SCHEMA-UNIQUEKEY-IS-COPYFIELD-DEST.XML, ENUMSCONFIG.XML, SOLRCONFIG-REPEATER.XML, BAD-SCHEMA-MISPLACED-ASTERISK-COPYFIELD-SOURCE-SHOULD-FAIL-TEST.XML, SCHEMA-SNIPPET-TYPE.XML, SCHEMA-CLASS-NAME-SHORTENING-ON-SERIALIZATION.XML, SOLRCONFIG-MASTER1-KEEPONEBACKUP.XML, HUNSPELL-TEST.DIC, SCHEMA15.XML, SCHEMA-ENUMS.XML, SCHEMA-SIMPLEQPPLUGIN.XML, BAD-SCHEMA-CURRENCY-FT-OER-NORATES.XML, SCHEMA-BEHAVIOR.XML, SOLRCONFIG-NOOPREGEN.XML, SOLRCONFIG-INFOSTREAM-LOGGING.XML, BAD-SCHEMA-EXTERNAL-FILEFIELD.XML, XSLT, BAD-SCHEMA-MISPLACED-ASTERISK-COPYFIELD-DEST-SHOULD-FAIL-TEST.XML, STOPWITHBOM.TXT, SOLRCONFIG-ADD-SCHEMA-FIELDS-UPDATE-PROCESSOR-CHAINS.XML, CURRENCY.XML, SCHEMA-DFR.XML, SOLRCONFIG-PARSING-UPDATE-PROCESSOR-CHAINS.XML, SOLRCONFIG-MANAGED-SCHEMA.XML, SOLRCONFIG-FUNCTIONQUERY.XML, SCHEMA-REST-LUCENE-MATCH-VERSION.XML, BAD-SCHEMA-DYNAMICFIELD-DEFAULT-VAL.XML, CONDITIONAL.UPDATEPROCESSOR.JS, SOLRCONFIG-DELPOLICY1.XML, SOLRCONFIG_CODEC.XML, STOPWORDS.TXT, STOP-1.TXT, SOLRCONFIG-UPDATE-PROCESSOR-CHAINS.XML, SOLRCONFIG-SLAVE1.XML, BAD-SOLRCONFIG-MULTIPLE-DIRFACTORY.XML, STOPTYPES-1.TXT, BAD-SCHEMA-NONTEXT-ANALYZER.XML, MISSLEADING.EXTENSION.UPDATEPROCESSOR.JS.TXT, ADDFIELDS.UPDATEPROCESSOR.JS, SCHEMA-BINARYFIELD.XML, SCHEMA-ID-AND-VERSION-FIELDS-ONLY.XML, SCHEMA-BM25.XML, MISSING.FUNCTIONS.UPDATEPROCESSOR.JS, SCHEMA-TFIDF.XML, SCHEMA-DOCVALUESMULTI.XML, SCHEMA-REVERSED.XML, SOLRCONFIG-COLLAPSEQPARSER.XML, BAD-SCHEMA-CURRENCY-MULTIVALUED.XML, REGEX-BOOST-PROCESSOR-TEST.TXT, COMPOUNDDICTIONARY.TXT, FUZZYSUGGEST.TXT, SOLRCONFIG-DELPOLICY2.XML, SOLRCONFIG-TLOG.XML, BAD-SCHEMA-OMIT-TF-BUT-NOT-POS.XML, SCHEMA-REPLICATION1.XML, BAD-SCHEMA-SIM-GLOBAL-VS-FT-MISMATCH.XML, SCHEMA-SIM.XML, SOLRCONFIG-SOLR-749.XML, SCHEMA-PHRASESUGGEST.XML, BAD-SCHEMA-BOGUS-FIELD-PARAMETERS.XML, STOP-2.TXT, JASUGGEST.TXT, TRIVIAL.UPDATEPROCESSOR0.JS, SCHEMA12.XML, KEEP-1.TXT, BAD-CURRENCY.XML, SCHEMA-NOT-REQUIRED-UNIQUE-KEY.XML, BAD-SCHEMA-NON-GLOB-COPYFIELD-SOURCE-MATCHING-NOTHING-SHOULD-FAIL-TEST.XML, SCHEMA-FOLDING.XML, SCHEMA-COLLATE-DV.XML, SCHEMA-MINIMAL.XML, SCHEMA-ONE-FIELD-NO-DYNAMIC-FIELD.XML, SCHEMA-SPELLCHECKER.XML, BAD-SCHEMA-CURRENCY-FT-BOGUS-DEFAULT-CODE.XML, BAD_SOLRCONFIG.XML, SOLRCONFIG-SCRIPT-UPDATEPROCESSOR.XML, BAD-SOLRCONFIG-MULTIPLE-INDEXCONFIGS.XML, BAD-SCHEMA-CURRENCY-FT-BOGUS-CODE-IN-XML.XML, BAD-SCHEMA-NOT-INDEXED-BUT-POS.XML, SOLRCONFIG-TIEREDMERGEPOLICY.XML, SOLRCONFIG-TERMINDEX.XML, BAD-SCHEMA-ANALYZER-CLASS-AND-NESTED.XML, SOLRCONFIG-MINIMAL.XML, SOLRCONFIG-QUERYSENDER.XML, SOLRCONFIG-MASTER.XML, SOLRCONFIG-XINCLUDE.XML, BAD-SOLRCONFIG-MISSING-SCRIPTFILE.XML, SOLRCONFIG-TRANSFORMERS.XML, BAD-SCHEMA-UNIQUEKEY-USES-DEFAULT.XML, KEEP-2.TXT, SCHEMA-LMDIRICHLET.XML, SOLRCONFIG-PHRASESUGGEST.XML, SCHEMA-LMJELINEKMERCER.XML, SCHEMASURROUND.XML, OLD_SYNONYMS.TXT, SOLRCONFIG-EXTERNALVERSIONCONSTRAINT.XML, STOPWORDSWRONGENCODING.TXT, BAD-SCHEMA-SWEETSPOT-PARTIAL-NORMS.XML, SCHEMA-IB.XML, SCHEMA-COLLATE.XML, SCHEMA-REST.XML, BAD-SCHEMA-DYNAMICFIELD-REQUIRED.XML, BAD-SCHEMA-UNSUPPORTED-DOCVALUES.XML, SOLRCONFIG-MASTER2.XML, SCHEMA-REPLICATION2.XML, SCHEMA-TINY.XML, SCHEMA-EFF.XML, PHRASESUGGEST.TXT, BAD-MP-SOLRCONFIG.XML, BAD-SOLRCONFIG-MULTIPLE-CFS.XML, SCHEMA-DISTRIBUTED-MISSING-SORT.XML, SCHEMA-DOCVALUESFACETING.XML, SOLRCONFIG-ELEVATE.XML, SCHEMA-SNIPPET-TYPES.INCL, BAD-SOLRCONFIG-BOGUS-SCRIPTENGINE-NAME.XML, SCHEMA-TRIE.XML, BAD-SCHEMA-CURRENCY-FT-MULTIVALUED.XML, STOPTYPES-2.TXT, TRIVIAL.UPDATEPROCESSOR1.JS, BAD-SCHEMA-DUP-DYNAMICFIELD.XML, BAD-SOLRCONFIG-INVALID-SCRIPTFILE.XML, SOLRCONFIG-MERGEPOLICY-DEFAULTS.XML, BAD-SCHEMA-DUP-FIELD.XML, STEMDICT.TXT, WDFTYPES.TXT, SYNONYMS.TXT, SCHEMA-CHARFILTERS.XML, ELEVATE.XML, SOLRCONFIG-IMPLICITPROPERTIES.XML, SOLRCONFIG-ALTDIRECTORY.XML, OPEN-EXCHANGE-RATES.JSON, SOLRCONFIG-COMPONENTS-NAME.XML, BAD-SCHEMA-NOT-INDEXED-BUT-NORMS.XML, SCHEMA-CUSTOM-FIELD.XML, BAD-SCHEMA-SWEETSPOT-BOTH-TF.XML, SOLRCONFIG-RESPONSE-LOG-COMPONENT.XML, SOLRCONFIG-BASIC-LUCENEVERSION31.XML, SCHEMA-SPATIAL.XML, SCHEMA-DOCVALUESMISSING.XML, SCHEMA-REQUIRED-FIELDS.XML, SOLRCONFIG-QUERYSENDER-NOQUERY.XML, SOLRCONFIG-POSTINGSHIGHLIGHT.XML, BAD-SCHEMA-MULTIPLE-ASTERISK-COPYFIELD-DEST-SHOULD-FAIL-TEST.XML, SOLRCONFIG-CACHING.XML, ANALYZINGINFIXSUGGEST.TXT, SCHEMA-LUCENEMATCHVERSION.XML, SCHEMA-COLLATEFILTER.XML, BAD-SCHEMA-SWEETSPOT-PARTIAL-BASELINE.XML, SOLRCONFIG-SOLCOREPROPERTIES.XML, SOLRCONFIG-BASIC.XML, THROW.ERROR.ON.ADD.UPDATEPROCESSOR.JS]
   [junit4]   2> 50799 T350 oasu.CommitTracker.<init> Hard AutoCommit: disabled
   [junit4]   2> 50799 T350 oasu.CommitTracker.<init> Soft AutoCommit: disabled
   [junit4]   2> 50800 T350 oasu.RandomMergePolicy.<init> RandomMergePolicy wrapping class org.apache.lucene.index.TieredMergePolicy: [TieredMergePolicy: maxMergeAtOnce=14, maxMergeAtOnceExplicit=19, maxMergedSegmentMB=56.1865234375, floorSegmentMB=0.6455078125, forceMergeDeletesPctAllowed=7.732173800717246, segmentsPerTier=22.0, maxCFSSegmentSizeMB=8.796093022207999E12, noCFSRatio=0.6232846189598426
   [junit4]   2> 50801 T350 oasc.SolrDeletionPolicy.onInit SolrDeletionPolicy.onInit: commits: num=1
   [junit4]   2> 		commit{dir=MockDirectoryWrapper(org.apache.lucene.store.RAMDirectory@c00c682b lockFactory=org.apache.lucene.store.SingleInstanceLockFactory@42b1dfa2),segFN=segments_1,generation=1}
   [junit4]   2> 50801 T350 oasc.SolrDeletionPolicy.updateCommits newest commit generation = 1
   [junit4]   2> 50801 T350 oass.SolrIndexSearcher.<init> Opening Searcher@a1e45e76 main
   [junit4]   2> 50802 T350 oashc.QueryElevationComponent.inform Loading QueryElevation from: /mnt/ssd/jenkins/workspace/Lucene-Solr-4.x-Linux/solr/build/solr-core/test-files/solr/collection1/conf/elevate.xml
   [junit4]   2> 50812 T350 oashc.QueryElevationComponent.inform Loading QueryElevation from: /mnt/ssd/jenkins/workspace/Lucene-Solr-4.x-Linux/solr/build/solr-core/test-files/solr/collection1/conf/elevate.xml
   [junit4]   2> 50823 T351 oasc.SolrCore.registerSearcher [collection1] Registered new searcher Searcher@a1e45e76 main{StandardDirectoryReader(segments_1:1:nrt)}
   [junit4]   2> 50826 T350 oasc.CoreContainer.registerCore registering core: collection1
   [junit4]   2> 50827 T316 oass.SolrDispatchFilter.init user.dir=/mnt/ssd/jenkins/workspace/Lucene-Solr-4.x-Linux/solr/build/solr-core/test/J0
   [junit4]   2> 50827 T316 oass.SolrDispatchFilter.init SolrDispatchFilter.init() done
   [junit4]   2> 50829 T316 oejs.Server.doStart jetty-8.1.10.v20130312
   [junit4]   2> 50831 T316 oejs.AbstractConnector.doStart Started SelectChannelConnector@127.0.0.1:?????
   [junit4]   2> 50832 T316 oass.SolrDispatchFilter.init SolrDispatchFilter.init()
   [junit4]   2> 50833 T316 oasc.SolrResourceLoader.locateSolrHome JNDI not configured for solr (NoInitialContextEx)
   [junit4]   2> 50833 T316 oasc.SolrResourceLoader.locateSolrHome using system property solr.solr.home: /mnt/ssd/jenkins/workspace/Lucene-Solr-4.x-Linux/solr/build/solr-core/test-files/solr
   [junit4]   2> 50834 T316 oasc.SolrResourceLoader.<init> new SolrResourceLoader for directory: '/mnt/ssd/jenkins/workspace/Lucene-Solr-4.x-Linux/solr/build/solr-core/test-files/solr/'
   [junit4]   2> 50844 T316 oasc.ConfigSolr.fromFile Loading container configuration from /mnt/ssd/jenkins/workspace/Lucene-Solr-4.x-Linux/solr/build/solr-core/test-files/solr/solr.xml
   [junit4]   2> 50879 T316 oasc.CoreContainer.<init> New CoreContainer -1468043495
   [junit4]   2> 50879 T316 oasc.CoreContainer.load Loading cores into CoreContainer [instanceDir=/mnt/ssd/jenkins/workspace/Lucene-Solr-4.x-Linux/solr/build/solr-core/test-files/solr/]
   [junit4]   2> 50881 T316 oashc.HttpShardHandlerFactory.getParameter Setting socketTimeout to: 90000
   [junit4]   2> 50881 T316 oashc.HttpShardHandlerFactory.getParameter Setting urlScheme to: http://
   [junit4]   2> 50882 T316 oashc.HttpShardHandlerFactory.getParameter Setting connTimeout to: 15000
   [junit4]   2> 50883 T316 oashc.HttpShardHandlerFactory.getParameter Setting maxConnectionsPerHost to: 20
   [junit4]   2> 50884 T316 oashc.HttpShardHandlerFactory.getParameter Setting corePoolSize to: 0
   [junit4]   2> 50885 T316 oashc.HttpShardHandlerFactory.getParameter Setting maximumPoolSize to: 2147483647
   [junit4]   2> 50886 T316 oashc.HttpShardHandlerFactory.getParameter Setting maxThreadIdleTime to: 5
   [junit4]   2> 50887 T316 oashc.HttpShardHandlerFactory.getParameter Setting sizeOfQueue to: -1
   [junit4]   2> 50888 T316 oashc.HttpShardHandlerFactory.getParameter Setting fairnessPolicy to: false
   [junit4]   2> 50899 T316 oasl.LogWatcher.createWatcher SLF4J impl is org.slf4j.impl.Log4jLoggerFactory
   [junit4]   2> 50900 T316 oasl.LogWatcher.newRegisteredLogWatcher Registering Log Listener [Log4j (org.slf4j.impl.Log4jLoggerFactory)]
   [junit4]   2> 50901 T316 oasc.CoreContainer.load Host Name: 127.0.0.1
   [junit4]   2> 50906 T362 oasc.CoreContainer.create Creating SolrCore 'collection1' using instanceDir: /mnt/ssd/jenkins/workspace/Lucene-Solr-4.x-Linux/solr/build/solr-core/test-files/solr/collection1
   [junit4]   2> 50907 T362 oasc.SolrResourceLoader.<init> new SolrResourceLoader for directory: '/mnt/ssd/jenkins/workspace/Lucene-Solr-4.x-Linux/solr/build/solr-core/test-files/solr/collection1/'
   [junit4]   2> 50907 T362 oasc.SolrResourceLoader.replaceClassLoader Adding 'file:/mnt/ssd/jenkins/workspace/Lucene-Solr-4.x-Linux/solr/build/solr-core/test-files/solr/collection1/lib/classes/' to classloader
   [junit4]   2> 50908 T362 oasc.SolrResourceLoader.replaceClassLoader Adding 'file:/mnt/ssd/jenkins/workspace/Lucene-Solr-4.x-Linux/solr/build/solr-core/test-files/solr/collection1/lib/README' to classloader
   [junit4]   2> 50951 T362 oasc.SolrConfig.<init> Using Lucene MatchVersion: LUCENE_47
   [junit4]   2> 50984 T362 oasc.SolrConfig.<init> Loaded SolrConfig: solrconfig-elevate.xml
   [junit4]   2> 50985 T362 oass.IndexSchema.readSchema Reading Solr Schema from schema11.xml
   [junit4]   2> 50991 T362 oass.IndexSchema.readSchema [collection1] Schema name=example
   [junit4]   2> 51135 T362 oass.IndexSchema.readSchema default search field in schema is text
   [junit4]   2> 51138 T362 oass.IndexSchema.readSchema unique key field: id
   [junit4]   2> 51145 T362 oasc.SolrCore.initDirectoryFactory org.apache.solr.core.MockDirectoryFactory
   [junit4]   2> 51146 T362 oasc.SolrCore.<init> [collection1] Opening new SolrCore at /mnt/ssd/jenkins/workspace/Lucene-Solr-4.x-Linux/solr/build/solr-core/test-files/solr/collection1/, dataDir=./org.apache.solr.handler.component.DistributedQueryElevationComponentTest-1388343311546/shard2/data/
   [junit4]   2> 51146 T362 oasc.JmxMonitoredMap.<init> JMX monitoring is enabled. Adding Solr mbeans to JMX Server: com.sun.jmx.mbeanserver.JmxMBeanServer@88d4e57f
   [junit4]   2> 51147 T362 oasc.CachingDirectoryFactory.get return new directory for ./org.apache.solr.handler.component.DistributedQueryElevationComponentTest-1388343311546/shard2/data
   [junit4]   2> 51147 T362 oasc.SolrCore.getNewIndexDir New index directory detected: old=null new=./org.apache.solr.handler.component.DistributedQueryElevationComponentTest-1388343311546/shard2/data/index/
   [junit4]   2> 51148 T362 oasc.SolrCore.initIndex WARN [collection1] Solr index directory './org.apache.solr.handler.component.DistributedQueryElevationComponentTest-1388343311546/shard2/data/index' doesn't exist. Creating new index...
   [junit4]   2> 51148 T362 oasc.CachingDirectoryFactory.get return new directory for ./org.apache.solr.handler.component.DistributedQueryElevationComponentTest-1388343311546/shard2/data/index
   [junit4]   2> 51149 T362 oasu.RandomMergePolicy.<init> RandomMergePolicy wrapping class org.apache.lucene.index.TieredMergePolicy: [TieredMergePolicy: maxMergeAtOnce=37, maxMergeAtOnceExplicit=11, maxMergedSegmentMB=51.470703125, floorSegmentMB=1.6025390625, forceMergeDeletesPctAllowed=14.80106111350754, segmentsPerTier=38.0, maxCFSSegmentSizeMB=8.796093022207999E12, noCFSRatio=0.5895303463940323
   [junit4]   2> 51150 T362 oasc.SolrDeletionPolicy.onCommit SolrDeletionPolicy.onCommit: commits: num=1
   [junit4]   2> 		commit{dir=MockDirectoryWrapper(org.apache.lucene.store.RAMDirectory@11b8db54 lockFactory=org.apache.lucene.store.SingleInstanceLockFactory@481fda0b),segFN=segments_1,generation=1}
   [junit4]   2> 51150 T362 oasc.SolrDeletionPolicy.updateCommits newest commit generation = 1
   [junit4]   2> 51155 T362 oasc.SolrCore.loadUpdateProcessorChains no updateRequestProcessorChain defined as default, creating implicit default
   [junit4]   2> 51156 T362 oasc.RequestHandlers.initHandlersFromConfig created /update: solr.UpdateRequestHandler
   [junit4]   2> 51156 T362 oasc.RequestHandlers.initHandlersFromConfig created /elevate: org.apache.solr.handler.component.SearchHandler
   [junit4]   2> 51157 T362 oasc.RequestHandlers.initHandlersFromConfig created /dataElevate: org.apache.solr.handler.component.SearchHandler
   [junit4]   2> 51159 T362 oashl.XMLLoader.init xsltCacheLifetimeSeconds=60
   [junit4]   2> 51159 T362 oasc.RequestHandlers.initHandlersFromConfig WARN no default request handler is registered (either '/select' or 'standard')
   [junit4]   2> 51160 T362 oasc.SolrCore.initDeprecatedSupport WARN solrconfig.xml uses deprecated <admin/gettableFiles>, Please update your config to use the ShowFileRequestHandler.
   [junit4]   2> 51162 T362 oasc.SolrCore.initDeprecatedSupport WARN adding ShowFileRequestHandler with hidden files: [ELEVATE.XML, SYNONYMS.TXT, SCHEMA-CHARFILTERS.XML, SOLRCONFIG-ALTDIRECTORY.XML, SOLRCONFIG-IMPLICITPROPERTIES.XML, SOLRCONFIG-COMPONENTS-NAME.XML, OPEN-EXCHANGE-RATES.JSON, SCHEMA-CUSTOM-FIELD.XML, BAD-SCHEMA-SWEETSPOT-BOTH-TF.XML, SOLRCONFIG-BASIC-LUCENEVERSION31.XML, SOLRCONFIG-RESPONSE-LOG-COMPONENT.XML, BAD-SCHEMA-NOT-INDEXED-BUT-NORMS.XML, SCHEMA-DOCVALUESMISSING.XML, SCHEMA-REQUIRED-FIELDS.XML, SCHEMA-SPATIAL.XML, BAD-SCHEMA-MULTIPLE-ASTERISK-COPYFIELD-DEST-SHOULD-FAIL-TEST.XML, SOLRCONFIG-QUERYSENDER-NOQUERY.XML, SOLRCONFIG-POSTINGSHIGHLIGHT.XML, SCHEMA-COLLATEFILTER.XML, BAD-SCHEMA-SWEETSPOT-PARTIAL-BASELINE.XML, SOLRCONFIG-CACHING.XML, ANALYZINGINFIXSUGGEST.TXT, SCHEMA-LUCENEMATCHVERSION.XML, SOLRCONFIG-BASIC.XML, SOLRCONFIG-SOLCOREPROPERTIES.XML, THROW.ERROR.ON.ADD.UPDATEPROCESSOR.JS, SCHEMA-EFF.XML, SCHEMA-TINY.XML, SCHEMA-DISTRIBUTED-MISSING-SORT.XML, SCHEMA-DOCVALUESFACETING.XML, PHRASESUGGEST.TXT, BAD-MP-SOLRCONFIG.XML, BAD-SOLRCONFIG-MULTIPLE-CFS.XML, SCHEMA-SNIPPET-TYPES.INCL, SOLRCONFIG-ELEVATE.XML, SCHEMA-TRIE.XML, BAD-SOLRCONFIG-BOGUS-SCRIPTENGINE-NAME.XML, TRIVIAL.UPDATEPROCESSOR1.JS, STOPTYPES-2.TXT, BAD-SCHEMA-CURRENCY-FT-MULTIVALUED.XML, BAD-SOLRCONFIG-INVALID-SCRIPTFILE.XML, BAD-SCHEMA-DUP-DYNAMICFIELD.XML, SOLRCONFIG-MERGEPOLICY-DEFAULTS.XML, BAD-SCHEMA-DUP-FIELD.XML, WDFTYPES.TXT, STEMDICT.TXT, SCHEMA-LMDIRICHLET.XML, KEEP-2.TXT, SOLRCONFIG-PHRASESUGGEST.XML, SCHEMA-LMJELINEKMERCER.XML, OLD_SYNONYMS.TXT, SCHEMASURROUND.XML, SOLRCONFIG-EXTERNALVERSIONCONSTRAINT.XML, STOPWORDSWRONGENCODING.TXT, SCHEMA-REST.XML, SCHEMA-IB.XML, SCHEMA-COLLATE.XML, BAD-SCHEMA-SWEETSPOT-PARTIAL-NORMS.XML, BAD-SCHEMA-UNSUPPORTED-DOCVALUES.XML, SOLRCONFIG-MASTER2.XML, BAD-SCHEMA-DYNAMICFIELD-REQUIRED.XML, SCHEMA-REPLICATION2.XML, SCHEMA12.XML, SCHEMA-NOT-REQUIRED-UNIQUE-KEY.XML, KEEP-1.TXT, BAD-CURRENCY.XML, TRIVIAL.UPDATEPROCESSOR0.JS, JASUGGEST.TXT, SCHEMA-FOLDING.XML, BAD-SCHEMA-NON-GLOB-COPYFIELD-SOURCE-MATCHING-NOTHING-SHOULD-FAIL-TEST.XML, SCHEMA-MINIMAL.XML, SCHEMA-ONE-FIELD-NO-DYNAMIC-FIELD.XML, SCHEMA-COLLATE-DV.XML, BAD-SCHEMA-CURRENCY-FT-BOGUS-DEFAULT-CODE.XML, SCHEMA-SPELLCHECKER.XML, BAD_SOLRCONFIG.XML, SOLRCONFIG-SCRIPT-UPDATEPROCESSOR.XML, BAD-SOLRCONFIG-MULTIPLE-INDEXCONFIGS.XML, SOLRCONFIG-TERMINDEX.XML, SOLRCONFIG-TIEREDMERGEPOLICY.XML, BAD-SCHEMA-ANALYZER-CLASS-AND-NESTED.XML, SOLRCONFIG-MINIMAL.XML, SOLRCONFIG-QUERYSENDER.XML, BAD-SCHEMA-CURRENCY-FT-BOGUS-CODE-IN-XML.XML, BAD-SCHEMA-NOT-INDEXED-BUT-POS.XML, SOLRCONFIG-MASTER.XML, SOLRCONFIG-XINCLUDE.XML, SOLRCONFIG-TRANSFORMERS.XML, BAD-SCHEMA-UNIQUEKEY-USES-DEFAULT.XML, BAD-SOLRCONFIG-MISSING-SCRIPTFILE.XML, SCHEMA-BINARYFIELD.XML, STOPTYPES-1.TXT, ADDFIELDS.UPDATEPROCESSOR.JS, BAD-SCHEMA-NONTEXT-ANALYZER.XML, MISSLEADING.EXTENSION.UPDATEPROCESSOR.JS.TXT, SCHEMA-BM25.XML, SCHEMA-ID-AND-VERSION-FIELDS-ONLY.XML, MISSING.FUNCTIONS.UPDATEPROCESSOR.JS, SCHEMA-TFIDF.XML, SCHEMA-REVERSED.XML, SOLRCONFIG-COLLAPSEQPARSER.XML, REGEX-BOOST-PROCESSOR-TEST.TXT, BAD-SCHEMA-CURRENCY-MULTIVALUED.XML, SCHEMA-DOCVALUESMULTI.XML, COMPOUNDDICTIONARY.TXT, FUZZYSUGGEST.TXT, BAD-SCHEMA-OMIT-TF-BUT-NOT-POS.XML, SOLRCONFIG-TLOG.XML, SOLRCONFIG-DELPOLICY2.XML, BAD-SCHEMA-BOGUS-FIELD-PARAMETERS.XML, SCHEMA-PHRASESUGGEST.XML, STOP-2.TXT, BAD-SCHEMA-SIM-GLOBAL-VS-FT-MISMATCH.XML, SCHEMA-REPLICATION1.XML, SCHEMA-SIM.XML, SOLRCONFIG-SOLR-749.XML, XSLT, BAD-SCHEMA-MISPLACED-ASTERISK-COPYFIELD-DEST-SHOULD-FAIL-TEST.XML, SOLRCONFIG-NOOPREGEN.XML, SOLRCONFIG-INFOSTREAM-LOGGING.XML, BAD-SCHEMA-EXTERNAL-FILEFIELD.XML, SOLRCONFIG-PARSING-UPDATE-PROCESSOR-CHAINS.XML, SOLRCONFIG-MANAGED-SCHEMA.XML, CURRENCY.XML, SCHEMA-DFR.XML, STOPWITHBOM.TXT, SOLRCONFIG-ADD-SCHEMA-FIELDS-UPDATE-PROCESSOR-CHAINS.XML, CONDITIONAL.UPDATEPROCESSOR.JS, SOLRCONFIG-FUNCTIONQUERY.XML, BAD-SCHEMA-DYNAMICFIELD-DEFAULT-VAL.XML, SCHEMA-REST-LUCENE-MATCH-VERSION.XML, SOLRCONFIG-DELPOLICY1.XML, SOLRCONFIG_CODEC.XML, STOP-1.TXT, STOPWORDS.TXT, BAD-SOLRCONFIG-MULTIPLE-DIRFACTORY.XML, SOLRCONFIG-UPDATE-PROCESSOR-CHAINS.XML, SOLRCONFIG-SLAVE1.XML, SCHEMA-STOP-KEEP.XML, HYPHENATION.DTD, BAD-SCHEMA-CODEC-GLOBAL-VS-FT-MISMATCH.XML, BAD-SOLRCONFIG-WARMER-NO-REOPEN.XML, SCHEMA-SNIPPET-FIELD.XML, SOLRCONFIG-REQHANDLER.INCL, SCHEMA-NUMERIC.XML, SCHEMA-SWEETSPOT.XML, SCHEMA-COPYFIELD-TEST.XML, BAD-SCHEMA-BOGUS-ANALYSIS-PARAMETERS.XML, BAD-SCHEMA-MULTIPLE-ASTERISK-COPYFIELD-SOURCE-SHOULD-FAIL-TEST.XML, SOLRCONFIG.SNIPPET.RANDOMINDEXCONFIG.XML, BAD-SOLRCONFIG-UNEXPECTED-SCHEMA-ATTRIBUTE.XML, SCHEMA11.XML, SOLRCONFIG-INDEXCONFIG.XML, SOLRCONFIG-MERGEPOLICY-LEGACY.XML, SCHEMA-DOCVALUES.XML, STOP-SNOWBALL.TXT, SOLRCONFIG-SPELLCHECKER.XML, BAD-SCHEMA-UNIQUEKEY-MULTIVALUED.XML, SOLRCONFIG-NOCACHE.XML, DA_UTF8.XML, ENUMSCONFIG.XML, SOLRCONFIG-REPEATER.XML, DA_COMPOUNDDICTIONARY.TXT, BAD-SCHEMA-UNIQUEKEY-IS-COPYFIELD-DEST.XML, SCHEMA-ADD-SCHEMA-FIELDS-UPDATE-PROCESSOR.XML, SOLRCONFIG-DEFAULTS.XML, SOLRCONFIG-WARMER.XML, SOLRCONFIG-HIGHLIGHT.XML, SOLRCONFIG-MASTER1.XML, SCHEMA-SNIPPET-TYPE.XML, SCHEMA-CLASS-NAME-SHORTENING-ON-SERIALIZATION.XML, SOLRCONFIG-MASTER1-KEEPONEBACKUP.XML, BAD-SCHEMA-MISPLACED-ASTERISK-COPYFIELD-SOURCE-SHOULD-FAIL-TEST.XML, SCHEMA15.XML, SCHEMA-ENUMS.XML, SCHEMA-SIMPLEQPPLUGIN.XML, BAD-SCHEMA-CURRENCY-FT-OER-NORATES.XML, SCHEMA-BEHAVIOR.XML, HUNSPELL-TEST.DIC, BAD-SOLRCONFIG-MANAGED-SCHEMA-NAMED-SCHEMA.XML.XML, SCHEMA-ONE-FIELD-NO-DYNAMIC-FIELD-UNIQUE-KEY.XML, BAD-SCHEMA-NOT-INDEXED-BUT-TF.XML, SOLRCONFIG-MASTER3.XML, SCHEMA-XINCLUDE.XML, HUNSPELL-TEST.AFF, FRENCHARTICLES.TXT, SCHEMA-POSTINGSHIGHLIGHT.XML, SOLRCONFIG-SNIPPET-PROCESSOR.XML, PROTWORDS.TXT, MAPPING-ISOLATIN1ACCENT.TXT, SCHEMA-SYNONYM-TOKENIZER.XML, BAD-SCHEMA-DUP-FIELDTYPE.XML, SOLRCONFIG-SPELLCHECKCOMPONENT.XML, SCHEMA_CODEC.XML, SOLRCONFIG_PERF.XML, SOLRCONFIG-LOGMERGEPOLICY.XML, SOLRCONFIG-SLAVE.XML, SOLRCONFIG-TEST-MISC.XML, BAD-SCHEMA-SWEETSPOT-PARTIAL-HYPERBOLIC.XML, BAD-SOLRCONFIG-SCHEMA-MUTABLE-BUT-NOT-MANAGED.XML, SOLRCONFIG-LAZYWRITER.XML, BAD-SCHEMA-CURRENCY-DYNAMIC-MULTIVALUED.XML, SOLRCONFIG-SUGGESTERCOMPONENT.XML]
   [junit4]   2> 51164 T362 oasu.CommitTracker.<init> Hard AutoCommit: disabled
   [junit4]   2> 51165 T362 oasu.CommitTracker.<init> Soft AutoCommit: disabled
   [junit4]   2> 51166 T362 oasu.RandomMergePolicy.<init> RandomMergePolicy wrapping class org.apache.lucene.index.TieredMergePolicy: [TieredMergePolicy: maxMergeAtOnce=14, maxMergeAtOnceExplicit=19, maxMergedSegmentMB=56.1865234375, floorSegmentMB=0.6455078125, forceMergeDeletesPctAllowed=7.732173800717246, segmentsPerTier=22.0, maxCFSSegmentSizeMB=8.796093022207999E12, noCFSRatio=0.6232846189598426
   [junit4]   2> 51167 T362 oasc.SolrDeletionPolicy.onInit SolrDeletionPolicy.onInit: commits: num=1
   [junit4]   2> 		commit{dir=MockDirectoryWrapper(org.apache.lucene.store.RAMDirectory@11b8db54 lockFactory=org.apache.lucene.store.SingleInstanceLockFactory@481fda0b),segFN=segments_1,generation=1}
   [junit4]   2> 51168 T362 oasc.SolrDeletionPolicy.updateCommits newest commit generation = 1
   [junit4]   2> 51169 T362 oass.SolrIndexSearcher.<init> Opening Searcher@e1cb888 main
   [junit4]   2> 51169 T362 oashc.QueryElevationComponent.inform Loading QueryElevation from: /mnt/ssd/jenkins/workspace/Lucene-Solr-4.x-Linux/solr/build/solr-core/test-files/solr/collection1/conf/elevate.xml
   [junit4]   2> 51183 T362 oashc.QueryElevationComponent.inform Loading QueryElevation from: /mnt/ssd/jenkins/workspace/Lucene-Solr-4.x-Linux/solr/build/solr-core/test-files/solr/collection1/conf/elevate.xml
   [junit4]   2> 51198 T363 oasc.SolrCore.registerSearcher [collection1] Registered new searcher Searcher@e1cb888 main{StandardDirectoryReader(segments_1:1:nrt)}
   [junit4]   2> 51201 T362 oasc.CoreContainer.registerCore registering core: collection1
   [junit4]   2> 51201 T316 oass.SolrDispatchFilter.init user.dir=/mnt/ssd/jenkins/workspace/Lucene-Solr-4.x-Linux/solr/build/solr-core/test/J0
   [junit4]   2> 51202 T316 oass.SolrDispatchFilter.init SolrDispatchFilter.init() done
   [junit4]   2> ASYNC  NEW_CORE C103 

[...truncated too long message...]

st.java:222)
   [junit4]    > 	at java.lang.Thread.run(Thread.java:780)
   [junit4]   2> 1098475 T3867 oas.SolrTestCaseJ4.setUp ###Starting testDupeAllFieldsDetection
   [junit4]   2> 1098480 T3867 C1506 oasu.DirectUpdateHandler2.deleteAll [collection1] REMOVING ALL DOCUMENTS FROM INDEX
   [junit4]   2> 1098481 T3867 C1506 oasup.LogUpdateProcessor.finish [collection1] webapp=null path=null params={} {deleteByQuery=*:*} 0 1
   [junit4]   2> 1098487 T3867 C1506 oasu.DirectUpdateHandler2.commit start commit{,optimize=false,openSearcher=true,waitSearcher=true,expungeDeletes=false,softCommit=false,prepareCommit=false}
   [junit4]   2> 1098488 T3867 C1506 oasc.SolrDeletionPolicy.onCommit SolrDeletionPolicy.onCommit: commits: num=2
   [junit4]   2> 		commit{dir=RateLimitedDirectoryWrapper(MockDirectoryWrapper(NRTCachingDirectory(org.apache.lucene.store.RAMDirectory@ec86f065 lockFactory=org.apache.lucene.store.SingleInstanceLockFactory@331bea9; maxCacheMB=0.642578125 maxMergeSizeMB=0.470703125))),segFN=segments_w,generation=32}
   [junit4]   2> 		commit{dir=RateLimitedDirectoryWrapper(MockDirectoryWrapper(NRTCachingDirectory(org.apache.lucene.store.RAMDirectory@ec86f065 lockFactory=org.apache.lucene.store.SingleInstanceLockFactory@331bea9; maxCacheMB=0.642578125 maxMergeSizeMB=0.470703125))),segFN=segments_x,generation=33}
   [junit4]   2> 1098489 T3867 C1506 oasc.SolrDeletionPolicy.updateCommits newest commit generation = 33
   [junit4]   2> 1098490 T3867 C1506 oass.SolrIndexSearcher.<init> Opening Searcher@db276673 main
   [junit4]   2> 1098490 T3867 C1506 oasu.DirectUpdateHandler2.commit end_commit_flush
   [junit4]   2> 1098492 T3869 oasc.SolrCore.registerSearcher [collection1] Registered new searcher Searcher@db276673 main{StandardDirectoryReader(segments_x:146:nrt)}
   [junit4]   2> 1098492 T3867 C1506 oasup.LogUpdateProcessor.finish [collection1] webapp=null path=null params={} {commit=} 0 5
   [junit4]   2> 1098498 T3867 oasu.DirectUpdateHandler2.commit start commit{,optimize=false,openSearcher=true,waitSearcher=true,expungeDeletes=false,softCommit=false,prepareCommit=false}
   [junit4]   2> 1098499 T3867 oasc.SolrDeletionPolicy.onCommit SolrDeletionPolicy.onCommit: commits: num=2
   [junit4]   2> 		commit{dir=RateLimitedDirectoryWrapper(MockDirectoryWrapper(NRTCachingDirectory(org.apache.lucene.store.RAMDirectory@ec86f065 lockFactory=org.apache.lucene.store.SingleInstanceLockFactory@331bea9; maxCacheMB=0.642578125 maxMergeSizeMB=0.470703125))),segFN=segments_x,generation=33}
   [junit4]   2> 		commit{dir=RateLimitedDirectoryWrapper(MockDirectoryWrapper(NRTCachingDirectory(org.apache.lucene.store.RAMDirectory@ec86f065 lockFactory=org.apache.lucene.store.SingleInstanceLockFactory@331bea9; maxCacheMB=0.642578125 maxMergeSizeMB=0.470703125))),segFN=segments_y,generation=34}
   [junit4]   2> 1098500 T3867 oasc.SolrDeletionPolicy.updateCommits newest commit generation = 34
   [junit4]   2> 1098501 T3867 oass.SolrIndexSearcher.<init> Opening Searcher@b0428dae main
   [junit4]   2> 1098502 T3867 oasu.DirectUpdateHandler2.commit end_commit_flush
   [junit4]   2> 1098503 T3869 oasc.SolrCore.registerSearcher [collection1] Registered new searcher Searcher@b0428dae main{StandardDirectoryReader(segments_y:148:nrt _19(4.7):C3)}
   [junit4]   2> 1098504 T3867 oas.SolrTestCaseJ4.tearDown ###Ending testDupeAllFieldsDetection
   [junit4]   2> 1098506 T3867 oas.SolrTestCaseJ4.deleteCore ###deleteCore
   [junit4]   2> 1098506 T3867 oasc.CoreContainer.shutdown Shutting down CoreContainer instance=2037474570
   [junit4]   2> 1098507 T3867 oasc.SolrCore.close [collection1]  CLOSING SolrCore org.apache.solr.core.SolrCore@5ce87f2f
   [junit4]   2> 1098515 T3867 oasu.DirectUpdateHandler2.close closing DirectUpdateHandler2{commits=42,autocommits=0,soft autocommits=0,optimizes=0,rollbacks=0,expungeDeletes=0,docsPending=0,adds=0,deletesById=0,deletesByQuery=0,errors=0,cumulative_adds=253,cumulative_deletesById=0,cumulative_deletesByQuery=6,cumulative_errors=0}
   [junit4]   2> 1098516 T3867 oasu.SolrCoreState.decrefSolrCoreState Closing SolrCoreState
   [junit4]   2> 1098516 T3867 oasu.DefaultSolrCoreState.closeIndexWriter SolrCoreState ref count has reached 0 - closing IndexWriter
   [junit4]   2> 1098517 T3867 oasu.DefaultSolrCoreState.closeIndexWriter closing IndexWriter with IndexWriterCloser
   [junit4]   2> 1098517 T3867 oasc.SolrCore.closeSearcher [collection1] Closing main searcher on request.
   [junit4]   2> 1098518 T3867 oasc.CachingDirectoryFactory.close Closing MockDirectoryFactory - 2 directories currently being tracked
   [junit4]   2> 1098518 T3867 oasc.CachingDirectoryFactory.closeCacheValue looking to close /mnt/ssd/jenkins/workspace/Lucene-Solr-4.x-Linux/solr/build/solr-core/test/J0/./solrtest-SignatureUpdateProcessorFactoryTest-1388344358978/index [CachedDir<<refCount=0;path=/mnt/ssd/jenkins/workspace/Lucene-Solr-4.x-Linux/solr/build/solr-core/test/J0/./solrtest-SignatureUpdateProcessorFactoryTest-1388344358978/index;done=false>>]
   [junit4]   2> 1098519 T3867 oasc.CachingDirectoryFactory.close Closing directory: /mnt/ssd/jenkins/workspace/Lucene-Solr-4.x-Linux/solr/build/solr-core/test/J0/./solrtest-SignatureUpdateProcessorFactoryTest-1388344358978/index
   [junit4]   2> 1098519 T3867 oasc.CachingDirectoryFactory.closeCacheValue looking to close /mnt/ssd/jenkins/workspace/Lucene-Solr-4.x-Linux/solr/build/solr-core/test/J0/./solrtest-SignatureUpdateProcessorFactoryTest-1388344358978 [CachedDir<<refCount=0;path=/mnt/ssd/jenkins/workspace/Lucene-Solr-4.x-Linux/solr/build/solr-core/test/J0/./solrtest-SignatureUpdateProcessorFactoryTest-1388344358978;done=false>>]
   [junit4]   2> 1098520 T3867 oasc.CachingDirectoryFactory.close Closing directory: /mnt/ssd/jenkins/workspace/Lucene-Solr-4.x-Linux/solr/build/solr-core/test/J0/./solrtest-SignatureUpdateProcessorFactoryTest-1388344358978
   [junit4]   2> NOTE: test params are: codec=Lucene41, sim=RandomSimilarityProvider(queryNorm=false,coord=yes): {}, locale=sk, timezone=Africa/Maseru
   [junit4]   2> NOTE: Linux 3.8.0-34-generic x86/IBM Corporation 1.7.0 (32-bit)/cpus=8,threads=1,free=90639232,total=181600256
   [junit4]   2> NOTE: All tests run in this JVM: [LukeRequestHandlerTest, CacheHeaderTest, CopyFieldTest, SystemInfoHandlerTest, ShardRoutingTest, TestDocSet, TestLuceneMatchVersion, DistributedQueryElevationComponentTest, ScriptEngineTest, ReturnFieldsTest, HdfsBasicDistributedZkTest, ShardSplitTest, TestFieldCollectionResource, FastVectorHighlighterTest, UpdateRequestProcessorFactoryTest, DirectUpdateHandlerOptimizeTest, TestJmxMonitoredMap, ClusterStateUpdateTest, OverseerCollectionProcessorTest, TestSolrQueryParserDefaultOperatorResource, AddBlockUpdateTest, MoreLikeThisHandlerTest, CSVRequestHandlerTest, SOLR749Test, TestNoOpRegenerator, WordBreakSolrSpellCheckerTest, TestSolrXMLSerializer, SchemaVersionSpecificBehaviorTest, SolrIndexSplitterTest, TestPHPSerializedResponseWriter, DateMathParserTest, TestImplicitCoreProperties, TestSolrXmlPersistor, TestGroupingSearch, SoftAutoCommitTest, TermsComponentTest, TestSuggestSpellingConverter, TestRandomDVFaceting, BasicDistributedZkTest, BlockCacheTest, TestSolrQueryParserResource, AutoCommitTest, ResponseLogComponentTest, DOMUtilTest, PolyFieldTest, TestCharFilters, TestQueryUtils, TestPostingsSolrHighlighter, BinaryUpdateRequestHandlerTest, DocumentBuilderTest, LegacyHTMLStripCharFilterTest, TestStressUserVersions, ClusterStateTest, SpellPossibilityIteratorTest, SearchHandlerTest, DistributedSuggestComponentTest, TestStressVersions, TestJoin, StatelessScriptUpdateProcessorFactoryTest, SliceStateTest, TestSerializedLuceneMatchVersion, CoreAdminHandlerTest, DistributedQueryComponentCustomSortTest, DistributedTermsComponentTest, TestLFUCache, FieldMutatingUpdateProcessorTest, TestWriterPerf, DocValuesTest, TestTrie, TestDocBasedVersionConstraints, TestFieldTypeResource, TestElisionMultitermQuery, UnloadDistributedZkTest, TestSolrQueryParser, SynonymTokenizerTest, TestSearchPerf, SampleTest, TestSort, LeaderElectionTest, TestManagedSchemaFieldResource, UUIDFieldTest, SyncSliceTest, RecoveryZkTest, TestReplicationHandler, TestDistributedGrouping, TestHashPartitioner, TestMultiCoreConfBootstrap, TestReload, TestRangeQuery, SimpleFacetsTest, QueryElevationComponentTest, ConvertedLegacyTest, TestFunctionQuery, BasicFunctionalityTest, TestBadConfig, TestIndexSearcher, ShowFileRequestHandlerTest, AnalysisAfterCoreReloadTest, SignatureUpdateProcessorFactoryTest]
   [junit4] Completed on J0 in 1.59s, 6 tests, 2 failures <<< FAILURES!

[...truncated 436 lines...]
BUILD FAILED
/mnt/ssd/jenkins/workspace/Lucene-Solr-4.x-Linux/build.xml:459: The following error occurred while executing this line:
/mnt/ssd/jenkins/workspace/Lucene-Solr-4.x-Linux/build.xml:452: The following error occurred while executing this line:
/mnt/ssd/jenkins/workspace/Lucene-Solr-4.x-Linux/build.xml:39: The following error occurred while executing this line:
/mnt/ssd/jenkins/workspace/Lucene-Solr-4.x-Linux/extra-targets.xml:37: The following error occurred while executing this line:
/mnt/ssd/jenkins/workspace/Lucene-Solr-4.x-Linux/solr/build.xml:189: The following error occurred while executing this line:
/mnt/ssd/jenkins/workspace/Lucene-Solr-4.x-Linux/solr/common-build.xml:491: The following error occurred while executing this line:
/mnt/ssd/jenkins/workspace/Lucene-Solr-4.x-Linux/lucene/common-build.xml:1307: The following error occurred while executing this line:
/mnt/ssd/jenkins/workspace/Lucene-Solr-4.x-Linux/lucene/common-build.xml:940: There were test failures: 348 suites, 1519 tests, 1 error, 5 failures, 35 ignored (6 assumptions)

Total time: 47 minutes 53 seconds
Build step 'Invoke Ant' marked build as failure
Description set: Java: 32bit/ibm-j9-jdk7 -Xjit:exclude={org/apache/lucene/util/fst/FST.pack(IIF)Lorg/apache/lucene/util/fst/FST;}
Archiving artifacts
Recording test results
Email was triggered for: Failure
Sending email for trigger: Failure



Mime
View raw message