lucene-dev mailing list archives

Site index · List index
Message view « Date » · « Thread »
Top « Date » · « Thread »
From Policeman Jenkins Server <jenk...@thetaphi.de>
Subject [JENKINS] Lucene-Solr-trunk-MacOSX (64bit/jdk1.7.0) - Build # 1132 - Failure!
Date Wed, 18 Dec 2013 22:42:32 GMT
Build: http://jenkins.thetaphi.de/job/Lucene-Solr-trunk-MacOSX/1132/
Java: 64bit/jdk1.7.0 -XX:+UseCompressedOops -XX:+UseSerialGC

1 tests failed.
REGRESSION:  org.apache.solr.hadoop.MapReduceIndexerToolArgumentParserTest.testArgsParserHelp

Error Message:
Conversion = '๑'

Stack Trace:
java.util.UnknownFormatConversionException: Conversion = '๑'
	at __randomizedtesting.SeedInfo.seed([7333077A99D4102A:EFE1AD0DDEBA7C67]:0)
	at java.util.Formatter.checkText(Formatter.java:2547)
	at java.util.Formatter.parse(Formatter.java:2523)
	at java.util.Formatter.format(Formatter.java:2469)
	at java.io.PrintWriter.format(PrintWriter.java:905)
	at net.sourceforge.argparse4j.helper.TextHelper.printHelp(TextHelper.java:206)
	at net.sourceforge.argparse4j.internal.ArgumentImpl.printHelp(ArgumentImpl.java:247)
	at net.sourceforge.argparse4j.internal.ArgumentParserImpl.printArgumentHelp(ArgumentParserImpl.java:253)
	at net.sourceforge.argparse4j.internal.ArgumentParserImpl.printHelp(ArgumentParserImpl.java:279)
	at org.apache.solr.hadoop.MapReduceIndexerTool$MyArgumentParser$1.run(MapReduceIndexerTool.java:187)
	at net.sourceforge.argparse4j.internal.ArgumentImpl.run(ArgumentImpl.java:425)
	at net.sourceforge.argparse4j.internal.ArgumentParserImpl.processArg(ArgumentParserImpl.java:913)
	at net.sourceforge.argparse4j.internal.ArgumentParserImpl.parseArgs(ArgumentParserImpl.java:810)
	at net.sourceforge.argparse4j.internal.ArgumentParserImpl.parseArgs(ArgumentParserImpl.java:683)
	at net.sourceforge.argparse4j.internal.ArgumentParserImpl.parseArgs(ArgumentParserImpl.java:580)
	at net.sourceforge.argparse4j.internal.ArgumentParserImpl.parseArgs(ArgumentParserImpl.java:573)
	at org.apache.solr.hadoop.MapReduceIndexerTool$MyArgumentParser.parseArgs(MapReduceIndexerTool.java:505)
	at org.apache.solr.hadoop.MapReduceIndexerToolArgumentParserTest.testArgsParserHelp(MapReduceIndexerToolArgumentParserTest.java:194)
	at sun.reflect.NativeMethodAccessorImpl.invoke0(Native Method)
	at sun.reflect.NativeMethodAccessorImpl.invoke(NativeMethodAccessorImpl.java:57)
	at sun.reflect.DelegatingMethodAccessorImpl.invoke(DelegatingMethodAccessorImpl.java:43)
	at java.lang.reflect.Method.invoke(Method.java:606)
	at com.carrotsearch.randomizedtesting.RandomizedRunner.invoke(RandomizedRunner.java:1559)
	at com.carrotsearch.randomizedtesting.RandomizedRunner.access$600(RandomizedRunner.java:79)
	at com.carrotsearch.randomizedtesting.RandomizedRunner$6.evaluate(RandomizedRunner.java:737)
	at com.carrotsearch.randomizedtesting.RandomizedRunner$7.evaluate(RandomizedRunner.java:773)
	at com.carrotsearch.randomizedtesting.RandomizedRunner$8.evaluate(RandomizedRunner.java:787)
	at org.apache.lucene.util.TestRuleSetupTeardownChained$1.evaluate(TestRuleSetupTeardownChained.java:50)
	at org.apache.lucene.util.TestRuleFieldCacheSanity$1.evaluate(TestRuleFieldCacheSanity.java:51)
	at org.apache.lucene.util.AbstractBeforeAfterRule$1.evaluate(AbstractBeforeAfterRule.java:46)
	at com.carrotsearch.randomizedtesting.rules.SystemPropertiesInvariantRule$1.evaluate(SystemPropertiesInvariantRule.java:55)
	at org.apache.lucene.util.TestRuleThreadAndTestName$1.evaluate(TestRuleThreadAndTestName.java:49)
	at org.apache.lucene.util.TestRuleIgnoreAfterMaxFailures$1.evaluate(TestRuleIgnoreAfterMaxFailures.java:70)
	at org.apache.lucene.util.TestRuleMarkFailure$1.evaluate(TestRuleMarkFailure.java:48)
	at com.carrotsearch.randomizedtesting.rules.StatementAdapter.evaluate(StatementAdapter.java:36)
	at com.carrotsearch.randomizedtesting.ThreadLeakControl$StatementRunner.run(ThreadLeakControl.java:358)
	at com.carrotsearch.randomizedtesting.ThreadLeakControl.forkTimeoutingTask(ThreadLeakControl.java:782)
	at com.carrotsearch.randomizedtesting.ThreadLeakControl$3.evaluate(ThreadLeakControl.java:442)
	at com.carrotsearch.randomizedtesting.RandomizedRunner.runSingleTest(RandomizedRunner.java:746)
	at com.carrotsearch.randomizedtesting.RandomizedRunner$3.evaluate(RandomizedRunner.java:648)
	at com.carrotsearch.randomizedtesting.RandomizedRunner$4.evaluate(RandomizedRunner.java:682)
	at com.carrotsearch.randomizedtesting.RandomizedRunner$5.evaluate(RandomizedRunner.java:693)
	at org.apache.lucene.util.AbstractBeforeAfterRule$1.evaluate(AbstractBeforeAfterRule.java:46)
	at org.apache.lucene.util.TestRuleStoreClassName$1.evaluate(TestRuleStoreClassName.java:42)
	at com.carrotsearch.randomizedtesting.rules.SystemPropertiesInvariantRule$1.evaluate(SystemPropertiesInvariantRule.java:55)
	at com.carrotsearch.randomizedtesting.rules.NoShadowingOrOverridesOnMethodsRule$1.evaluate(NoShadowingOrOverridesOnMethodsRule.java:39)
	at com.carrotsearch.randomizedtesting.rules.NoShadowingOrOverridesOnMethodsRule$1.evaluate(NoShadowingOrOverridesOnMethodsRule.java:39)
	at com.carrotsearch.randomizedtesting.rules.StatementAdapter.evaluate(StatementAdapter.java:36)
	at org.apache.lucene.util.TestRuleAssertionsRequired$1.evaluate(TestRuleAssertionsRequired.java:43)
	at org.apache.lucene.util.TestRuleMarkFailure$1.evaluate(TestRuleMarkFailure.java:48)
	at org.apache.lucene.util.TestRuleIgnoreAfterMaxFailures$1.evaluate(TestRuleIgnoreAfterMaxFailures.java:70)
	at org.apache.lucene.util.TestRuleIgnoreTestSuites$1.evaluate(TestRuleIgnoreTestSuites.java:55)
	at com.carrotsearch.randomizedtesting.rules.StatementAdapter.evaluate(StatementAdapter.java:36)
	at com.carrotsearch.randomizedtesting.ThreadLeakControl$StatementRunner.run(ThreadLeakControl.java:358)
	at java.lang.Thread.run(Thread.java:744)




Build Log:
[...truncated 16957 lines...]
   [junit4] Suite: org.apache.solr.hadoop.MapReduceIndexerToolArgumentParserTest
   [junit4]   2> NOTE: reproduce with: ant test  -Dtestcase=MapReduceIndexerToolArgumentParserTest
-Dtests.method=testArgsParserHelp -Dtests.seed=7333077A99D4102A -Dtests.slow=true -Dtests.locale=th_TH_TH_#u-nu-thai
-Dtests.timezone=Pacific/Saipan -Dtests.file.encoding=US-ASCII
   [junit4] ERROR   0.36s | MapReduceIndexerToolArgumentParserTest.testArgsParserHelp <<<
   [junit4]    > Throwable #1: java.util.UnknownFormatConversionException: Conversion =
'๑'
   [junit4]    > 	at __randomizedtesting.SeedInfo.seed([7333077A99D4102A:EFE1AD0DDEBA7C67]:0)
   [junit4]    > 	at java.util.Formatter.checkText(Formatter.java:2547)
   [junit4]    > 	at java.util.Formatter.parse(Formatter.java:2523)
   [junit4]    > 	at java.util.Formatter.format(Formatter.java:2469)
   [junit4]    > 	at java.io.PrintWriter.format(PrintWriter.java:905)
   [junit4]    > 	at net.sourceforge.argparse4j.helper.TextHelper.printHelp(TextHelper.java:206)
   [junit4]    > 	at net.sourceforge.argparse4j.internal.ArgumentImpl.printHelp(ArgumentImpl.java:247)
   [junit4]    > 	at net.sourceforge.argparse4j.internal.ArgumentParserImpl.printArgumentHelp(ArgumentParserImpl.java:253)
   [junit4]    > 	at net.sourceforge.argparse4j.internal.ArgumentParserImpl.printHelp(ArgumentParserImpl.java:279)
   [junit4]    > 	at org.apache.solr.hadoop.MapReduceIndexerTool$MyArgumentParser$1.run(MapReduceIndexerTool.java:187)
   [junit4]    > 	at net.sourceforge.argparse4j.internal.ArgumentImpl.run(ArgumentImpl.java:425)
   [junit4]    > 	at net.sourceforge.argparse4j.internal.ArgumentParserImpl.processArg(ArgumentParserImpl.java:913)
   [junit4]    > 	at net.sourceforge.argparse4j.internal.ArgumentParserImpl.parseArgs(ArgumentParserImpl.java:810)
   [junit4]    > 	at net.sourceforge.argparse4j.internal.ArgumentParserImpl.parseArgs(ArgumentParserImpl.java:683)
   [junit4]    > 	at net.sourceforge.argparse4j.internal.ArgumentParserImpl.parseArgs(ArgumentParserImpl.java:580)
   [junit4]    > 	at net.sourceforge.argparse4j.internal.ArgumentParserImpl.parseArgs(ArgumentParserImpl.java:573)
   [junit4]    > 	at org.apache.solr.hadoop.MapReduceIndexerTool$MyArgumentParser.parseArgs(MapReduceIndexerTool.java:505)
   [junit4]    > 	at org.apache.solr.hadoop.MapReduceIndexerToolArgumentParserTest.testArgsParserHelp(MapReduceIndexerToolArgumentParserTest.java:194)
   [junit4]    > 	at java.lang.Thread.run(Thread.java:744)
   [junit4]   2> NOTE: test params are: codec=Lucene46: {}, docValues:{}, sim=RandomSimilarityProvider(queryNorm=false,coord=crazy):
{}, locale=th_TH_TH_#u-nu-thai, timezone=Pacific/Saipan
   [junit4]   2> NOTE: Mac OS X 10.8.5 x86_64/Oracle Corporation 1.7.0_45 (64-bit)/cpus=2,threads=1,free=39003768,total=87699456
   [junit4]   2> NOTE: All tests run in this JVM: [MorphlineReducerTest, MorphlineBasicMiniMRTest,
MorphlineMapperTest, MapReduceIndexerToolArgumentParserTest]
   [junit4] Completed in 11.07s, 24 tests, 1 error <<< FAILURES!

[...truncated 4 lines...]
   [junit4] JVM J0: stderr was not empty, see: /Users/jenkins/workspace/Lucene-Solr-trunk-MacOSX/solr/build/contrib/solr-map-reduce/test/temp/junit4-J0-20131218_224106_971.syserr
   [junit4] >>> JVM J0: stderr (verbatim) ----
   [junit4] 2013-12-18 22:41:50.760 java[242:5e0b] Unable to load realm info from SCDynamicStore
   [junit4] <<< JVM J0: EOF ----

[...truncated 8 lines...]
BUILD FAILED
/Users/jenkins/workspace/Lucene-Solr-trunk-MacOSX/build.xml:453: The following error occurred
while executing this line:
/Users/jenkins/workspace/Lucene-Solr-trunk-MacOSX/build.xml:433: The following error occurred
while executing this line:
/Users/jenkins/workspace/Lucene-Solr-trunk-MacOSX/build.xml:39: The following error occurred
while executing this line:
/Users/jenkins/workspace/Lucene-Solr-trunk-MacOSX/extra-targets.xml:37: The following error
occurred while executing this line:
/Users/jenkins/workspace/Lucene-Solr-trunk-MacOSX/solr/build.xml:209: The following error
occurred while executing this line:
/Users/jenkins/workspace/Lucene-Solr-trunk-MacOSX/solr/common-build.xml:441: The following
error occurred while executing this line:
/Users/jenkins/workspace/Lucene-Solr-trunk-MacOSX/solr/common-build.xml:491: The following
error occurred while executing this line:
/Users/jenkins/workspace/Lucene-Solr-trunk-MacOSX/lucene/common-build.xml:1304: The following
error occurred while executing this line:
/Users/jenkins/workspace/Lucene-Solr-trunk-MacOSX/lucene/common-build.xml:937: There were
test failures: 7 suites, 35 tests, 1 error, 5 ignored

Total time: 96 minutes 31 seconds
Build step 'Invoke Ant' marked build as failure
Description set: Java: 64bit/jdk1.7.0 -XX:+UseCompressedOops -XX:+UseSerialGC
Archiving artifacts
Recording test results
Email was triggered for: Failure
Sending email for trigger: Failure



Mime
View raw message