lucene-dev mailing list archives

Site index · List index
Message view « Date » · « Thread »
Top « Date » · « Thread »
From Apache Jenkins Server <jenk...@builds.apache.org>
Subject [JENKINS] Lucene-Solr-Tests-trunk-Java7 - Build # 4553 - Still Failing
Date Sat, 28 Dec 2013 11:32:33 GMT
Build: https://builds.apache.org/job/Lucene-Solr-Tests-trunk-Java7/4553/

6 tests failed.
REGRESSION:  org.apache.solr.analytics.expression.ExpressionTest.multiplyTest

Error Message:
Caught exception in getStatResult, xPath = /response/lst[@name='stats']/lst[@name='mr']/double[@name='sum']  raw data: <?xml version="1.0" encoding="UTF-8"?> <response>  <lst name="responseHeader">   <int name="status">0</int>   <int name="QTime">524</int> </lst> <result name="response" numFound="100" start="0"> </result> <lst name="stats">   <lst name="stats_fields"/> </lst> <lst name="stats">   <lst name="cdr">     <date name="cd1">1800-12-31T23:59:59Z</date>     <date name="cd2">1804-06-30T23:59:59Z</date>     <str name="cs1">1800-12-31T23:59:59Z</str>     <str name="cs2">1804-06-30T23:59:59Z</str>   </lst>   <lst name="dmr">     <str name="cma">+2MONTHS</str>     <str name="cme">+2YEARS</str>     <date name="dmma">1812-02-29T23:59:59Z</date>     <date name="dmme">1807-12-31T23:59:59Z</date>     <date name="max">1811-12-31T23:59:59Z</date>     <date name="median">1805-12-31T23:59:59Z</date>   </lst>   <lst name="ar">     <long name="count">100</long>     <null name="mcm"/>     <null name="mean"/>     <null name="median"/>     <null name="su"/>     <null name="sum"/>     <null name="unique"/>   </lst>   <lst name="pr">     <long name="count">100</long>     <null name="mc"/>     <null name="mean"/>     <null name="su"/>     <null name="sum"/>     <null name="unique"/>   </lst>   <lst name="cr">     <str name="ccmax">this is the secondstr9</str>     <str name="ccmin">this is the firststr0</str>     <str name="csmax">this is the second</str>     <str name="csmin">this is the first</str>     <str name="max">str9</str>     <str name="min">str0</str>   </lst>   <lst name="cnr">     <double name="c10">10.0</double>     <double name="c8">8.0</double>   </lst>   <lst name="mr">     <long name="count">100</long>     <null name="mcm"/>     <null name="mean"/>     <null name="median"/>     <null name="su"/>     <null name="sum"/>     <null name="unique"/>   </lst>   <lst name="avr">     <double name="c">100.0</double>     <long name="count">100</long>     <null name="s"/>     <null name="sum"/>   </lst>   <lst name="csr">     <str name="cs1">this is the first</str>     <str name="cs2">this is the second</str>     <str name="cs3">this is the third</str>   </lst>   <lst name="nr">     <double name="c">-100.0</double>     <long name="count">100</long>     <null name="s"/>     <null name="sum"/>   </lst>   <lst name="dr">     <long name="count">100</long>     <null name="mc"/>     <null name="mean"/>     <null name="su"/>     <null name="sum"/>     <null name="unique"/>   </lst>   <lst name="rr">     <str name="max">str9</str>     <str name="min">str0</str>     <str name="rmax">9rts</str>     <str name="rmin">0rts</str>   </lst> </lst> </response> 

Stack Trace:
java.lang.AssertionError: Caught exception in getStatResult, xPath = /response/lst[@name='stats']/lst[@name='mr']/double[@name='sum'] 
raw data: <?xml version="1.0" encoding="UTF-8"?>
<response>

<lst name="responseHeader">
  <int name="status">0</int>
  <int name="QTime">524</int>
</lst>
<result name="response" numFound="100" start="0">
</result>
<lst name="stats">
  <lst name="stats_fields"/>
</lst>
<lst name="stats">
  <lst name="cdr">
    <date name="cd1">1800-12-31T23:59:59Z</date>
    <date name="cd2">1804-06-30T23:59:59Z</date>
    <str name="cs1">1800-12-31T23:59:59Z</str>
    <str name="cs2">1804-06-30T23:59:59Z</str>
  </lst>
  <lst name="dmr">
    <str name="cma">+2MONTHS</str>
    <str name="cme">+2YEARS</str>
    <date name="dmma">1812-02-29T23:59:59Z</date>
    <date name="dmme">1807-12-31T23:59:59Z</date>
    <date name="max">1811-12-31T23:59:59Z</date>
    <date name="median">1805-12-31T23:59:59Z</date>
  </lst>
  <lst name="ar">
    <long name="count">100</long>
    <null name="mcm"/>
    <null name="mean"/>
    <null name="median"/>
    <null name="su"/>
    <null name="sum"/>
    <null name="unique"/>
  </lst>
  <lst name="pr">
    <long name="count">100</long>
    <null name="mc"/>
    <null name="mean"/>
    <null name="su"/>
    <null name="sum"/>
    <null name="unique"/>
  </lst>
  <lst name="cr">
    <str name="ccmax">this is the secondstr9</str>
    <str name="ccmin">this is the firststr0</str>
    <str name="csmax">this is the second</str>
    <str name="csmin">this is the first</str>
    <str name="max">str9</str>
    <str name="min">str0</str>
  </lst>
  <lst name="cnr">
    <double name="c10">10.0</double>
    <double name="c8">8.0</double>
  </lst>
  <lst name="mr">
    <long name="count">100</long>
    <null name="mcm"/>
    <null name="mean"/>
    <null name="median"/>
    <null name="su"/>
    <null name="sum"/>
    <null name="unique"/>
  </lst>
  <lst name="avr">
    <double name="c">100.0</double>
    <long name="count">100</long>
    <null name="s"/>
    <null name="sum"/>
  </lst>
  <lst name="csr">
    <str name="cs1">this is the first</str>
    <str name="cs2">this is the second</str>
    <str name="cs3">this is the third</str>
  </lst>
  <lst name="nr">
    <double name="c">-100.0</double>
    <long name="count">100</long>
    <null name="s"/>
    <null name="sum"/>
  </lst>
  <lst name="dr">
    <long name="count">100</long>
    <null name="mc"/>
    <null name="mean"/>
    <null name="su"/>
    <null name="sum"/>
    <null name="unique"/>
  </lst>
  <lst name="rr">
    <str name="max">str9</str>
    <str name="min">str0</str>
    <str name="rmax">9rts</str>
    <str name="rmin">0rts</str>
  </lst>
</lst>
</response>

	at __randomizedtesting.SeedInfo.seed([6711B52A90E8F007:C90AB54A5E6C669]:0)
	at org.junit.Assert.fail(Assert.java:93)
	at org.apache.solr.analytics.AbstractAnalyticsStatsTest.getStatResult(AbstractAnalyticsStatsTest.java:113)
	at org.apache.solr.analytics.expression.ExpressionTest.multiplyTest(ExpressionTest.java:92)
	at sun.reflect.NativeMethodAccessorImpl.invoke0(Native Method)
	at sun.reflect.NativeMethodAccessorImpl.invoke(NativeMethodAccessorImpl.java:57)
	at sun.reflect.DelegatingMethodAccessorImpl.invoke(DelegatingMethodAccessorImpl.java:43)
	at java.lang.reflect.Method.invoke(Method.java:606)
	at com.carrotsearch.randomizedtesting.RandomizedRunner.invoke(RandomizedRunner.java:1559)
	at com.carrotsearch.randomizedtesting.RandomizedRunner.access$600(RandomizedRunner.java:79)
	at com.carrotsearch.randomizedtesting.RandomizedRunner$6.evaluate(RandomizedRunner.java:737)
	at com.carrotsearch.randomizedtesting.RandomizedRunner$7.evaluate(RandomizedRunner.java:773)
	at com.carrotsearch.randomizedtesting.RandomizedRunner$8.evaluate(RandomizedRunner.java:787)
	at com.carrotsearch.randomizedtesting.rules.SystemPropertiesRestoreRule$1.evaluate(SystemPropertiesRestoreRule.java:53)
	at org.apache.lucene.util.TestRuleSetupTeardownChained$1.evaluate(TestRuleSetupTeardownChained.java:50)
	at org.apache.lucene.util.TestRuleFieldCacheSanity$1.evaluate(TestRuleFieldCacheSanity.java:51)
	at org.apache.lucene.util.AbstractBeforeAfterRule$1.evaluate(AbstractBeforeAfterRule.java:46)
	at com.carrotsearch.randomizedtesting.rules.SystemPropertiesInvariantRule$1.evaluate(SystemPropertiesInvariantRule.java:55)
	at org.apache.lucene.util.TestRuleThreadAndTestName$1.evaluate(TestRuleThreadAndTestName.java:49)
	at org.apache.lucene.util.TestRuleIgnoreAfterMaxFailures$1.evaluate(TestRuleIgnoreAfterMaxFailures.java:70)
	at org.apache.lucene.util.TestRuleMarkFailure$1.evaluate(TestRuleMarkFailure.java:48)
	at com.carrotsearch.randomizedtesting.rules.StatementAdapter.evaluate(StatementAdapter.java:36)
	at com.carrotsearch.randomizedtesting.ThreadLeakControl$StatementRunner.run(ThreadLeakControl.java:358)
	at com.carrotsearch.randomizedtesting.ThreadLeakControl.forkTimeoutingTask(ThreadLeakControl.java:782)
	at com.carrotsearch.randomizedtesting.ThreadLeakControl$3.evaluate(ThreadLeakControl.java:442)
	at com.carrotsearch.randomizedtesting.RandomizedRunner.runSingleTest(RandomizedRunner.java:746)
	at com.carrotsearch.randomizedtesting.RandomizedRunner$3.evaluate(RandomizedRunner.java:648)
	at com.carrotsearch.randomizedtesting.RandomizedRunner$4.evaluate(RandomizedRunner.java:682)
	at com.carrotsearch.randomizedtesting.RandomizedRunner$5.evaluate(RandomizedRunner.java:693)
	at com.carrotsearch.randomizedtesting.rules.StatementAdapter.evaluate(StatementAdapter.java:36)
	at com.carrotsearch.randomizedtesting.rules.SystemPropertiesRestoreRule$1.evaluate(SystemPropertiesRestoreRule.java:53)
	at org.apache.lucene.util.AbstractBeforeAfterRule$1.evaluate(AbstractBeforeAfterRule.java:46)
	at org.apache.lucene.util.TestRuleStoreClassName$1.evaluate(TestRuleStoreClassName.java:42)
	at com.carrotsearch.randomizedtesting.rules.SystemPropertiesInvariantRule$1.evaluate(SystemPropertiesInvariantRule.java:55)
	at com.carrotsearch.randomizedtesting.rules.NoShadowingOrOverridesOnMethodsRule$1.evaluate(NoShadowingOrOverridesOnMethodsRule.java:39)
	at com.carrotsearch.randomizedtesting.rules.NoShadowingOrOverridesOnMethodsRule$1.evaluate(NoShadowingOrOverridesOnMethodsRule.java:39)
	at com.carrotsearch.randomizedtesting.rules.StatementAdapter.evaluate(StatementAdapter.java:36)
	at org.apache.lucene.util.TestRuleAssertionsRequired$1.evaluate(TestRuleAssertionsRequired.java:43)
	at org.apache.lucene.util.TestRuleMarkFailure$1.evaluate(TestRuleMarkFailure.java:48)
	at org.apache.lucene.util.TestRuleIgnoreAfterMaxFailures$1.evaluate(TestRuleIgnoreAfterMaxFailures.java:70)
	at org.apache.lucene.util.TestRuleIgnoreTestSuites$1.evaluate(TestRuleIgnoreTestSuites.java:55)
	at com.carrotsearch.randomizedtesting.rules.StatementAdapter.evaluate(StatementAdapter.java:36)
	at com.carrotsearch.randomizedtesting.ThreadLeakControl$StatementRunner.run(ThreadLeakControl.java:358)
	at java.lang.Thread.run(Thread.java:724)


REGRESSION:  org.apache.solr.analytics.expression.ExpressionTest.divideTest

Error Message:
Caught exception in getStatResult, xPath = /response/lst[@name='stats']/lst[@name='dr']/double[@name='sum']  raw data: <?xml version="1.0" encoding="UTF-8"?> <response>  <lst name="responseHeader">   <int name="status">0</int>   <int name="QTime">524</int> </lst> <result name="response" numFound="100" start="0"> </result> <lst name="stats">   <lst name="stats_fields"/> </lst> <lst name="stats">   <lst name="cdr">     <date name="cd1">1800-12-31T23:59:59Z</date>     <date name="cd2">1804-06-30T23:59:59Z</date>     <str name="cs1">1800-12-31T23:59:59Z</str>     <str name="cs2">1804-06-30T23:59:59Z</str>   </lst>   <lst name="dmr">     <str name="cma">+2MONTHS</str>     <str name="cme">+2YEARS</str>     <date name="dmma">1812-02-29T23:59:59Z</date>     <date name="dmme">1807-12-31T23:59:59Z</date>     <date name="max">1811-12-31T23:59:59Z</date>     <date name="median">1805-12-31T23:59:59Z</date>   </lst>   <lst name="ar">     <long name="count">100</long>     <null name="mcm"/>     <null name="mean"/>     <null name="median"/>     <null name="su"/>     <null name="sum"/>     <null name="unique"/>   </lst>   <lst name="pr">     <long name="count">100</long>     <null name="mc"/>     <null name="mean"/>     <null name="su"/>     <null name="sum"/>     <null name="unique"/>   </lst>   <lst name="cr">     <str name="ccmax">this is the secondstr9</str>     <str name="ccmin">this is the firststr0</str>     <str name="csmax">this is the second</str>     <str name="csmin">this is the first</str>     <str name="max">str9</str>     <str name="min">str0</str>   </lst>   <lst name="cnr">     <double name="c10">10.0</double>     <double name="c8">8.0</double>   </lst>   <lst name="mr">     <long name="count">100</long>     <null name="mcm"/>     <null name="mean"/>     <null name="median"/>     <null name="su"/>     <null name="sum"/>     <null name="unique"/>   </lst>   <lst name="avr">     <double name="c">100.0</double>     <long name="count">100</long>     <null name="s"/>     <null name="sum"/>   </lst>   <lst name="csr">     <str name="cs1">this is the first</str>     <str name="cs2">this is the second</str>     <str name="cs3">this is the third</str>   </lst>   <lst name="nr">     <double name="c">-100.0</double>     <long name="count">100</long>     <null name="s"/>     <null name="sum"/>   </lst>   <lst name="dr">     <long name="count">100</long>     <null name="mc"/>     <null name="mean"/>     <null name="su"/>     <null name="sum"/>     <null name="unique"/>   </lst>   <lst name="rr">     <str name="max">str9</str>     <str name="min">str0</str>     <str name="rmax">9rts</str>     <str name="rmin">0rts</str>   </lst> </lst> </response> 

Stack Trace:
java.lang.AssertionError: Caught exception in getStatResult, xPath = /response/lst[@name='stats']/lst[@name='dr']/double[@name='sum'] 
raw data: <?xml version="1.0" encoding="UTF-8"?>
<response>

<lst name="responseHeader">
  <int name="status">0</int>
  <int name="QTime">524</int>
</lst>
<result name="response" numFound="100" start="0">
</result>
<lst name="stats">
  <lst name="stats_fields"/>
</lst>
<lst name="stats">
  <lst name="cdr">
    <date name="cd1">1800-12-31T23:59:59Z</date>
    <date name="cd2">1804-06-30T23:59:59Z</date>
    <str name="cs1">1800-12-31T23:59:59Z</str>
    <str name="cs2">1804-06-30T23:59:59Z</str>
  </lst>
  <lst name="dmr">
    <str name="cma">+2MONTHS</str>
    <str name="cme">+2YEARS</str>
    <date name="dmma">1812-02-29T23:59:59Z</date>
    <date name="dmme">1807-12-31T23:59:59Z</date>
    <date name="max">1811-12-31T23:59:59Z</date>
    <date name="median">1805-12-31T23:59:59Z</date>
  </lst>
  <lst name="ar">
    <long name="count">100</long>
    <null name="mcm"/>
    <null name="mean"/>
    <null name="median"/>
    <null name="su"/>
    <null name="sum"/>
    <null name="unique"/>
  </lst>
  <lst name="pr">
    <long name="count">100</long>
    <null name="mc"/>
    <null name="mean"/>
    <null name="su"/>
    <null name="sum"/>
    <null name="unique"/>
  </lst>
  <lst name="cr">
    <str name="ccmax">this is the secondstr9</str>
    <str name="ccmin">this is the firststr0</str>
    <str name="csmax">this is the second</str>
    <str name="csmin">this is the first</str>
    <str name="max">str9</str>
    <str name="min">str0</str>
  </lst>
  <lst name="cnr">
    <double name="c10">10.0</double>
    <double name="c8">8.0</double>
  </lst>
  <lst name="mr">
    <long name="count">100</long>
    <null name="mcm"/>
    <null name="mean"/>
    <null name="median"/>
    <null name="su"/>
    <null name="sum"/>
    <null name="unique"/>
  </lst>
  <lst name="avr">
    <double name="c">100.0</double>
    <long name="count">100</long>
    <null name="s"/>
    <null name="sum"/>
  </lst>
  <lst name="csr">
    <str name="cs1">this is the first</str>
    <str name="cs2">this is the second</str>
    <str name="cs3">this is the third</str>
  </lst>
  <lst name="nr">
    <double name="c">-100.0</double>
    <long name="count">100</long>
    <null name="s"/>
    <null name="sum"/>
  </lst>
  <lst name="dr">
    <long name="count">100</long>
    <null name="mc"/>
    <null name="mean"/>
    <null name="su"/>
    <null name="sum"/>
    <null name="unique"/>
  </lst>
  <lst name="rr">
    <str name="max">str9</str>
    <str name="min">str0</str>
    <str name="rmax">9rts</str>
    <str name="rmin">0rts</str>
  </lst>
</lst>
</response>

	at __randomizedtesting.SeedInfo.seed([6711B52A90E8F007:3F1C5EDCB42A92D1]:0)
	at org.junit.Assert.fail(Assert.java:93)
	at org.apache.solr.analytics.AbstractAnalyticsStatsTest.getStatResult(AbstractAnalyticsStatsTest.java:113)
	at org.apache.solr.analytics.expression.ExpressionTest.divideTest(ExpressionTest.java:106)
	at sun.reflect.NativeMethodAccessorImpl.invoke0(Native Method)
	at sun.reflect.NativeMethodAccessorImpl.invoke(NativeMethodAccessorImpl.java:57)
	at sun.reflect.DelegatingMethodAccessorImpl.invoke(DelegatingMethodAccessorImpl.java:43)
	at java.lang.reflect.Method.invoke(Method.java:606)
	at com.carrotsearch.randomizedtesting.RandomizedRunner.invoke(RandomizedRunner.java:1559)
	at com.carrotsearch.randomizedtesting.RandomizedRunner.access$600(RandomizedRunner.java:79)
	at com.carrotsearch.randomizedtesting.RandomizedRunner$6.evaluate(RandomizedRunner.java:737)
	at com.carrotsearch.randomizedtesting.RandomizedRunner$7.evaluate(RandomizedRunner.java:773)
	at com.carrotsearch.randomizedtesting.RandomizedRunner$8.evaluate(RandomizedRunner.java:787)
	at com.carrotsearch.randomizedtesting.rules.SystemPropertiesRestoreRule$1.evaluate(SystemPropertiesRestoreRule.java:53)
	at org.apache.lucene.util.TestRuleSetupTeardownChained$1.evaluate(TestRuleSetupTeardownChained.java:50)
	at org.apache.lucene.util.TestRuleFieldCacheSanity$1.evaluate(TestRuleFieldCacheSanity.java:51)
	at org.apache.lucene.util.AbstractBeforeAfterRule$1.evaluate(AbstractBeforeAfterRule.java:46)
	at com.carrotsearch.randomizedtesting.rules.SystemPropertiesInvariantRule$1.evaluate(SystemPropertiesInvariantRule.java:55)
	at org.apache.lucene.util.TestRuleThreadAndTestName$1.evaluate(TestRuleThreadAndTestName.java:49)
	at org.apache.lucene.util.TestRuleIgnoreAfterMaxFailures$1.evaluate(TestRuleIgnoreAfterMaxFailures.java:70)
	at org.apache.lucene.util.TestRuleMarkFailure$1.evaluate(TestRuleMarkFailure.java:48)
	at com.carrotsearch.randomizedtesting.rules.StatementAdapter.evaluate(StatementAdapter.java:36)
	at com.carrotsearch.randomizedtesting.ThreadLeakControl$StatementRunner.run(ThreadLeakControl.java:358)
	at com.carrotsearch.randomizedtesting.ThreadLeakControl.forkTimeoutingTask(ThreadLeakControl.java:782)
	at com.carrotsearch.randomizedtesting.ThreadLeakControl$3.evaluate(ThreadLeakControl.java:442)
	at com.carrotsearch.randomizedtesting.RandomizedRunner.runSingleTest(RandomizedRunner.java:746)
	at com.carrotsearch.randomizedtesting.RandomizedRunner$3.evaluate(RandomizedRunner.java:648)
	at com.carrotsearch.randomizedtesting.RandomizedRunner$4.evaluate(RandomizedRunner.java:682)
	at com.carrotsearch.randomizedtesting.RandomizedRunner$5.evaluate(RandomizedRunner.java:693)
	at com.carrotsearch.randomizedtesting.rules.StatementAdapter.evaluate(StatementAdapter.java:36)
	at com.carrotsearch.randomizedtesting.rules.SystemPropertiesRestoreRule$1.evaluate(SystemPropertiesRestoreRule.java:53)
	at org.apache.lucene.util.AbstractBeforeAfterRule$1.evaluate(AbstractBeforeAfterRule.java:46)
	at org.apache.lucene.util.TestRuleStoreClassName$1.evaluate(TestRuleStoreClassName.java:42)
	at com.carrotsearch.randomizedtesting.rules.SystemPropertiesInvariantRule$1.evaluate(SystemPropertiesInvariantRule.java:55)
	at com.carrotsearch.randomizedtesting.rules.NoShadowingOrOverridesOnMethodsRule$1.evaluate(NoShadowingOrOverridesOnMethodsRule.java:39)
	at com.carrotsearch.randomizedtesting.rules.NoShadowingOrOverridesOnMethodsRule$1.evaluate(NoShadowingOrOverridesOnMethodsRule.java:39)
	at com.carrotsearch.randomizedtesting.rules.StatementAdapter.evaluate(StatementAdapter.java:36)
	at org.apache.lucene.util.TestRuleAssertionsRequired$1.evaluate(TestRuleAssertionsRequired.java:43)
	at org.apache.lucene.util.TestRuleMarkFailure$1.evaluate(TestRuleMarkFailure.java:48)
	at org.apache.lucene.util.TestRuleIgnoreAfterMaxFailures$1.evaluate(TestRuleIgnoreAfterMaxFailures.java:70)
	at org.apache.lucene.util.TestRuleIgnoreTestSuites$1.evaluate(TestRuleIgnoreTestSuites.java:55)
	at com.carrotsearch.randomizedtesting.rules.StatementAdapter.evaluate(StatementAdapter.java:36)
	at com.carrotsearch.randomizedtesting.ThreadLeakControl$StatementRunner.run(ThreadLeakControl.java:358)
	at java.lang.Thread.run(Thread.java:724)


REGRESSION:  org.apache.solr.analytics.expression.ExpressionTest.powerTest

Error Message:
Caught exception in getStatResult, xPath = /response/lst[@name='stats']/lst[@name='pr']/double[@name='sum']  raw data: <?xml version="1.0" encoding="UTF-8"?> <response>  <lst name="responseHeader">   <int name="status">0</int>   <int name="QTime">524</int> </lst> <result name="response" numFound="100" start="0"> </result> <lst name="stats">   <lst name="stats_fields"/> </lst> <lst name="stats">   <lst name="cdr">     <date name="cd1">1800-12-31T23:59:59Z</date>     <date name="cd2">1804-06-30T23:59:59Z</date>     <str name="cs1">1800-12-31T23:59:59Z</str>     <str name="cs2">1804-06-30T23:59:59Z</str>   </lst>   <lst name="dmr">     <str name="cma">+2MONTHS</str>     <str name="cme">+2YEARS</str>     <date name="dmma">1812-02-29T23:59:59Z</date>     <date name="dmme">1807-12-31T23:59:59Z</date>     <date name="max">1811-12-31T23:59:59Z</date>     <date name="median">1805-12-31T23:59:59Z</date>   </lst>   <lst name="ar">     <long name="count">100</long>     <null name="mcm"/>     <null name="mean"/>     <null name="median"/>     <null name="su"/>     <null name="sum"/>     <null name="unique"/>   </lst>   <lst name="pr">     <long name="count">100</long>     <null name="mc"/>     <null name="mean"/>     <null name="su"/>     <null name="sum"/>     <null name="unique"/>   </lst>   <lst name="cr">     <str name="ccmax">this is the secondstr9</str>     <str name="ccmin">this is the firststr0</str>     <str name="csmax">this is the second</str>     <str name="csmin">this is the first</str>     <str name="max">str9</str>     <str name="min">str0</str>   </lst>   <lst name="cnr">     <double name="c10">10.0</double>     <double name="c8">8.0</double>   </lst>   <lst name="mr">     <long name="count">100</long>     <null name="mcm"/>     <null name="mean"/>     <null name="median"/>     <null name="su"/>     <null name="sum"/>     <null name="unique"/>   </lst>   <lst name="avr">     <double name="c">100.0</double>     <long name="count">100</long>     <null name="s"/>     <null name="sum"/>   </lst>   <lst name="csr">     <str name="cs1">this is the first</str>     <str name="cs2">this is the second</str>     <str name="cs3">this is the third</str>   </lst>   <lst name="nr">     <double name="c">-100.0</double>     <long name="count">100</long>     <null name="s"/>     <null name="sum"/>   </lst>   <lst name="dr">     <long name="count">100</long>     <null name="mc"/>     <null name="mean"/>     <null name="su"/>     <null name="sum"/>     <null name="unique"/>   </lst>   <lst name="rr">     <str name="max">str9</str>     <str name="min">str0</str>     <str name="rmax">9rts</str>     <str name="rmin">0rts</str>   </lst> </lst> </response> 

Stack Trace:
java.lang.AssertionError: Caught exception in getStatResult, xPath = /response/lst[@name='stats']/lst[@name='pr']/double[@name='sum'] 
raw data: <?xml version="1.0" encoding="UTF-8"?>
<response>

<lst name="responseHeader">
  <int name="status">0</int>
  <int name="QTime">524</int>
</lst>
<result name="response" numFound="100" start="0">
</result>
<lst name="stats">
  <lst name="stats_fields"/>
</lst>
<lst name="stats">
  <lst name="cdr">
    <date name="cd1">1800-12-31T23:59:59Z</date>
    <date name="cd2">1804-06-30T23:59:59Z</date>
    <str name="cs1">1800-12-31T23:59:59Z</str>
    <str name="cs2">1804-06-30T23:59:59Z</str>
  </lst>
  <lst name="dmr">
    <str name="cma">+2MONTHS</str>
    <str name="cme">+2YEARS</str>
    <date name="dmma">1812-02-29T23:59:59Z</date>
    <date name="dmme">1807-12-31T23:59:59Z</date>
    <date name="max">1811-12-31T23:59:59Z</date>
    <date name="median">1805-12-31T23:59:59Z</date>
  </lst>
  <lst name="ar">
    <long name="count">100</long>
    <null name="mcm"/>
    <null name="mean"/>
    <null name="median"/>
    <null name="su"/>
    <null name="sum"/>
    <null name="unique"/>
  </lst>
  <lst name="pr">
    <long name="count">100</long>
    <null name="mc"/>
    <null name="mean"/>
    <null name="su"/>
    <null name="sum"/>
    <null name="unique"/>
  </lst>
  <lst name="cr">
    <str name="ccmax">this is the secondstr9</str>
    <str name="ccmin">this is the firststr0</str>
    <str name="csmax">this is the second</str>
    <str name="csmin">this is the first</str>
    <str name="max">str9</str>
    <str name="min">str0</str>
  </lst>
  <lst name="cnr">
    <double name="c10">10.0</double>
    <double name="c8">8.0</double>
  </lst>
  <lst name="mr">
    <long name="count">100</long>
    <null name="mcm"/>
    <null name="mean"/>
    <null name="median"/>
    <null name="su"/>
    <null name="sum"/>
    <null name="unique"/>
  </lst>
  <lst name="avr">
    <double name="c">100.0</double>
    <long name="count">100</long>
    <null name="s"/>
    <null name="sum"/>
  </lst>
  <lst name="csr">
    <str name="cs1">this is the first</str>
    <str name="cs2">this is the second</str>
    <str name="cs3">this is the third</str>
  </lst>
  <lst name="nr">
    <double name="c">-100.0</double>
    <long name="count">100</long>
    <null name="s"/>
    <null name="sum"/>
  </lst>
  <lst name="dr">
    <long name="count">100</long>
    <null name="mc"/>
    <null name="mean"/>
    <null name="su"/>
    <null name="sum"/>
    <null name="unique"/>
  </lst>
  <lst name="rr">
    <str name="max">str9</str>
    <str name="min">str0</str>
    <str name="rmax">9rts</str>
    <str name="rmin">0rts</str>
  </lst>
</lst>
</response>

	at __randomizedtesting.SeedInfo.seed([6711B52A90E8F007:9A3022978FFAED6]:0)
	at org.junit.Assert.fail(Assert.java:93)
	at org.apache.solr.analytics.AbstractAnalyticsStatsTest.getStatResult(AbstractAnalyticsStatsTest.java:113)
	at org.apache.solr.analytics.expression.ExpressionTest.powerTest(ExpressionTest.java:119)
	at sun.reflect.NativeMethodAccessorImpl.invoke0(Native Method)
	at sun.reflect.NativeMethodAccessorImpl.invoke(NativeMethodAccessorImpl.java:57)
	at sun.reflect.DelegatingMethodAccessorImpl.invoke(DelegatingMethodAccessorImpl.java:43)
	at java.lang.reflect.Method.invoke(Method.java:606)
	at com.carrotsearch.randomizedtesting.RandomizedRunner.invoke(RandomizedRunner.java:1559)
	at com.carrotsearch.randomizedtesting.RandomizedRunner.access$600(RandomizedRunner.java:79)
	at com.carrotsearch.randomizedtesting.RandomizedRunner$6.evaluate(RandomizedRunner.java:737)
	at com.carrotsearch.randomizedtesting.RandomizedRunner$7.evaluate(RandomizedRunner.java:773)
	at com.carrotsearch.randomizedtesting.RandomizedRunner$8.evaluate(RandomizedRunner.java:787)
	at com.carrotsearch.randomizedtesting.rules.SystemPropertiesRestoreRule$1.evaluate(SystemPropertiesRestoreRule.java:53)
	at org.apache.lucene.util.TestRuleSetupTeardownChained$1.evaluate(TestRuleSetupTeardownChained.java:50)
	at org.apache.lucene.util.TestRuleFieldCacheSanity$1.evaluate(TestRuleFieldCacheSanity.java:51)
	at org.apache.lucene.util.AbstractBeforeAfterRule$1.evaluate(AbstractBeforeAfterRule.java:46)
	at com.carrotsearch.randomizedtesting.rules.SystemPropertiesInvariantRule$1.evaluate(SystemPropertiesInvariantRule.java:55)
	at org.apache.lucene.util.TestRuleThreadAndTestName$1.evaluate(TestRuleThreadAndTestName.java:49)
	at org.apache.lucene.util.TestRuleIgnoreAfterMaxFailures$1.evaluate(TestRuleIgnoreAfterMaxFailures.java:70)
	at org.apache.lucene.util.TestRuleMarkFailure$1.evaluate(TestRuleMarkFailure.java:48)
	at com.carrotsearch.randomizedtesting.rules.StatementAdapter.evaluate(StatementAdapter.java:36)
	at com.carrotsearch.randomizedtesting.ThreadLeakControl$StatementRunner.run(ThreadLeakControl.java:358)
	at com.carrotsearch.randomizedtesting.ThreadLeakControl.forkTimeoutingTask(ThreadLeakControl.java:782)
	at com.carrotsearch.randomizedtesting.ThreadLeakControl$3.evaluate(ThreadLeakControl.java:442)
	at com.carrotsearch.randomizedtesting.RandomizedRunner.runSingleTest(RandomizedRunner.java:746)
	at com.carrotsearch.randomizedtesting.RandomizedRunner$3.evaluate(RandomizedRunner.java:648)
	at com.carrotsearch.randomizedtesting.RandomizedRunner$4.evaluate(RandomizedRunner.java:682)
	at com.carrotsearch.randomizedtesting.RandomizedRunner$5.evaluate(RandomizedRunner.java:693)
	at com.carrotsearch.randomizedtesting.rules.StatementAdapter.evaluate(StatementAdapter.java:36)
	at com.carrotsearch.randomizedtesting.rules.SystemPropertiesRestoreRule$1.evaluate(SystemPropertiesRestoreRule.java:53)
	at org.apache.lucene.util.AbstractBeforeAfterRule$1.evaluate(AbstractBeforeAfterRule.java:46)
	at org.apache.lucene.util.TestRuleStoreClassName$1.evaluate(TestRuleStoreClassName.java:42)
	at com.carrotsearch.randomizedtesting.rules.SystemPropertiesInvariantRule$1.evaluate(SystemPropertiesInvariantRule.java:55)
	at com.carrotsearch.randomizedtesting.rules.NoShadowingOrOverridesOnMethodsRule$1.evaluate(NoShadowingOrOverridesOnMethodsRule.java:39)
	at com.carrotsearch.randomizedtesting.rules.NoShadowingOrOverridesOnMethodsRule$1.evaluate(NoShadowingOrOverridesOnMethodsRule.java:39)
	at com.carrotsearch.randomizedtesting.rules.StatementAdapter.evaluate(StatementAdapter.java:36)
	at org.apache.lucene.util.TestRuleAssertionsRequired$1.evaluate(TestRuleAssertionsRequired.java:43)
	at org.apache.lucene.util.TestRuleMarkFailure$1.evaluate(TestRuleMarkFailure.java:48)
	at org.apache.lucene.util.TestRuleIgnoreAfterMaxFailures$1.evaluate(TestRuleIgnoreAfterMaxFailures.java:70)
	at org.apache.lucene.util.TestRuleIgnoreTestSuites$1.evaluate(TestRuleIgnoreTestSuites.java:55)
	at com.carrotsearch.randomizedtesting.rules.StatementAdapter.evaluate(StatementAdapter.java:36)
	at com.carrotsearch.randomizedtesting.ThreadLeakControl$StatementRunner.run(ThreadLeakControl.java:358)
	at java.lang.Thread.run(Thread.java:724)


REGRESSION:  org.apache.solr.analytics.expression.ExpressionTest.addTest

Error Message:
Caught exception in getStatResult, xPath = /response/lst[@name='stats']/lst[@name='ar']/double[@name='sum']  raw data: <?xml version="1.0" encoding="UTF-8"?> <response>  <lst name="responseHeader">   <int name="status">0</int>   <int name="QTime">524</int> </lst> <result name="response" numFound="100" start="0"> </result> <lst name="stats">   <lst name="stats_fields"/> </lst> <lst name="stats">   <lst name="cdr">     <date name="cd1">1800-12-31T23:59:59Z</date>     <date name="cd2">1804-06-30T23:59:59Z</date>     <str name="cs1">1800-12-31T23:59:59Z</str>     <str name="cs2">1804-06-30T23:59:59Z</str>   </lst>   <lst name="dmr">     <str name="cma">+2MONTHS</str>     <str name="cme">+2YEARS</str>     <date name="dmma">1812-02-29T23:59:59Z</date>     <date name="dmme">1807-12-31T23:59:59Z</date>     <date name="max">1811-12-31T23:59:59Z</date>     <date name="median">1805-12-31T23:59:59Z</date>   </lst>   <lst name="ar">     <long name="count">100</long>     <null name="mcm"/>     <null name="mean"/>     <null name="median"/>     <null name="su"/>     <null name="sum"/>     <null name="unique"/>   </lst>   <lst name="pr">     <long name="count">100</long>     <null name="mc"/>     <null name="mean"/>     <null name="su"/>     <null name="sum"/>     <null name="unique"/>   </lst>   <lst name="cr">     <str name="ccmax">this is the secondstr9</str>     <str name="ccmin">this is the firststr0</str>     <str name="csmax">this is the second</str>     <str name="csmin">this is the first</str>     <str name="max">str9</str>     <str name="min">str0</str>   </lst>   <lst name="cnr">     <double name="c10">10.0</double>     <double name="c8">8.0</double>   </lst>   <lst name="mr">     <long name="count">100</long>     <null name="mcm"/>     <null name="mean"/>     <null name="median"/>     <null name="su"/>     <null name="sum"/>     <null name="unique"/>   </lst>   <lst name="avr">     <double name="c">100.0</double>     <long name="count">100</long>     <null name="s"/>     <null name="sum"/>   </lst>   <lst name="csr">     <str name="cs1">this is the first</str>     <str name="cs2">this is the second</str>     <str name="cs3">this is the third</str>   </lst>   <lst name="nr">     <double name="c">-100.0</double>     <long name="count">100</long>     <null name="s"/>     <null name="sum"/>   </lst>   <lst name="dr">     <long name="count">100</long>     <null name="mc"/>     <null name="mean"/>     <null name="su"/>     <null name="sum"/>     <null name="unique"/>   </lst>   <lst name="rr">     <str name="max">str9</str>     <str name="min">str0</str>     <str name="rmax">9rts</str>     <str name="rmin">0rts</str>   </lst> </lst> </response> 

Stack Trace:
java.lang.AssertionError: Caught exception in getStatResult, xPath = /response/lst[@name='stats']/lst[@name='ar']/double[@name='sum'] 
raw data: <?xml version="1.0" encoding="UTF-8"?>
<response>

<lst name="responseHeader">
  <int name="status">0</int>
  <int name="QTime">524</int>
</lst>
<result name="response" numFound="100" start="0">
</result>
<lst name="stats">
  <lst name="stats_fields"/>
</lst>
<lst name="stats">
  <lst name="cdr">
    <date name="cd1">1800-12-31T23:59:59Z</date>
    <date name="cd2">1804-06-30T23:59:59Z</date>
    <str name="cs1">1800-12-31T23:59:59Z</str>
    <str name="cs2">1804-06-30T23:59:59Z</str>
  </lst>
  <lst name="dmr">
    <str name="cma">+2MONTHS</str>
    <str name="cme">+2YEARS</str>
    <date name="dmma">1812-02-29T23:59:59Z</date>
    <date name="dmme">1807-12-31T23:59:59Z</date>
    <date name="max">1811-12-31T23:59:59Z</date>
    <date name="median">1805-12-31T23:59:59Z</date>
  </lst>
  <lst name="ar">
    <long name="count">100</long>
    <null name="mcm"/>
    <null name="mean"/>
    <null name="median"/>
    <null name="su"/>
    <null name="sum"/>
    <null name="unique"/>
  </lst>
  <lst name="pr">
    <long name="count">100</long>
    <null name="mc"/>
    <null name="mean"/>
    <null name="su"/>
    <null name="sum"/>
    <null name="unique"/>
  </lst>
  <lst name="cr">
    <str name="ccmax">this is the secondstr9</str>
    <str name="ccmin">this is the firststr0</str>
    <str name="csmax">this is the second</str>
    <str name="csmin">this is the first</str>
    <str name="max">str9</str>
    <str name="min">str0</str>
  </lst>
  <lst name="cnr">
    <double name="c10">10.0</double>
    <double name="c8">8.0</double>
  </lst>
  <lst name="mr">
    <long name="count">100</long>
    <null name="mcm"/>
    <null name="mean"/>
    <null name="median"/>
    <null name="su"/>
    <null name="sum"/>
    <null name="unique"/>
  </lst>
  <lst name="avr">
    <double name="c">100.0</double>
    <long name="count">100</long>
    <null name="s"/>
    <null name="sum"/>
  </lst>
  <lst name="csr">
    <str name="cs1">this is the first</str>
    <str name="cs2">this is the second</str>
    <str name="cs3">this is the third</str>
  </lst>
  <lst name="nr">
    <double name="c">-100.0</double>
    <long name="count">100</long>
    <null name="s"/>
    <null name="sum"/>
  </lst>
  <lst name="dr">
    <long name="count">100</long>
    <null name="mc"/>
    <null name="mean"/>
    <null name="su"/>
    <null name="sum"/>
    <null name="unique"/>
  </lst>
  <lst name="rr">
    <str name="max">str9</str>
    <str name="min">str0</str>
    <str name="rmax">9rts</str>
    <str name="rmin">0rts</str>
  </lst>
</lst>
</response>

	at __randomizedtesting.SeedInfo.seed([6711B52A90E8F007:913D18F4D127F740]:0)
	at org.junit.Assert.fail(Assert.java:93)
	at org.apache.solr.analytics.AbstractAnalyticsStatsTest.getStatResult(AbstractAnalyticsStatsTest.java:113)
	at org.apache.solr.analytics.expression.ExpressionTest.addTest(ExpressionTest.java:78)
	at sun.reflect.NativeMethodAccessorImpl.invoke0(Native Method)
	at sun.reflect.NativeMethodAccessorImpl.invoke(NativeMethodAccessorImpl.java:57)
	at sun.reflect.DelegatingMethodAccessorImpl.invoke(DelegatingMethodAccessorImpl.java:43)
	at java.lang.reflect.Method.invoke(Method.java:606)
	at com.carrotsearch.randomizedtesting.RandomizedRunner.invoke(RandomizedRunner.java:1559)
	at com.carrotsearch.randomizedtesting.RandomizedRunner.access$600(RandomizedRunner.java:79)
	at com.carrotsearch.randomizedtesting.RandomizedRunner$6.evaluate(RandomizedRunner.java:737)
	at com.carrotsearch.randomizedtesting.RandomizedRunner$7.evaluate(RandomizedRunner.java:773)
	at com.carrotsearch.randomizedtesting.RandomizedRunner$8.evaluate(RandomizedRunner.java:787)
	at com.carrotsearch.randomizedtesting.rules.SystemPropertiesRestoreRule$1.evaluate(SystemPropertiesRestoreRule.java:53)
	at org.apache.lucene.util.TestRuleSetupTeardownChained$1.evaluate(TestRuleSetupTeardownChained.java:50)
	at org.apache.lucene.util.TestRuleFieldCacheSanity$1.evaluate(TestRuleFieldCacheSanity.java:51)
	at org.apache.lucene.util.AbstractBeforeAfterRule$1.evaluate(AbstractBeforeAfterRule.java:46)
	at com.carrotsearch.randomizedtesting.rules.SystemPropertiesInvariantRule$1.evaluate(SystemPropertiesInvariantRule.java:55)
	at org.apache.lucene.util.TestRuleThreadAndTestName$1.evaluate(TestRuleThreadAndTestName.java:49)
	at org.apache.lucene.util.TestRuleIgnoreAfterMaxFailures$1.evaluate(TestRuleIgnoreAfterMaxFailures.java:70)
	at org.apache.lucene.util.TestRuleMarkFailure$1.evaluate(TestRuleMarkFailure.java:48)
	at com.carrotsearch.randomizedtesting.rules.StatementAdapter.evaluate(StatementAdapter.java:36)
	at com.carrotsearch.randomizedtesting.ThreadLeakControl$StatementRunner.run(ThreadLeakControl.java:358)
	at com.carrotsearch.randomizedtesting.ThreadLeakControl.forkTimeoutingTask(ThreadLeakControl.java:782)
	at com.carrotsearch.randomizedtesting.ThreadLeakControl$3.evaluate(ThreadLeakControl.java:442)
	at com.carrotsearch.randomizedtesting.RandomizedRunner.runSingleTest(RandomizedRunner.java:746)
	at com.carrotsearch.randomizedtesting.RandomizedRunner$3.evaluate(RandomizedRunner.java:648)
	at com.carrotsearch.randomizedtesting.RandomizedRunner$4.evaluate(RandomizedRunner.java:682)
	at com.carrotsearch.randomizedtesting.RandomizedRunner$5.evaluate(RandomizedRunner.java:693)
	at com.carrotsearch.randomizedtesting.rules.StatementAdapter.evaluate(StatementAdapter.java:36)
	at com.carrotsearch.randomizedtesting.rules.SystemPropertiesRestoreRule$1.evaluate(SystemPropertiesRestoreRule.java:53)
	at org.apache.lucene.util.AbstractBeforeAfterRule$1.evaluate(AbstractBeforeAfterRule.java:46)
	at org.apache.lucene.util.TestRuleStoreClassName$1.evaluate(TestRuleStoreClassName.java:42)
	at com.carrotsearch.randomizedtesting.rules.SystemPropertiesInvariantRule$1.evaluate(SystemPropertiesInvariantRule.java:55)
	at com.carrotsearch.randomizedtesting.rules.NoShadowingOrOverridesOnMethodsRule$1.evaluate(NoShadowingOrOverridesOnMethodsRule.java:39)
	at com.carrotsearch.randomizedtesting.rules.NoShadowingOrOverridesOnMethodsRule$1.evaluate(NoShadowingOrOverridesOnMethodsRule.java:39)
	at com.carrotsearch.randomizedtesting.rules.StatementAdapter.evaluate(StatementAdapter.java:36)
	at org.apache.lucene.util.TestRuleAssertionsRequired$1.evaluate(TestRuleAssertionsRequired.java:43)
	at org.apache.lucene.util.TestRuleMarkFailure$1.evaluate(TestRuleMarkFailure.java:48)
	at org.apache.lucene.util.TestRuleIgnoreAfterMaxFailures$1.evaluate(TestRuleIgnoreAfterMaxFailures.java:70)
	at org.apache.lucene.util.TestRuleIgnoreTestSuites$1.evaluate(TestRuleIgnoreTestSuites.java:55)
	at com.carrotsearch.randomizedtesting.rules.StatementAdapter.evaluate(StatementAdapter.java:36)
	at com.carrotsearch.randomizedtesting.ThreadLeakControl$StatementRunner.run(ThreadLeakControl.java:358)
	at java.lang.Thread.run(Thread.java:724)


REGRESSION:  org.apache.solr.analytics.expression.ExpressionTest.negateTest

Error Message:
Caught exception in getStatResult, xPath = /response/lst[@name='stats']/lst[@name='nr']/double[@name='sum']  raw data: <?xml version="1.0" encoding="UTF-8"?> <response>  <lst name="responseHeader">   <int name="status">0</int>   <int name="QTime">524</int> </lst> <result name="response" numFound="100" start="0"> </result> <lst name="stats">   <lst name="stats_fields"/> </lst> <lst name="stats">   <lst name="cdr">     <date name="cd1">1800-12-31T23:59:59Z</date>     <date name="cd2">1804-06-30T23:59:59Z</date>     <str name="cs1">1800-12-31T23:59:59Z</str>     <str name="cs2">1804-06-30T23:59:59Z</str>   </lst>   <lst name="dmr">     <str name="cma">+2MONTHS</str>     <str name="cme">+2YEARS</str>     <date name="dmma">1812-02-29T23:59:59Z</date>     <date name="dmme">1807-12-31T23:59:59Z</date>     <date name="max">1811-12-31T23:59:59Z</date>     <date name="median">1805-12-31T23:59:59Z</date>   </lst>   <lst name="ar">     <long name="count">100</long>     <null name="mcm"/>     <null name="mean"/>     <null name="median"/>     <null name="su"/>     <null name="sum"/>     <null name="unique"/>   </lst>   <lst name="pr">     <long name="count">100</long>     <null name="mc"/>     <null name="mean"/>     <null name="su"/>     <null name="sum"/>     <null name="unique"/>   </lst>   <lst name="cr">     <str name="ccmax">this is the secondstr9</str>     <str name="ccmin">this is the firststr0</str>     <str name="csmax">this is the second</str>     <str name="csmin">this is the first</str>     <str name="max">str9</str>     <str name="min">str0</str>   </lst>   <lst name="cnr">     <double name="c10">10.0</double>     <double name="c8">8.0</double>   </lst>   <lst name="mr">     <long name="count">100</long>     <null name="mcm"/>     <null name="mean"/>     <null name="median"/>     <null name="su"/>     <null name="sum"/>     <null name="unique"/>   </lst>   <lst name="avr">     <double name="c">100.0</double>     <long name="count">100</long>     <null name="s"/>     <null name="sum"/>   </lst>   <lst name="csr">     <str name="cs1">this is the first</str>     <str name="cs2">this is the second</str>     <str name="cs3">this is the third</str>   </lst>   <lst name="nr">     <double name="c">-100.0</double>     <long name="count">100</long>     <null name="s"/>     <null name="sum"/>   </lst>   <lst name="dr">     <long name="count">100</long>     <null name="mc"/>     <null name="mean"/>     <null name="su"/>     <null name="sum"/>     <null name="unique"/>   </lst>   <lst name="rr">     <str name="max">str9</str>     <str name="min">str0</str>     <str name="rmax">9rts</str>     <str name="rmin">0rts</str>   </lst> </lst> </response> 

Stack Trace:
java.lang.AssertionError: Caught exception in getStatResult, xPath = /response/lst[@name='stats']/lst[@name='nr']/double[@name='sum'] 
raw data: <?xml version="1.0" encoding="UTF-8"?>
<response>

<lst name="responseHeader">
  <int name="status">0</int>
  <int name="QTime">524</int>
</lst>
<result name="response" numFound="100" start="0">
</result>
<lst name="stats">
  <lst name="stats_fields"/>
</lst>
<lst name="stats">
  <lst name="cdr">
    <date name="cd1">1800-12-31T23:59:59Z</date>
    <date name="cd2">1804-06-30T23:59:59Z</date>
    <str name="cs1">1800-12-31T23:59:59Z</str>
    <str name="cs2">1804-06-30T23:59:59Z</str>
  </lst>
  <lst name="dmr">
    <str name="cma">+2MONTHS</str>
    <str name="cme">+2YEARS</str>
    <date name="dmma">1812-02-29T23:59:59Z</date>
    <date name="dmme">1807-12-31T23:59:59Z</date>
    <date name="max">1811-12-31T23:59:59Z</date>
    <date name="median">1805-12-31T23:59:59Z</date>
  </lst>
  <lst name="ar">
    <long name="count">100</long>
    <null name="mcm"/>
    <null name="mean"/>
    <null name="median"/>
    <null name="su"/>
    <null name="sum"/>
    <null name="unique"/>
  </lst>
  <lst name="pr">
    <long name="count">100</long>
    <null name="mc"/>
    <null name="mean"/>
    <null name="su"/>
    <null name="sum"/>
    <null name="unique"/>
  </lst>
  <lst name="cr">
    <str name="ccmax">this is the secondstr9</str>
    <str name="ccmin">this is the firststr0</str>
    <str name="csmax">this is the second</str>
    <str name="csmin">this is the first</str>
    <str name="max">str9</str>
    <str name="min">str0</str>
  </lst>
  <lst name="cnr">
    <double name="c10">10.0</double>
    <double name="c8">8.0</double>
  </lst>
  <lst name="mr">
    <long name="count">100</long>
    <null name="mcm"/>
    <null name="mean"/>
    <null name="median"/>
    <null name="su"/>
    <null name="sum"/>
    <null name="unique"/>
  </lst>
  <lst name="avr">
    <double name="c">100.0</double>
    <long name="count">100</long>
    <null name="s"/>
    <null name="sum"/>
  </lst>
  <lst name="csr">
    <str name="cs1">this is the first</str>
    <str name="cs2">this is the second</str>
    <str name="cs3">this is the third</str>
  </lst>
  <lst name="nr">
    <double name="c">-100.0</double>
    <long name="count">100</long>
    <null name="s"/>
    <null name="sum"/>
  </lst>
  <lst name="dr">
    <long name="count">100</long>
    <null name="mc"/>
    <null name="mean"/>
    <null name="su"/>
    <null name="sum"/>
    <null name="unique"/>
  </lst>
  <lst name="rr">
    <str name="max">str9</str>
    <str name="min">str0</str>
    <str name="rmax">9rts</str>
    <str name="rmin">0rts</str>
  </lst>
</lst>
</response>

	at __randomizedtesting.SeedInfo.seed([6711B52A90E8F007:6F19DD8F34C5A0B7]:0)
	at org.junit.Assert.fail(Assert.java:93)
	at org.apache.solr.analytics.AbstractAnalyticsStatsTest.getStatResult(AbstractAnalyticsStatsTest.java:113)
	at org.apache.solr.analytics.expression.ExpressionTest.negateTest(ExpressionTest.java:132)
	at sun.reflect.NativeMethodAccessorImpl.invoke0(Native Method)
	at sun.reflect.NativeMethodAccessorImpl.invoke(NativeMethodAccessorImpl.java:57)
	at sun.reflect.DelegatingMethodAccessorImpl.invoke(DelegatingMethodAccessorImpl.java:43)
	at java.lang.reflect.Method.invoke(Method.java:606)
	at com.carrotsearch.randomizedtesting.RandomizedRunner.invoke(RandomizedRunner.java:1559)
	at com.carrotsearch.randomizedtesting.RandomizedRunner.access$600(RandomizedRunner.java:79)
	at com.carrotsearch.randomizedtesting.RandomizedRunner$6.evaluate(RandomizedRunner.java:737)
	at com.carrotsearch.randomizedtesting.RandomizedRunner$7.evaluate(RandomizedRunner.java:773)
	at com.carrotsearch.randomizedtesting.RandomizedRunner$8.evaluate(RandomizedRunner.java:787)
	at com.carrotsearch.randomizedtesting.rules.SystemPropertiesRestoreRule$1.evaluate(SystemPropertiesRestoreRule.java:53)
	at org.apache.lucene.util.TestRuleSetupTeardownChained$1.evaluate(TestRuleSetupTeardownChained.java:50)
	at org.apache.lucene.util.TestRuleFieldCacheSanity$1.evaluate(TestRuleFieldCacheSanity.java:51)
	at org.apache.lucene.util.AbstractBeforeAfterRule$1.evaluate(AbstractBeforeAfterRule.java:46)
	at com.carrotsearch.randomizedtesting.rules.SystemPropertiesInvariantRule$1.evaluate(SystemPropertiesInvariantRule.java:55)
	at org.apache.lucene.util.TestRuleThreadAndTestName$1.evaluate(TestRuleThreadAndTestName.java:49)
	at org.apache.lucene.util.TestRuleIgnoreAfterMaxFailures$1.evaluate(TestRuleIgnoreAfterMaxFailures.java:70)
	at org.apache.lucene.util.TestRuleMarkFailure$1.evaluate(TestRuleMarkFailure.java:48)
	at com.carrotsearch.randomizedtesting.rules.StatementAdapter.evaluate(StatementAdapter.java:36)
	at com.carrotsearch.randomizedtesting.ThreadLeakControl$StatementRunner.run(ThreadLeakControl.java:358)
	at com.carrotsearch.randomizedtesting.ThreadLeakControl.forkTimeoutingTask(ThreadLeakControl.java:782)
	at com.carrotsearch.randomizedtesting.ThreadLeakControl$3.evaluate(ThreadLeakControl.java:442)
	at com.carrotsearch.randomizedtesting.RandomizedRunner.runSingleTest(RandomizedRunner.java:746)
	at com.carrotsearch.randomizedtesting.RandomizedRunner$3.evaluate(RandomizedRunner.java:648)
	at com.carrotsearch.randomizedtesting.RandomizedRunner$4.evaluate(RandomizedRunner.java:682)
	at com.carrotsearch.randomizedtesting.RandomizedRunner$5.evaluate(RandomizedRunner.java:693)
	at com.carrotsearch.randomizedtesting.rules.StatementAdapter.evaluate(StatementAdapter.java:36)
	at com.carrotsearch.randomizedtesting.rules.SystemPropertiesRestoreRule$1.evaluate(SystemPropertiesRestoreRule.java:53)
	at org.apache.lucene.util.AbstractBeforeAfterRule$1.evaluate(AbstractBeforeAfterRule.java:46)
	at org.apache.lucene.util.TestRuleStoreClassName$1.evaluate(TestRuleStoreClassName.java:42)
	at com.carrotsearch.randomizedtesting.rules.SystemPropertiesInvariantRule$1.evaluate(SystemPropertiesInvariantRule.java:55)
	at com.carrotsearch.randomizedtesting.rules.NoShadowingOrOverridesOnMethodsRule$1.evaluate(NoShadowingOrOverridesOnMethodsRule.java:39)
	at com.carrotsearch.randomizedtesting.rules.NoShadowingOrOverridesOnMethodsRule$1.evaluate(NoShadowingOrOverridesOnMethodsRule.java:39)
	at com.carrotsearch.randomizedtesting.rules.StatementAdapter.evaluate(StatementAdapter.java:36)
	at org.apache.lucene.util.TestRuleAssertionsRequired$1.evaluate(TestRuleAssertionsRequired.java:43)
	at org.apache.lucene.util.TestRuleMarkFailure$1.evaluate(TestRuleMarkFailure.java:48)
	at org.apache.lucene.util.TestRuleIgnoreAfterMaxFailures$1.evaluate(TestRuleIgnoreAfterMaxFailures.java:70)
	at org.apache.lucene.util.TestRuleIgnoreTestSuites$1.evaluate(TestRuleIgnoreTestSuites.java:55)
	at com.carrotsearch.randomizedtesting.rules.StatementAdapter.evaluate(StatementAdapter.java:36)
	at com.carrotsearch.randomizedtesting.ThreadLeakControl$StatementRunner.run(ThreadLeakControl.java:358)
	at java.lang.Thread.run(Thread.java:724)


REGRESSION:  org.apache.solr.analytics.expression.ExpressionTest.absoluteValueTest

Error Message:
Caught exception in getStatResult, xPath = /response/lst[@name='stats']/lst[@name='avr']/double[@name='sum']  raw data: <?xml version="1.0" encoding="UTF-8"?> <response>  <lst name="responseHeader">   <int name="status">0</int>   <int name="QTime">524</int> </lst> <result name="response" numFound="100" start="0"> </result> <lst name="stats">   <lst name="stats_fields"/> </lst> <lst name="stats">   <lst name="cdr">     <date name="cd1">1800-12-31T23:59:59Z</date>     <date name="cd2">1804-06-30T23:59:59Z</date>     <str name="cs1">1800-12-31T23:59:59Z</str>     <str name="cs2">1804-06-30T23:59:59Z</str>   </lst>   <lst name="dmr">     <str name="cma">+2MONTHS</str>     <str name="cme">+2YEARS</str>     <date name="dmma">1812-02-29T23:59:59Z</date>     <date name="dmme">1807-12-31T23:59:59Z</date>     <date name="max">1811-12-31T23:59:59Z</date>     <date name="median">1805-12-31T23:59:59Z</date>   </lst>   <lst name="ar">     <long name="count">100</long>     <null name="mcm"/>     <null name="mean"/>     <null name="median"/>     <null name="su"/>     <null name="sum"/>     <null name="unique"/>   </lst>   <lst name="pr">     <long name="count">100</long>     <null name="mc"/>     <null name="mean"/>     <null name="su"/>     <null name="sum"/>     <null name="unique"/>   </lst>   <lst name="cr">     <str name="ccmax">this is the secondstr9</str>     <str name="ccmin">this is the firststr0</str>     <str name="csmax">this is the second</str>     <str name="csmin">this is the first</str>     <str name="max">str9</str>     <str name="min">str0</str>   </lst>   <lst name="cnr">     <double name="c10">10.0</double>     <double name="c8">8.0</double>   </lst>   <lst name="mr">     <long name="count">100</long>     <null name="mcm"/>     <null name="mean"/>     <null name="median"/>     <null name="su"/>     <null name="sum"/>     <null name="unique"/>   </lst>   <lst name="avr">     <double name="c">100.0</double>     <long name="count">100</long>     <null name="s"/>     <null name="sum"/>   </lst>   <lst name="csr">     <str name="cs1">this is the first</str>     <str name="cs2">this is the second</str>     <str name="cs3">this is the third</str>   </lst>   <lst name="nr">     <double name="c">-100.0</double>     <long name="count">100</long>     <null name="s"/>     <null name="sum"/>   </lst>   <lst name="dr">     <long name="count">100</long>     <null name="mc"/>     <null name="mean"/>     <null name="su"/>     <null name="sum"/>     <null name="unique"/>   </lst>   <lst name="rr">     <str name="max">str9</str>     <str name="min">str0</str>     <str name="rmax">9rts</str>     <str name="rmin">0rts</str>   </lst> </lst> </response> 

Stack Trace:
java.lang.AssertionError: Caught exception in getStatResult, xPath = /response/lst[@name='stats']/lst[@name='avr']/double[@name='sum'] 
raw data: <?xml version="1.0" encoding="UTF-8"?>
<response>

<lst name="responseHeader">
  <int name="status">0</int>
  <int name="QTime">524</int>
</lst>
<result name="response" numFound="100" start="0">
</result>
<lst name="stats">
  <lst name="stats_fields"/>
</lst>
<lst name="stats">
  <lst name="cdr">
    <date name="cd1">1800-12-31T23:59:59Z</date>
    <date name="cd2">1804-06-30T23:59:59Z</date>
    <str name="cs1">1800-12-31T23:59:59Z</str>
    <str name="cs2">1804-06-30T23:59:59Z</str>
  </lst>
  <lst name="dmr">
    <str name="cma">+2MONTHS</str>
    <str name="cme">+2YEARS</str>
    <date name="dmma">1812-02-29T23:59:59Z</date>
    <date name="dmme">1807-12-31T23:59:59Z</date>
    <date name="max">1811-12-31T23:59:59Z</date>
    <date name="median">1805-12-31T23:59:59Z</date>
  </lst>
  <lst name="ar">
    <long name="count">100</long>
    <null name="mcm"/>
    <null name="mean"/>
    <null name="median"/>
    <null name="su"/>
    <null name="sum"/>
    <null name="unique"/>
  </lst>
  <lst name="pr">
    <long name="count">100</long>
    <null name="mc"/>
    <null name="mean"/>
    <null name="su"/>
    <null name="sum"/>
    <null name="unique"/>
  </lst>
  <lst name="cr">
    <str name="ccmax">this is the secondstr9</str>
    <str name="ccmin">this is the firststr0</str>
    <str name="csmax">this is the second</str>
    <str name="csmin">this is the first</str>
    <str name="max">str9</str>
    <str name="min">str0</str>
  </lst>
  <lst name="cnr">
    <double name="c10">10.0</double>
    <double name="c8">8.0</double>
  </lst>
  <lst name="mr">
    <long name="count">100</long>
    <null name="mcm"/>
    <null name="mean"/>
    <null name="median"/>
    <null name="su"/>
    <null name="sum"/>
    <null name="unique"/>
  </lst>
  <lst name="avr">
    <double name="c">100.0</double>
    <long name="count">100</long>
    <null name="s"/>
    <null name="sum"/>
  </lst>
  <lst name="csr">
    <str name="cs1">this is the first</str>
    <str name="cs2">this is the second</str>
    <str name="cs3">this is the third</str>
  </lst>
  <lst name="nr">
    <double name="c">-100.0</double>
    <long name="count">100</long>
    <null name="s"/>
    <null name="sum"/>
  </lst>
  <lst name="dr">
    <long name="count">100</long>
    <null name="mc"/>
    <null name="mean"/>
    <null name="su"/>
    <null name="sum"/>
    <null name="unique"/>
  </lst>
  <lst name="rr">
    <str name="max">str9</str>
    <str name="min">str0</str>
    <str name="rmax">9rts</str>
    <str name="rmin">0rts</str>
  </lst>
</lst>
</response>

	at __randomizedtesting.SeedInfo.seed([6711B52A90E8F007:46BD953F5D75A861]:0)
	at org.junit.Assert.fail(Assert.java:93)
	at org.apache.solr.analytics.AbstractAnalyticsStatsTest.getStatResult(AbstractAnalyticsStatsTest.java:113)
	at org.apache.solr.analytics.expression.ExpressionTest.absoluteValueTest(ExpressionTest.java:143)
	at sun.reflect.NativeMethodAccessorImpl.invoke0(Native Method)
	at sun.reflect.NativeMethodAccessorImpl.invoke(NativeMethodAccessorImpl.java:57)
	at sun.reflect.DelegatingMethodAccessorImpl.invoke(DelegatingMethodAccessorImpl.java:43)
	at java.lang.reflect.Method.invoke(Method.java:606)
	at com.carrotsearch.randomizedtesting.RandomizedRunner.invoke(RandomizedRunner.java:1559)
	at com.carrotsearch.randomizedtesting.RandomizedRunner.access$600(RandomizedRunner.java:79)
	at com.carrotsearch.randomizedtesting.RandomizedRunner$6.evaluate(RandomizedRunner.java:737)
	at com.carrotsearch.randomizedtesting.RandomizedRunner$7.evaluate(RandomizedRunner.java:773)
	at com.carrotsearch.randomizedtesting.RandomizedRunner$8.evaluate(RandomizedRunner.java:787)
	at com.carrotsearch.randomizedtesting.rules.SystemPropertiesRestoreRule$1.evaluate(SystemPropertiesRestoreRule.java:53)
	at org.apache.lucene.util.TestRuleSetupTeardownChained$1.evaluate(TestRuleSetupTeardownChained.java:50)
	at org.apache.lucene.util.TestRuleFieldCacheSanity$1.evaluate(TestRuleFieldCacheSanity.java:51)
	at org.apache.lucene.util.AbstractBeforeAfterRule$1.evaluate(AbstractBeforeAfterRule.java:46)
	at com.carrotsearch.randomizedtesting.rules.SystemPropertiesInvariantRule$1.evaluate(SystemPropertiesInvariantRule.java:55)
	at org.apache.lucene.util.TestRuleThreadAndTestName$1.evaluate(TestRuleThreadAndTestName.java:49)
	at org.apache.lucene.util.TestRuleIgnoreAfterMaxFailures$1.evaluate(TestRuleIgnoreAfterMaxFailures.java:70)
	at org.apache.lucene.util.TestRuleMarkFailure$1.evaluate(TestRuleMarkFailure.java:48)
	at com.carrotsearch.randomizedtesting.rules.StatementAdapter.evaluate(StatementAdapter.java:36)
	at com.carrotsearch.randomizedtesting.ThreadLeakControl$StatementRunner.run(ThreadLeakControl.java:358)
	at com.carrotsearch.randomizedtesting.ThreadLeakControl.forkTimeoutingTask(ThreadLeakControl.java:782)
	at com.carrotsearch.randomizedtesting.ThreadLeakControl$3.evaluate(ThreadLeakControl.java:442)
	at com.carrotsearch.randomizedtesting.RandomizedRunner.runSingleTest(RandomizedRunner.java:746)
	at com.carrotsearch.randomizedtesting.RandomizedRunner$3.evaluate(RandomizedRunner.java:648)
	at com.carrotsearch.randomizedtesting.RandomizedRunner$4.evaluate(RandomizedRunner.java:682)
	at com.carrotsearch.randomizedtesting.RandomizedRunner$5.evaluate(RandomizedRunner.java:693)
	at com.carrotsearch.randomizedtesting.rules.StatementAdapter.evaluate(StatementAdapter.java:36)
	at com.carrotsearch.randomizedtesting.rules.SystemPropertiesRestoreRule$1.evaluate(SystemPropertiesRestoreRule.java:53)
	at org.apache.lucene.util.AbstractBeforeAfterRule$1.evaluate(AbstractBeforeAfterRule.java:46)
	at org.apache.lucene.util.TestRuleStoreClassName$1.evaluate(TestRuleStoreClassName.java:42)
	at com.carrotsearch.randomizedtesting.rules.SystemPropertiesInvariantRule$1.evaluate(SystemPropertiesInvariantRule.java:55)
	at com.carrotsearch.randomizedtesting.rules.NoShadowingOrOverridesOnMethodsRule$1.evaluate(NoShadowingOrOverridesOnMethodsRule.java:39)
	at com.carrotsearch.randomizedtesting.rules.NoShadowingOrOverridesOnMethodsRule$1.evaluate(NoShadowingOrOverridesOnMethodsRule.java:39)
	at com.carrotsearch.randomizedtesting.rules.StatementAdapter.evaluate(StatementAdapter.java:36)
	at org.apache.lucene.util.TestRuleAssertionsRequired$1.evaluate(TestRuleAssertionsRequired.java:43)
	at org.apache.lucene.util.TestRuleMarkFailure$1.evaluate(TestRuleMarkFailure.java:48)
	at org.apache.lucene.util.TestRuleIgnoreAfterMaxFailures$1.evaluate(TestRuleIgnoreAfterMaxFailures.java:70)
	at org.apache.lucene.util.TestRuleIgnoreTestSuites$1.evaluate(TestRuleIgnoreTestSuites.java:55)
	at com.carrotsearch.randomizedtesting.rules.StatementAdapter.evaluate(StatementAdapter.java:36)
	at com.carrotsearch.randomizedtesting.ThreadLeakControl$StatementRunner.run(ThreadLeakControl.java:358)
	at java.lang.Thread.run(Thread.java:724)




Build Log:
[...truncated 10576 lines...]
   [junit4] Suite: org.apache.solr.analytics.expression.ExpressionTest
   [junit4]   2> 2128501 T2240 oas.SolrTestCaseJ4.initCore ####initCore
   [junit4]   2> Creating dataDir: /usr/home/hudson/hudson-slave/workspace/Lucene-Solr-Tests-trunk-Java7/solr/build/solr-core/test/J0/./solrtest-ExpressionTest-1388229932578
   [junit4]   2> 2128502 T2240 oasc.SolrResourceLoader.<init> new SolrResourceLoader for directory: '/usr/home/hudson/hudson-slave/workspace/Lucene-Solr-Tests-trunk-Java7/solr/build/solr-core/test-files/solr/collection1/'
   [junit4]   2> 2128504 T2240 oasc.SolrResourceLoader.replaceClassLoader Adding 'file:/usr/home/hudson/hudson-slave/workspace/Lucene-Solr-Tests-trunk-Java7/solr/build/solr-core/test-files/solr/collection1/lib/classes/' to classloader
   [junit4]   2> 2128505 T2240 oasc.SolrResourceLoader.replaceClassLoader Adding 'file:/usr/home/hudson/hudson-slave/workspace/Lucene-Solr-Tests-trunk-Java7/solr/build/solr-core/test-files/solr/collection1/lib/README' to classloader
   [junit4]   2> 2128628 T2240 oasc.SolrConfig.<init> Using Lucene MatchVersion: LUCENE_50
   [junit4]   2> 2128687 T2240 oasc.SolrConfig.<init> Loaded SolrConfig: solrconfig-basic.xml
   [junit4]   2> 2128688 T2240 oass.IndexSchema.readSchema Reading Solr Schema from schema-analytics.xml
   [junit4]   2> 2128697 T2240 oass.IndexSchema.readSchema [null] Schema name=schema-docValues
   [junit4]   2> 2128757 T2240 oass.IndexSchema.readSchema unique key field: id
   [junit4]   2> 2128759 T2240 oasc.SolrResourceLoader.locateSolrHome JNDI not configured for solr (NoInitialContextEx)
   [junit4]   2> 2128759 T2240 oasc.SolrResourceLoader.locateSolrHome using system property solr.solr.home: /usr/home/hudson/hudson-slave/workspace/Lucene-Solr-Tests-trunk-Java7/solr/build/solr-core/test-files/solr
   [junit4]   2> 2128760 T2240 oasc.SolrResourceLoader.<init> new SolrResourceLoader for directory: '/usr/home/hudson/hudson-slave/workspace/Lucene-Solr-Tests-trunk-Java7/solr/build/solr-core/test-files/solr/'
   [junit4]   2> 2128777 T2240 oasc.SolrResourceLoader.locateSolrHome JNDI not configured for solr (NoInitialContextEx)
   [junit4]   2> 2128778 T2240 oasc.SolrResourceLoader.locateSolrHome using system property solr.solr.home: /usr/home/hudson/hudson-slave/workspace/Lucene-Solr-Tests-trunk-Java7/solr/build/solr-core/test-files/solr
   [junit4]   2> 2128778 T2240 oasc.SolrResourceLoader.<init> new SolrResourceLoader for deduced Solr Home: '/usr/home/hudson/hudson-slave/workspace/Lucene-Solr-Tests-trunk-Java7/solr/build/solr-core/test-files/solr/'
   [junit4]   2> 2128863 T2240 oasc.CoreContainer.<init> New CoreContainer 1550842784
   [junit4]   2> 2128864 T2240 oasc.CoreContainer.load Loading cores into CoreContainer [instanceDir=/usr/home/hudson/hudson-slave/workspace/Lucene-Solr-Tests-trunk-Java7/solr/build/solr-core/test-files/solr/]
   [junit4]   2> 2128866 T2240 oashc.HttpShardHandlerFactory.getParameter Setting socketTimeout to: 0
   [junit4]   2> 2128866 T2240 oashc.HttpShardHandlerFactory.getParameter Setting urlScheme to: http://
   [junit4]   2> 2128866 T2240 oashc.HttpShardHandlerFactory.getParameter Setting connTimeout to: 0
   [junit4]   2> 2128867 T2240 oashc.HttpShardHandlerFactory.getParameter Setting maxConnectionsPerHost to: 20
   [junit4]   2> 2128867 T2240 oashc.HttpShardHandlerFactory.getParameter Setting corePoolSize to: 0
   [junit4]   2> 2128867 T2240 oashc.HttpShardHandlerFactory.getParameter Setting maximumPoolSize to: 2147483647
   [junit4]   2> 2128868 T2240 oashc.HttpShardHandlerFactory.getParameter Setting maxThreadIdleTime to: 5
   [junit4]   2> 2128868 T2240 oashc.HttpShardHandlerFactory.getParameter Setting sizeOfQueue to: -1
   [junit4]   2> 2128868 T2240 oashc.HttpShardHandlerFactory.getParameter Setting fairnessPolicy to: false
   [junit4]   2> 2128888 T2240 oasl.LogWatcher.createWatcher SLF4J impl is org.slf4j.impl.Log4jLoggerFactory
   [junit4]   2> 2128888 T2240 oasl.LogWatcher.newRegisteredLogWatcher Registering Log Listener [Log4j (org.slf4j.impl.Log4jLoggerFactory)]
   [junit4]   2> 2128889 T2240 oasc.CoreContainer.load Host Name: 
   [junit4]   2> 2128896 T2241 oasc.CoreContainer.create Creating SolrCore 'collection1' using instanceDir: /usr/home/hudson/hudson-slave/workspace/Lucene-Solr-Tests-trunk-Java7/solr/build/solr-core/test-files/solr/collection1
   [junit4]   2> 2128896 T2241 oasc.SolrResourceLoader.<init> new SolrResourceLoader for directory: '/usr/home/hudson/hudson-slave/workspace/Lucene-Solr-Tests-trunk-Java7/solr/build/solr-core/test-files/solr/collection1/'
   [junit4]   2> 2128897 T2241 oasc.SolrResourceLoader.replaceClassLoader Adding 'file:/usr/home/hudson/hudson-slave/workspace/Lucene-Solr-Tests-trunk-Java7/solr/build/solr-core/test-files/solr/collection1/lib/classes/' to classloader
   [junit4]   2> 2128898 T2241 oasc.SolrResourceLoader.replaceClassLoader Adding 'file:/usr/home/hudson/hudson-slave/workspace/Lucene-Solr-Tests-trunk-Java7/solr/build/solr-core/test-files/solr/collection1/lib/README' to classloader
   [junit4]   2> 2128956 T2241 oasc.SolrConfig.<init> Using Lucene MatchVersion: LUCENE_50
   [junit4]   2> 2129014 T2241 oasc.SolrConfig.<init> Loaded SolrConfig: solrconfig-basic.xml
   [junit4]   2> 2129015 T2241 oass.IndexSchema.readSchema Reading Solr Schema from schema-analytics.xml
   [junit4]   2> 2129022 T2241 oass.IndexSchema.readSchema [collection1] Schema name=schema-docValues
   [junit4]   2> 2129116 T2241 oass.IndexSchema.readSchema unique key field: id
   [junit4]   2> 2129119 T2241 oasc.SolrCore.initDirectoryFactory org.apache.solr.core.MockDirectoryFactory
   [junit4]   2> 2129119 T2241 oasc.SolrCore.<init> [collection1] Opening new SolrCore at /usr/home/hudson/hudson-slave/workspace/Lucene-Solr-Tests-trunk-Java7/solr/build/solr-core/test-files/solr/collection1/, dataDir=/usr/home/hudson/hudson-slave/workspace/Lucene-Solr-Tests-trunk-Java7/solr/build/solr-core/test/J0/./solrtest-ExpressionTest-1388229932578/
   [junit4]   2> 2129119 T2241 oasc.SolrCore.<init> JMX monitoring not detected for core: collection1
   [junit4]   2> 2129120 T2241 oasc.CachingDirectoryFactory.get return new directory for /usr/home/hudson/hudson-slave/workspace/Lucene-Solr-Tests-trunk-Java7/solr/build/solr-core/test/J0/./solrtest-ExpressionTest-1388229932578
   [junit4]   2> 2129120 T2241 oasc.SolrCore.getNewIndexDir New index directory detected: old=null new=/usr/home/hudson/hudson-slave/workspace/Lucene-Solr-Tests-trunk-Java7/solr/build/solr-core/test/J0/./solrtest-ExpressionTest-1388229932578/index/
   [junit4]   2> 2129120 T2241 oasc.SolrCore.initIndex WARN [collection1] Solr index directory '/usr/home/hudson/hudson-slave/workspace/Lucene-Solr-Tests-trunk-Java7/solr/build/solr-core/test/J0/./solrtest-ExpressionTest-1388229932578/index' doesn't exist. Creating new index...
   [junit4]   2> 2129121 T2241 oasc.CachingDirectoryFactory.get return new directory for /usr/home/hudson/hudson-slave/workspace/Lucene-Solr-Tests-trunk-Java7/solr/build/solr-core/test/J0/./solrtest-ExpressionTest-1388229932578/index
   [junit4]   2> 2129122 T2241 oasu.RandomMergePolicy.<init> RandomMergePolicy wrapping class org.apache.lucene.index.TieredMergePolicy: [TieredMergePolicy: maxMergeAtOnce=27, maxMergeAtOnceExplicit=35, maxMergedSegmentMB=2.55859375, floorSegmentMB=2.0341796875, forceMergeDeletesPctAllowed=1.3741448151243973, segmentsPerTier=48.0, maxCFSSegmentSizeMB=8.796093022207999E12, noCFSRatio=1.0
   [junit4]   2> 2129123 T2241 oasc.SolrDeletionPolicy.onCommit SolrDeletionPolicy.onCommit: commits: num=1
   [junit4]   2> 		commit{dir=MockDirectoryWrapper(org.apache.lucene.store.RAMDirectory@1fcb547a lockFactory=org.apache.lucene.store.SingleInstanceLockFactory@4b58b267),segFN=segments_1,generation=1}
   [junit4]   2> 2129123 T2241 oasc.SolrDeletionPolicy.updateCommits newest commit generation = 1
   [junit4]   2> 2129124 T2241 oasc.SolrCore.loadUpdateProcessorChains no updateRequestProcessorChain defined as default, creating implicit default
   [junit4]   2> 2129125 T2241 oasc.RequestHandlers.initHandlersFromConfig created standard: solr.StandardRequestHandler
   [junit4]   2> 2129125 T2241 oasc.RequestHandlers.initHandlersFromConfig created /update: solr.UpdateRequestHandler
   [junit4]   2> 2129147 T2241 oashl.XMLLoader.init xsltCacheLifetimeSeconds=60
   [junit4]   2> 2129151 T2241 oasu.CommitTracker.<init> Hard AutoCommit: disabled
   [junit4]   2> 2129151 T2241 oasu.CommitTracker.<init> Soft AutoCommit: disabled
   [junit4]   2> 2129151 T2241 oasu.RandomMergePolicy.<init> RandomMergePolicy wrapping class org.apache.lucene.index.TieredMergePolicy: [TieredMergePolicy: maxMergeAtOnce=30, maxMergeAtOnceExplicit=26, maxMergedSegmentMB=36.4384765625, floorSegmentMB=1.9521484375, forceMergeDeletesPctAllowed=4.995484471712118, segmentsPerTier=42.0, maxCFSSegmentSizeMB=8.796093022207999E12, noCFSRatio=1.0
   [junit4]   2> 2129152 T2241 oasc.SolrDeletionPolicy.onInit SolrDeletionPolicy.onInit: commits: num=1
   [junit4]   2> 		commit{dir=MockDirectoryWrapper(org.apache.lucene.store.RAMDirectory@1fcb547a lockFactory=org.apache.lucene.store.SingleInstanceLockFactory@4b58b267),segFN=segments_1,generation=1}
   [junit4]   2> 2129152 T2241 oasc.SolrDeletionPolicy.updateCommits newest commit generation = 1
   [junit4]   2> 2129153 T2241 oass.SolrIndexSearcher.<init> Opening Searcher@654a3e91 main
   [junit4]   2> 2129153 T2242 oasc.SolrCore.registerSearcher [collection1] Registered new searcher Searcher@654a3e91 main{StandardDirectoryReader(segments_1:1:nrt)}
   [junit4]   2> 2129153 T2241 oasc.CoreContainer.registerCore registering core: collection1
   [junit4]   2> 2129156 T2240 oas.SolrTestCaseJ4.initCore ####initCore end
   [junit4]   2> ASYNC  NEW_CORE C926 name=collection1 org.apache.solr.core.SolrCore@e554da4
   [junit4]   2> 2129164 T2240 C926 oasu.DirectUpdateHandler2.deleteAll [collection1] REMOVING ALL DOCUMENTS FROM INDEX
   [junit4]   2> 2129165 T2240 C926 oasup.LogUpdateProcessor.finish [collection1] webapp=null path=null params={} {deleteByQuery=*:*} 0 1
   [junit4]   2> 2129175 T2240 C926 oasup.LogUpdateProcessor.finish [collection1] webapp=null path=null params={} {add=[10000]} 0 2
   [junit4]   2> 2129188 T2240 C926 oasup.LogUpdateProcessor.finish [collection1] webapp=null path=null params={} {add=[10001]} 0 1
   [junit4]   2> 2129198 T2240 C926 oasup.LogUpdateProcessor.finish [collection1] webapp=null path=null params={} {add=[10002]} 0 1
   [junit4]   2> 2129208 T2240 C926 oasup.LogUpdateProcessor.finish [collection1] webapp=null path=null params={} {add=[10003]} 0 1
   [junit4]   2> 2129218 T2240 C926 oasup.LogUpdateProcessor.finish [collection1] webapp=null path=null params={} {add=[10004]} 0 1
   [junit4]   2> 2129228 T2240 C926 oasup.LogUpdateProcessor.finish [collection1] webapp=null path=null params={} {add=[10005]} 0 1
   [junit4]   2> 2129238 T2240 C926 oasup.LogUpdateProcessor.finish [collection1] webapp=null path=null params={} {add=[10006]} 0 1
   [junit4]   2> 2129247 T2240 C926 oasup.LogUpdateProcessor.finish [collection1] webapp=null path=null params={} {add=[10007]} 0 0
   [junit4]   2> 2129257 T2240 C926 oasup.LogUpdateProcessor.finish [collection1] webapp=null path=null params={} {add=[10008]} 0 1
   [junit4]   2> 2129267 T2240 C926 oasup.LogUpdateProcessor.finish [collection1] webapp=null path=null params={} {add=[10009]} 0 1
   [junit4]   2> 2129277 T2240 C926 oasup.LogUpdateProcessor.finish [collection1] webapp=null path=null params={} {add=[100010]} 0 1
   [junit4]   2> 2129287 T2240 C926 oasup.LogUpdateProcessor.finish [collection1] webapp=null path=null params={} {add=[100011]} 0 1
   [junit4]   2> 2129296 T2240 C926 oasup.LogUpdateProcessor.finish [collection1] webapp=null path=null params={} {add=[100012]} 0 1
   [junit4]   2> 2129306 T2240 C926 oasup.LogUpdateProcessor.finish [collection1] webapp=null path=null params={} {add=[100013]} 0 1
   [junit4]   2> 2129316 T2240 C926 oasup.LogUpdateProcessor.finish [collection1] webapp=null path=null params={} {add=[100014]} 0 0
   [junit4]   2> 2129326 T2240 C926 oasup.LogUpdateProcessor.finish [collection1] webapp=null path=null params={} {add=[100015]} 0 1
   [junit4]   2> 2129336 T2240 C926 oasup.LogUpdateProcessor.finish [collection1] webapp=null path=null params={} {add=[100016]} 0 0
   [junit4]   2> 2129346 T2240 C926 oasup.LogUpdateProcessor.finish [collection1] webapp=null path=null params={} {add=[100017]} 0 0
   [junit4]   2> 2129357 T2240 C926 oasup.LogUpdateProcessor.finish [collection1] webapp=null path=null params={} {add=[100018]} 0 1
   [junit4]   2> 2129367 T2240 C926 oasup.LogUpdateProcessor.finish [collection1] webapp=null path=null params={} {add=[100019]} 0 1
   [junit4]   2> 2129377 T2240 C926 oasup.LogUpdateProcessor.finish [collection1] webapp=null path=null params={} {add=[100020]} 0 1
   [junit4]   2> 2129387 T2240 C926 oasup.LogUpdateProcessor.finish [collection1] webapp=null path=null params={} {add=[100021]} 0 1
   [junit4]   2> 2129397 T2240 C926 oasup.LogUpdateProcessor.finish [collection1] webapp=null path=null params={} {add=[100022]} 0 1
   [junit4]   2> 2129407 T2240 C926 oasup.LogUpdateProcessor.finish [collection1] webapp=null path=null params={} {add=[100023]} 0 1
   [junit4]   2> 2129416 T2240 C926 oasup.LogUpdateProcessor.finish [collection1] webapp=null path=null params={} {add=[100024]} 0 0
   [junit4]   2> 2129426 T2240 C926 oasup.LogUpdateProcessor.finish [collection1] webapp=null path=null params={} {add=[100025]} 0 0
   [junit4]   2> 2129436 T2240 C926 oasup.LogUpdateProcessor.finish [collection1] webapp=null path=null params={} {add=[100026]} 0 0
   [junit4]   2> 2129446 T2240 C926 oasup.LogUpdateProcessor.finish [collection1] webapp=null path=null params={} {add=[100027]} 0 0
   [junit4]   2> 2129456 T2240 C926 oasup.LogUpdateProcessor.finish [collection1] webapp=null path=null params={} {add=[100028]} 0 1
   [junit4]   2> 2129466 T2240 C926 oasup.LogUpdateProcessor.finish [collection1] webapp=null path=null params={} {add=[100029]} 0 1
   [junit4]   2> 2129476 T2240 C926 oasup.LogUpdateProcessor.finish [collection1] webapp=null path=null params={} {add=[100030]} 0 1
   [junit4]   2> 2129486 T2240 C926 oasup.LogUpdateProcessor.finish [collection1] webapp=null path=null params={} {add=[100031]} 0 1
   [junit4]   2> 2129496 T2240 C926 oasup.LogUpdateProcessor.finish [collection1] webapp=null path=null params={} {add=[100032]} 0 1
   [junit4]   2> 2129506 T2240 C926 oasup.LogUpdateProcessor.finish [collection1] webapp=null path=null params={} {add=[100033]} 0 0
   [junit4]   2> 2129516 T2240 C926 oasup.LogUpdateProcessor.finish [collection1] webapp=null path=null params={} {add=[100034]} 0 1
   [junit4]   2> 2129526 T2240 C926 oasup.LogUpdateProcessor.finish [collection1] webapp=null path=null params={} {add=[100035]} 0 1
   [junit4]   2> 2129536 T2240 C926 oasup.LogUpdateProcessor.finish [collection1] webapp=null path=null params={} {add=[100036]} 0 1
   [junit4]   2> 2129546 T2240 C926 oasup.LogUpdateProcessor.finish [collection1] webapp=null path=null params={} {add=[100037]} 0 1
   [junit4]   2> 2129556 T2240 C926 oasup.LogUpdateProcessor.finish [collection1] webapp=null path=null params={} {add=[100038]} 0 1
   [junit4]   2> 2129566 T2240 C926 oasup.LogUpdateProcessor.finish [collection1] webapp=null path=null params={} {add=[100039]} 0 1
   [junit4]   2> 2129576 T2240 C926 oasup.LogUpdateProcessor.finish [collection1] webapp=null path=null params={} {add=[100040]} 0 1
   [junit4]   2> 2129586 T2240 C926 oasup.LogUpdateProcessor.finish [collection1] webapp=null path=null params={} {add=[100041]} 0 1
   [junit4]   2> 2129595 T2240 C926 oasup.LogUpdateProcessor.finish [collection1] webapp=null path=null params={} {add=[100042]} 0 0
   [junit4]   2> 2129605 T2240 C926 oasup.LogUpdateProcessor.finish [collection1] webapp=null path=null params={} {add=[100043]} 0 0
   [junit4]   2> 2129615 T2240 C926 oasup.LogUpdateProcessor.finish [collection1] webapp=null path=null params={} {add=[100044]} 0 1
   [junit4]   2> 2129625 T2240 C926 oasup.LogUpdateProcessor.finish [collection1] webapp=null path=null params={} {add=[100045]} 0 1
   [junit4]   2> 2129635 T2240 C926 oasup.LogUpdateProcessor.finish [collection1] webapp=null path=null params={} {add=[100046]} 0 1
   [junit4]   2> 2129645 T2240 C926 oasup.LogUpdateProcessor.finish [collection1] webapp=null path=null params={} {add=[100047]} 0 1
   [junit4]   2> 2129655 T2240 C926 oasup.LogUpdateProcessor.finish [collection1] webapp=null path=null params={} {add=[100048]} 0 1
   [junit4]   2> 2129664 T2240 C926 oasup.LogUpdateProcessor.finish [collection1] webapp=null path=null params={} {add=[100049]} 0 0
   [junit4]   2> 2129674 T2240 C926 oasup.LogUpdateProcessor.finish [collection1] webapp=null path=null params={} {add=[100050]} 0 0
   [junit4]   2> ASYNC  NEW_CORE C927 name=collection1 org.apache.solr.core.SolrCore@e554da4
   [junit4]   2> 2129702 T2240 C927 oasup.LogUpdateProcessor.finish [collection1] webapp=null path=null params={} {add=[100051]} 0 1
   [junit4]   2> 2129712 T2240 C927 oasup.LogUpdateProcessor.finish [collection1] webapp=null path=null params={} {add=[100052]} 0 0
   [junit4]   2> 2129722 T2240 C927 oasup.LogUpdateProcessor.finish [collection1] webapp=null path=null params={} {add=[100053]} 0 0
   [junit4]   2> 2129732 T2240 C927 oasup.LogUpdateProcessor.finish [collection1] webapp=null path=null params={} {add=[100054]} 0 0
   [junit4]   2> 2129742 T2240 C927 oasup.LogUpdateProcessor.finish [collection1] webapp=null path=null params={} {add=[100055]} 0 0
   [junit4]   2> 2129753 T2240 C927 oasup.LogUpdateProcessor.finish [collection1] webapp=null path=null params={} {add=[100056]} 0 1
   [junit4]   2> 2129762 T2240 C927 oasup.LogUpdateProcessor.finish [collection1] webapp=null path=null params={} {add=[100057]} 0 0
   [junit4]   2> 2129772 T2240 C927 oasup.LogUpdateProcessor.finish [collection1] webapp=null path=null params={} {add=[100058]} 0 0
   [junit4]   2> 2129782 T2240 C927 oasup.LogUpdateProcessor.finish [collection1] webapp=null path=null params={} {add=[100059]} 0 0
   [junit4]   2> 2129792 T2240 C927 oasup.LogUpdateProcessor.finish [collection1] webapp=null path=null params={} {add=[100060]} 0 1
   [junit4]   2> 2129802 T2240 C927 oasup.LogUpdateProcessor.finish [collection1] webapp=null path=null params={} {add=[100061]} 0 1
   [junit4]   2> 2129812 T2240 C927 oasup.LogUpdateProcessor.finish [collection1] webapp=null path=null params={} {add=[100062]} 0 1
   [junit4]   2> 2129821 T2240 C927 oasup.LogUpdateProcessor.finish [collection1] webapp=null path=null params={} {add=[100063]} 0 0
   [junit4]   2> 2129831 T2240 C927 oasup.LogUpdateProcessor.finish [collection1] webapp=null path=null params={} {add=[100064]} 0 1
   [junit4]   2> 2129840 T2240 C927 oasup.LogUpdateProcessor.finish [collection1] webapp=null path=null params={} {add=[100065]} 0 0
   [junit4]   2> 2129850 T2240 C927 oasup.LogUpdateProcessor.finish [collection1] webapp=null path=null params={} {add=[100066]} 0 1
   [junit4]   2> 2129860 T2240 C927 oasup.LogUpdateProcessor.finish [collection1] webapp=null path=null params={} {add=[100067]} 0 1
   [junit4]   2> 2129870 T2240 C927 oasup.LogUpdateProcessor.finish [collection1] webapp=null path=null params={} {add=[100068]} 0 1
   [junit4]   2> 2129880 T2240 C927 oasup.LogUpdateProcessor.finish [collection1] webapp=null path=null params={} {add=[100069]} 0 1
   [junit4]   2> 2129890 T2240 C927 oasup.LogUpdateProcessor.finish [collection1] webapp=null path=null params={} {add=[100070]} 0 1
   [junit4]   2> 2129900 T2240 C927 oasup.LogUpdateProcessor.finish [collection1] webapp=null path=null params={} {add=[100071]} 0 1
   [junit4]   2> 2129909 T2240 C927 oasup.LogUpdateProcessor.finish [collection1] webapp=null path=null params={} {add=[100072]} 0 0
   [junit4]   2> 2129919 T2240 C927 oasup.LogUpdateProcessor.finish [collection1] webapp=null path=null params={} {add=[100073]} 0 1
   [junit4]   2> 2129929 T2240 C927 oasup.LogUpdateProcessor.finish [collection1] webapp=null path=null params={} {add=[100074]} 0 1
   [junit4]   2> 2129938 T2240 C927 oasup.LogUpdateProcessor.finish [collection1] webapp=null path=null params={} {add=[100075]} 0 0
   [junit4]   2> 2129948 T2240 C927 oasup.LogUpdateProcessor.finish [collection1] webapp=null path=null params={} {add=[100076]} 0 1
   [junit4]   2> 2129958 T2240 C927 oasup.LogUpdateProcessor.finish [collection1] webapp=null path=null params={} {add=[100077]} 0 1
   [junit4]   2> 2129967 T2240 C927 oasup.LogUpdateProcessor.finish [collection1] webapp=null path=null params={} {add=[100078]} 0 0
   [junit4]   2> 2129981 T2240 C927 oasup.LogUpdateProcessor.finish [collection1] webapp=null path=null params={} {add=[100079]} 0 1
   [junit4]   2> 2129992 T2240 C927 oasup.LogUpdateProcessor.finish [collection1] webapp=null path=null params={} {add=[100080]} 0 1
   [junit4]   2> 2130002 T2240 C927 oasup.LogUpdateProcessor.finish [collection1] webapp=null path=null params={} {add=[100081]} 0 1
   [junit4]   2> 2130012 T2240 C927 oasup.LogUpdateProcessor.finish [collection1] webapp=null path=null params={} {add=[100082]} 0 1
   [junit4]   2> 2130021 T2240 C927 oasup.LogUpdateProcessor.finish [collection1] webapp=null path=null params={} {add=[100083]} 0 0
   [junit4]   2> 2130031 T2240 C927 oasup.LogUpdateProcessor.finish [collection1] webapp=null path=null params={} {add=[100084]} 0 0
   [junit4]   2> 2130041 T2240 C927 oasup.LogUpdateProcessor.finish [collection1] webapp=null path=null params={} {add=[100085]} 0 1
   [junit4]   2> 2130051 T2240 C927 oasup.LogUpdateProcessor.finish [collection1] webapp=null path=null params={} {add=[100086]} 0 1
   [junit4]   2> 2130061 T2240 C927 oasup.LogUpdateProcessor.finish [collection1] webapp=null path=null params={} {add=[100087]} 0 1
   [junit4]   2> 2130071 T2240 C927 oasup.LogUpdateProcessor.finish [collection1] webapp=null path=null params={} {add=[100088]} 0 1
   [junit4]   2> 2130081 T2240 C927 oasup.LogUpdateProcessor.finish [collection1] webapp=null path=null params={} {add=[100089]} 0 1
   [junit4]   2> 2130090 T2240 C927 oasup.LogUpdateProcessor.finish [collection1] webapp=null path=null params={} {add=[100090]} 0 0
   [junit4]   2> 2130100 T2240 C927 oasup.LogUpdateProcessor.finish [collection1] webapp=null path=null params={} {add=[100091]} 0 0
   [junit4]   2> 2130110 T2240 C927 oasup.LogUpdateProcessor.finish [collection1] webapp=null path=null params={} {add=[100092]} 0 0
   [junit4]   2> 2130120 T2240 C927 oasup.LogUpdateProcessor.finish [collection1] webapp=null path=null params={} {add=[100093]} 0 0
   [junit4]   2> 2130130 T2240 C927 oasup.LogUpdateProcessor.finish [collection1] webapp=null path=null params={} {add=[100094]} 0 0
   [junit4]   2> 2130140 T2240 C927 oasup.LogUpdateProcessor.finish [collection1] webapp=null path=null params={} {add=[100095]} 0 1
   [junit4]   2> 2130150 T2240 C927 oasup.LogUpdateProcessor.finish [collection1] webapp=null path=null params={} {add=[100096]} 0 1
   [junit4]   2> 2130160 T2240 C927 oasup.LogUpdateProcessor.finish [collection1] webapp=null path=null params={} {add=[100097]} 0 1
   [junit4]   2> 2130170 T2240 C927 oasup.LogUpdateProcessor.finish [collection1] webapp=null path=null params={} {add=[100098]} 0 1
   [junit4]   2> 2130180 T2240 C927 oasup.LogUpdateProcessor.finish [collection1] webapp=null path=null params={} {add=[100099]} 0 1
   [junit4]   2> 2130189 T2240 C927 oasu.DirectUpdateHandler2.commit start commit{,optimize=false,openSearcher=true,waitSearcher=true,expungeDeletes=false,softCommit=false,prepareCommit=false}
   [junit4]   2> 2130212 T2240 C927 oasc.SolrDeletionPolicy.onCommit SolrDeletionPolicy.onCommit: commits: num=2
   [junit4]   2> 		commit{dir=MockDirectoryWrapper(org.apache.lucene.store.RAMDirectory@1fcb547a lockFactory=org.apache.lucene.store.SingleInstanceLockFactory@4b58b267),segFN=segments_1,generation=1}
   [junit4]   2> 		commit{dir=MockDirectoryWrapper(org.apache.lucene.store.RAMDirectory@1fcb547a lockFactory=org.apache.lucene.store.SingleInstanceLockFactory@4b58b267),segFN=segments_2,generation=2}
   [junit4]   2> 2130213 T2240 C927 oasc.SolrDeletionPolicy.updateCommits newest commit generation = 2
   [junit4]   2> 2130215 T2240 C927 oass.SolrIndexSearcher.<init> Opening Searcher@7a1574c5 main
   [junit4]   2> 2130216 T2240 C927 oasu.DirectUpdateHandler2.commit end_commit_flush
   [junit4]   2> 2130216 T2242 oasc.SolrCore.registerSearcher [collection1] Registered new searcher Searcher@7a1574c5 main{StandardDirectoryReader(segments_2:4:nrt _0(5.0):c100)}
   [junit4]   2> 2130217 T2240 C927 oasup.LogUpdateProcessor.finish [collection1] webapp=null path=null params={} {commit=} 0 28
   [junit4]   2> 2130752 T2240 C927 oasc.SolrCore.execute [collection1] webapp=null path=null params={o.csr.s.cs2=const_str(this+is+the+second)&o.mr.s.median=median(int_id)&o.cr.s.ccmin=concat(const_str(this+is+the+first),min(string_sd))&o.nr.s.s=neg(sum(int_id))&o.dmr.s.cma=const_str(%2B2MONTHS)&o.ar.s.mcm=add(mean(int_id),count(long_ld),median(int_id))&o.nr.s.count=count(long_ld)&o.nr.s.c=neg(count(long_ld))&o.mr.s.mcm=mult(mean(int_id),count(long_ld),median(int_id))&o.pr.s.su=pow(sum(int_id),unique(long_ld))&o.rr.s.min=min(string_sd)&o.dr.s.sum=sum(int_id)&o.cr.s.csmin=const_str(this+is+the+first)&o.cr.s.min=min(string_sd)&o.ar.s.median=median(int_id)&o.pr.s.unique=unique(long_ld)&o.rr.s.rmax=rev(max(string_sd))&o.pr.s.sum=sum(int_id)&o.mr.s.unique=unique(long_ld)&o.csr.s.cs1=const_str(this+is+the+first)&o.mr.s.mean=mean(int_id)&o.cnr.s.c8=const_num(8)&o.dr.s.unique=unique(long_ld)&o.rr.s.max=max(string_sd)&o.mr.s.su=mult(sum(int_id),unique(long_ld))&o.mr.s.sum=sum(int_id)&o.cnr.s.c10=const_num(10)&o.cdr.s.cd2=const_date(1804-06-30T23:59:59Z)&o.pr.s.count=count(long_ld)&stats=true&q=*:*&o.ar.s.mean=mean(int_id)&o.dmr.s.dmma=date_math(max(date_dtd),const_str(%2B2MONTHS))&o.avr.s.count=count(long_ld)&o.mr.s.count=count(long_ld)&o.cr.s.csmax=const_str(this+is+the+second)&o.csr.s.cs3=const_str(this+is+the+third)&o.nr.s.sum=sum(int_id)&o.cr.s.ccmax=concat(const_str(this+is+the+second),max(string_sd))&o.dr.s.su=div(sum(int_id),unique(long_ld))&rows=0&o.dmr.s.max=max(date_dtd)&olap=true&o.ar.s.su=add(sum(int_id),unique(long_ld))&o.dr.s.mc=div(mean(int_id),count(long_ld))&o.dmr.s.cme=const_str(%2B2YEARS)&o.dr.s.mean=mean(int_id)&o.pr.s.mc=pow(mean(int_id),count(long_ld))&o.dmr.s.median=median(date_dtd)&o.avr.s.sum=sum(int_id)&o.rr.s.rmin=rev(min(string_sd))&o.avr.s.s=abs(neg(sum(int_id)))&o.dmr.s.dmme=date_math(median(date_dtd),const_str(%2B2YEARS))&o.cr.s.max=max(string_sd)&o.dr.s.count=count(long_ld)&o.ar.s.sum=sum(int_id)&o.ar.s.unique=unique(long_ld)&o.cdr.s.cs2=const_str(1804-06-30T23:59:59Z)&o.cdr.s.cd1=const_date(1800-12-31T23:59:59Z)&o.pr.s.mean=mean(int_id)&indent=true&o.cdr.s.cs1=const_str(1800-12-31T23:59:59Z)&o.ar.s.count=count(long_ld)&o.avr.s.c=abs(neg(count(long_ld)))} hits=100 status=0 QTime=524 
   [junit4]   2> 2130772 T2240 oas.SolrTestCaseJ4.setUp ###Starting dateMathTest
   [junit4]   2> 2130787 T2240 oas.SolrTestCaseJ4.tearDown ###Ending dateMathTest
   [junit4]   2> 2130792 T2240 oas.SolrTestCaseJ4.setUp ###Starting multiplyTest
   [junit4]   2> 2130794 T2240 oas.SolrTestCaseJ4.tearDown ###Ending multiplyTest
   [junit4]   2> NOTE: reproduce with: ant test  -Dtestcase=ExpressionTest -Dtests.method=multiplyTest -Dtests.seed=6711B52A90E8F007 -Dtests.multiplier=3 -Dtests.slow=true -Dtests.locale=en_CA -Dtests.timezone=Asia/Bangkok -Dtests.file.encoding=US-ASCII
   [junit4] FAILURE 0.02s J0 | ExpressionTest.multiplyTest <<<
   [junit4]    > Throwable #1: java.lang.AssertionError: Caught exception in getStatResult, xPath = /response/lst[@name='stats']/lst[@name='mr']/double[@name='sum'] 
   [junit4]    > raw data: <?xml version="1.0" encoding="UTF-8"?>
   [junit4]    > <response>
   [junit4]    > <lst name="responseHeader">
   [junit4]    >   <int name="status">0</int>
   [junit4]    >   <int name="QTime">524</int>
   [junit4]    > </lst>
   [junit4]    > <result name="response" numFound="100" start="0">
   [junit4]    > </result>
   [junit4]    > <lst name="stats">
   [junit4]    >   <lst name="stats_fields"/>
   [junit4]    > </lst>
   [junit4]    > <lst name="stats">
   [junit4]    >   <lst name="cdr">
   [junit4]    >     <date name="cd1">1800-12-31T23:59:59Z</date>
   [junit4]    >     <date name="cd2">1804-06-30T23:59:59Z</date>
   [junit4]    >     <str name="cs1">1800-12-31T23:59:59Z</str>
   [junit4]    >     <str name="cs2">1804-06-30T23:59:59Z</str>
   [junit4]    >   </lst>
   [junit4]    >   <lst name="dmr">
   [junit4]    >     <str name="cma">+2MONTHS</str>
   [junit4]    >     <str name="cme">+2YEARS</str>
   [junit4]    >     <date name="dmma">1812-02-29T23:59:59Z</date>
   [junit4]    >     <date name="dmme">1807-12-31T23:59:59Z</date>
   [junit4]    >     <date name="max">1811-12-31T23:59:59Z</date>
   [junit4]    >     <date name="median">1805-12-31T23:59:59Z</date>
   [junit4]    >   </lst>
   [junit4]    >   <lst name="ar">
   [junit4]    >     <long name="count">100</long>
   [junit4]    >     <null name="mcm"/>
   [junit4]    >     <null name="mean"/>
   [junit4]    >     <null name="median"/>
   [junit4]    >     <null name="su"/>
   [junit4]    >     <null name="sum"/>
   [junit4]    >     <null name="unique"/>
   [junit4]    >   </lst>
   [junit4]    >   <lst name="pr">
   [junit4]    >     <long name="count">100</long>
   [junit4]    >     <null name="mc"/>
   [junit4]    >     <null name="mean"/>
   [junit4]    >     <null name="su"/>
   [junit4]    >     <null name="sum"/>
   [junit4]    >     <null name="unique"/>
   [junit4]    >   </lst>
   [junit4]    >   <lst name="cr">
   [junit4]    >     <str name="ccmax">this is the secondstr9</str>
   [junit4]    >     <str name="ccmin">this is the firststr0</str>
   [junit4]    >     <str name="csmax">this is the second</str>
   [junit4]    >     <str name="csmin">this is the first</str>
   [junit4]    >     <str name="max">str9</str>
   [junit4]    >     <str name="min">str0</str>
   [junit4]    >   </lst>
   [junit4]    >   <lst name="cnr">
   [junit4]    >     <double name="c10">10.0</double>
   [junit4]    >     <double name="c8">8.0</double>
   [junit4]    >   </lst>
   [junit4]    >   <lst name="mr">
   [junit4]    >     <long name="count">100</long>
   [junit4]    >     <null name="mcm"/>
   [junit4]    >     <null name="mean"/>
   [junit4]    >     <null name="median"/>
   [junit4]    >     <null name="su"/>
   [junit4]    >     <null name="sum"/>
   [junit4]    >     <null name="unique"/>
   [junit4]    >   </lst>
   [junit4]    >   <lst name="avr">
   [junit4]    >     <double name="c">100.0</double>
   [junit4]    >     <long name="count">100</long>
   [junit4]    >     <null name="s"/>
   [junit4]    >     <null name="sum"/>
   [junit4]    >   </lst>
   [junit4]    >   <lst name="csr">
   [junit4]    >     <str name="cs1">this is the first</str>
   [junit4]    >     <str name="cs2">this is the second</str>
   [junit4]    >     <str name="cs3">this is the third</str>
   [junit4]    >   </lst>
   [junit4]    >   <lst name="nr">
   [junit4]    >     <double name="c">-100.0</double>
   [junit4]    >     <long name="count">100</long>
   [junit4]    >     <null name="s"/>
   [junit4]    >     <null name="sum"/>
   [junit4]    >   </lst>
   [junit4]    >   <lst name="dr">
   [junit4] 

[...truncated too long message...]

07-12-31T23:59:59Z</date>
   [junit4]    >     <date name="max">1811-12-31T23:59:59Z</date>
   [junit4]    >     <date name="median">1805-12-31T23:59:59Z</date>
   [junit4]    >   </lst>
   [junit4]    >   <lst name="ar">
   [junit4]    >     <long name="count">100</long>
   [junit4]    >     <null name="mcm"/>
   [junit4]    >     <null name="mean"/>
   [junit4]    >     <null name="median"/>
   [junit4]    >     <null name="su"/>
   [junit4]    >     <null name="sum"/>
   [junit4]    >     <null name="unique"/>
   [junit4]    >   </lst>
   [junit4]    >   <lst name="pr">
   [junit4]    >     <long name="count">100</long>
   [junit4]    >     <null name="mc"/>
   [junit4]    >     <null name="mean"/>
   [junit4]    >     <null name="su"/>
   [junit4]    >     <null name="sum"/>
   [junit4]    >     <null name="unique"/>
   [junit4]    >   </lst>
   [junit4]    >   <lst name="cr">
   [junit4]    >     <str name="ccmax">this is the secondstr9</str>
   [junit4]    >     <str name="ccmin">this is the firststr0</str>
   [junit4]    >     <str name="csmax">this is the second</str>
   [junit4]    >     <str name="csmin">this is the first</str>
   [junit4]    >     <str name="max">str9</str>
   [junit4]    >     <str name="min">str0</str>
   [junit4]    >   </lst>
   [junit4]    >   <lst name="cnr">
   [junit4]    >     <double name="c10">10.0</double>
   [junit4]    >     <double name="c8">8.0</double>
   [junit4]    >   </lst>
   [junit4]    >   <lst name="mr">
   [junit4]    >     <long name="count">100</long>
   [junit4]    >     <null name="mcm"/>
   [junit4]    >     <null name="mean"/>
   [junit4]    >     <null name="median"/>
   [junit4]    >     <null name="su"/>
   [junit4]    >     <null name="sum"/>
   [junit4]    >     <null name="unique"/>
   [junit4]    >   </lst>
   [junit4]    >   <lst name="avr">
   [junit4]    >     <double name="c">100.0</double>
   [junit4]    >     <long name="count">100</long>
   [junit4]    >     <null name="s"/>
   [junit4]    >     <null name="sum"/>
   [junit4]    >   </lst>
   [junit4]    >   <lst name="csr">
   [junit4]    >     <str name="cs1">this is the first</str>
   [junit4]    >     <str name="cs2">this is the second</str>
   [junit4]    >     <str name="cs3">this is the third</str>
   [junit4]    >   </lst>
   [junit4]    >   <lst name="nr">
   [junit4]    >     <double name="c">-100.0</double>
   [junit4]    >     <long name="count">100</long>
   [junit4]    >     <null name="s"/>
   [junit4]    >     <null name="sum"/>
   [junit4]    >   </lst>
   [junit4]    >   <lst name="dr">
   [junit4]    >     <long name="count">100</long>
   [junit4]    >     <null name="mc"/>
   [junit4]    >     <null name="mean"/>
   [junit4]    >     <null name="su"/>
   [junit4]    >     <null name="sum"/>
   [junit4]    >     <null name="unique"/>
   [junit4]    >   </lst>
   [junit4]    >   <lst name="rr">
   [junit4]    >     <str name="max">str9</str>
   [junit4]    >     <str name="min">str0</str>
   [junit4]    >     <str name="rmax">9rts</str>
   [junit4]    >     <str name="rmin">0rts</str>
   [junit4]    >   </lst>
   [junit4]    > </lst>
   [junit4]    > </response>
   [junit4]    > 	at __randomizedtesting.SeedInfo.seed([6711B52A90E8F007:46BD953F5D75A861]:0)
   [junit4]    > 	at org.apache.solr.analytics.AbstractAnalyticsStatsTest.getStatResult(AbstractAnalyticsStatsTest.java:113)
   [junit4]    > 	at org.apache.solr.analytics.expression.ExpressionTest.absoluteValueTest(ExpressionTest.java:143)
   [junit4]    > 	at java.lang.Thread.run(Thread.java:724)
   [junit4]   2> 2130919 T2240 oas.SolrTestCaseJ4.deleteCore ###deleteCore
   [junit4]   2> 2130920 T2240 oasc.CoreContainer.shutdown Shutting down CoreContainer instance=1550842784
   [junit4]   2> 2130920 T2240 oasc.SolrCore.close [collection1]  CLOSING SolrCore org.apache.solr.core.SolrCore@e554da4
   [junit4]   2> 2130920 T2240 oasu.DirectUpdateHandler2.close closing DirectUpdateHandler2{commits=1,autocommits=0,soft autocommits=0,optimizes=0,rollbacks=0,expungeDeletes=0,docsPending=0,adds=0,deletesById=0,deletesByQuery=0,errors=0,cumulative_adds=100,cumulative_deletesById=0,cumulative_deletesByQuery=1,cumulative_errors=0}
   [junit4]   2> 2130920 T2240 oasu.SolrCoreState.decrefSolrCoreState Closing SolrCoreState
   [junit4]   2> 2130921 T2240 oasu.DefaultSolrCoreState.closeIndexWriter SolrCoreState ref count has reached 0 - closing IndexWriter
   [junit4]   2> 2130921 T2240 oasu.DefaultSolrCoreState.closeIndexWriter closing IndexWriter with IndexWriterCloser
   [junit4]   2> 2130921 T2240 oasc.SolrCore.closeSearcher [collection1] Closing main searcher on request.
   [junit4]   2> 2130922 T2240 oasc.CachingDirectoryFactory.close Closing MockDirectoryFactory - 2 directories currently being tracked
   [junit4]   2> 2130922 T2240 oasc.CachingDirectoryFactory.closeCacheValue looking to close /usr/home/hudson/hudson-slave/workspace/Lucene-Solr-Tests-trunk-Java7/solr/build/solr-core/test/J0/./solrtest-ExpressionTest-1388229932578 [CachedDir<<refCount=0;path=/usr/home/hudson/hudson-slave/workspace/Lucene-Solr-Tests-trunk-Java7/solr/build/solr-core/test/J0/./solrtest-ExpressionTest-1388229932578;done=false>>]
   [junit4]   2> 2130922 T2240 oasc.CachingDirectoryFactory.close Closing directory: /usr/home/hudson/hudson-slave/workspace/Lucene-Solr-Tests-trunk-Java7/solr/build/solr-core/test/J0/./solrtest-ExpressionTest-1388229932578
   [junit4]   2> 2130922 T2240 oasc.CachingDirectoryFactory.closeCacheValue looking to close /usr/home/hudson/hudson-slave/workspace/Lucene-Solr-Tests-trunk-Java7/solr/build/solr-core/test/J0/./solrtest-ExpressionTest-1388229932578/index [CachedDir<<refCount=0;path=/usr/home/hudson/hudson-slave/workspace/Lucene-Solr-Tests-trunk-Java7/solr/build/solr-core/test/J0/./solrtest-ExpressionTest-1388229932578/index;done=false>>]
   [junit4]   2> 2130923 T2240 oasc.CachingDirectoryFactory.close Closing directory: /usr/home/hudson/hudson-slave/workspace/Lucene-Solr-Tests-trunk-Java7/solr/build/solr-core/test/J0/./solrtest-ExpressionTest-1388229932578/index
   [junit4]   2> NOTE: test params are: codec=Lucene46: {id=PostingsFormat(name=Memory doPackFST= false), double_dd=MockFixedIntBlock(blockSize=621), string_sd=FST41, float_fd=FST41, date_dtd=PostingsFormat(name=Memory doPackFST= false), long_ld=PostingsFormat(name=Memory doPackFST= false), int_id=FST41}, docValues:{doubledv=DocValuesFormat(name=Memory), stringdv=DocValuesFormat(name=Memory), double_dd=DocValuesFormat(name=Disk), float_fd=DocValuesFormat(name=SimpleText), datedv=DocValuesFormat(name=Lucene45), longdv=DocValuesFormat(name=Disk), long_ld=DocValuesFormat(name=Memory), floatdv=DocValuesFormat(name=Disk), stringdvm=DocValuesFormat(name=Disk), string_sd=DocValuesFormat(name=SimpleText), date_dtd=DocValuesFormat(name=Memory), intdv=DocValuesFormat(name=SimpleText), int_id=DocValuesFormat(name=SimpleText)}, sim=DefaultSimilarity, locale=en_CA, timezone=Asia/Bangkok
   [junit4]   2> NOTE: FreeBSD 9.1-RELEASE-p3 amd64/Oracle Corporation 1.7.0_25 (64-bit)/cpus=16,threads=1,free=247796632,total=352321536
   [junit4]   2> NOTE: All tests run in this JVM: [SliceStateTest, BadComponentTest, TestCoreContainer, TestSchemaSimilarityResource, QueryResultKeyTest, HdfsRecoveryZkTest, CircularListTest, WordBreakSolrSpellCheckerTest, RegexBoostProcessorTest, DateMathParserTest, SoftAutoCommitTest, TestPHPSerializedResponseWriter, HdfsLockFactoryTest, HdfsBasicDistributedZk2Test, TestRandomDVFaceting, LeaderElectionTest, TestDocSet, DOMUtilTest, LoggingHandlerTest, TestFieldCollectionResource, TestLFUCache, TestModifyConfFiles, DocValuesMissingTest, SolrXmlInZkTest, SyncSliceTest, TermVectorComponentTest, TestSchemaVersionResource, TestLMDirichletSimilarityFactory, SpellPossibilityIteratorTest, TestJoin, TestSystemIdResolver, TestFaceting, TestGroupingSearch, SolrCoreTest, EchoParamsTest, TestReloadAndDeleteDocs, DeleteReplicaTest, ZkControllerTest, TestJmxMonitoredMap, RecoveryZkTest, TestConfig, TestPseudoReturnFields, ModifyConfFileTest, QueryElevationComponentTest, DistributedSpellCheckComponentTest, FieldMutatingUpdateProcessorTest, TestDocBasedVersionConstraints, OverseerCollectionProcessorTest, PreAnalyzedUpdateProcessorTest, HdfsBasicDistributedZkTest, TestRemoteStreaming, DistributedTermsComponentTest, OverseerTest, CoreAdminCreateDiscoverTest, IndexSchemaTest, HdfsChaosMonkeySafeLeaderTest, TestManagedSchema, UpdateParamsTest, ClusterStateUpdateTest, ExpressionTest]
   [junit4] Completed on J0 in 2.47s, 12 tests, 6 failures <<< FAILURES!

[...truncated 445 lines...]
BUILD FAILED
/usr/home/hudson/hudson-slave/workspace/Lucene-Solr-Tests-trunk-Java7/build.xml:453: The following error occurred while executing this line:
/usr/home/hudson/hudson-slave/workspace/Lucene-Solr-Tests-trunk-Java7/build.xml:433: The following error occurred while executing this line:
/usr/home/hudson/hudson-slave/workspace/Lucene-Solr-Tests-trunk-Java7/build.xml:39: The following error occurred while executing this line:
/usr/home/hudson/hudson-slave/workspace/Lucene-Solr-Tests-trunk-Java7/extra-targets.xml:37: The following error occurred while executing this line:
/usr/home/hudson/hudson-slave/workspace/Lucene-Solr-Tests-trunk-Java7/solr/build.xml:189: The following error occurred while executing this line:
/usr/home/hudson/hudson-slave/workspace/Lucene-Solr-Tests-trunk-Java7/solr/common-build.xml:491: The following error occurred while executing this line:
/usr/home/hudson/hudson-slave/workspace/Lucene-Solr-Tests-trunk-Java7/lucene/common-build.xml:1304: The following error occurred while executing this line:
/usr/home/hudson/hudson-slave/workspace/Lucene-Solr-Tests-trunk-Java7/lucene/common-build.xml:937: There were test failures: 357 suites, 1573 tests, 6 failures, 34 ignored (6 assumptions)

Total time: 67 minutes 55 seconds
Build step 'Invoke Ant' marked build as failure
Archiving artifacts
Recording test results
Email was triggered for: Failure
Sending email for trigger: Failure



Mime
View raw message