lucene-dev mailing list archives

Site index · List index
Message view « Date » · « Thread »
Top « Date » · « Thread »
From Policeman Jenkins Server <jenk...@thetaphi.de>
Subject [JENKINS] Lucene-Solr-4.x-Linux (32bit/ibm-j9-jdk7) - Build # 8650 - Failure!
Date Thu, 19 Dec 2013 20:15:18 GMT
Build: http://jenkins.thetaphi.de/job/Lucene-Solr-4.x-Linux/8650/
Java: 32bit/ibm-j9-jdk7 -Xjit:exclude={org/apache/lucene/util/fst/FST.pack(IIF)Lorg/apache/lucene/util/fst/FST;}

4 tests failed.
REGRESSION:  org.apache.solr.cloud.OverseerTest.testOverseerFailure

Error Message:
KeeperErrorCode = NodeExists for /collections/collection1/leaders/shard1

Stack Trace:
org.apache.zookeeper.KeeperException$NodeExistsException: KeeperErrorCode = NodeExists for /collections/collection1/leaders/shard1
	at __randomizedtesting.SeedInfo.seed([EE51E7AC3A7F4D47:EA59685F28DAA266]:0)
	at org.apache.zookeeper.KeeperException.create(KeeperException.java:119)
	at org.apache.zookeeper.KeeperException.create(KeeperException.java:51)
	at org.apache.zookeeper.ZooKeeper.create(ZooKeeper.java:783)
	at org.apache.solr.common.cloud.SolrZkClient$10.execute(SolrZkClient.java:424)
	at org.apache.solr.common.cloud.ZkCmdExecutor.retryOperation(ZkCmdExecutor.java:65)
	at org.apache.solr.common.cloud.SolrZkClient.makePath(SolrZkClient.java:421)
	at org.apache.solr.common.cloud.SolrZkClient.makePath(SolrZkClient.java:378)
	at org.apache.solr.common.cloud.SolrZkClient.makePath(SolrZkClient.java:365)
	at org.apache.solr.cloud.ShardLeaderElectionContextBase.runLeaderProcess(ElectionContext.java:102)
	at org.apache.solr.cloud.LeaderElector.runIamLeaderProcess(LeaderElector.java:165)
	at org.apache.solr.cloud.LeaderElector.checkIfIamLeader(LeaderElector.java:109)
	at org.apache.solr.cloud.LeaderElector.checkIfIamLeader(LeaderElector.java:157)
	at org.apache.solr.cloud.LeaderElector.joinElection(LeaderElector.java:277)
	at org.apache.solr.cloud.OverseerTest$MockZKController.publishState(OverseerTest.java:153)
	at org.apache.solr.cloud.OverseerTest.testOverseerFailure(OverseerTest.java:584)
	at sun.reflect.NativeMethodAccessorImpl.invoke0(Native Method)
	at sun.reflect.NativeMethodAccessorImpl.invoke(NativeMethodAccessorImpl.java:88)
	at sun.reflect.DelegatingMethodAccessorImpl.invoke(DelegatingMethodAccessorImpl.java:55)
	at java.lang.reflect.Method.invoke(Method.java:613)
	at com.carrotsearch.randomizedtesting.RandomizedRunner.invoke(RandomizedRunner.java:1559)
	at com.carrotsearch.randomizedtesting.RandomizedRunner.access$600(RandomizedRunner.java:79)
	at com.carrotsearch.randomizedtesting.RandomizedRunner$6.evaluate(RandomizedRunner.java:737)
	at com.carrotsearch.randomizedtesting.RandomizedRunner$7.evaluate(RandomizedRunner.java:773)
	at com.carrotsearch.randomizedtesting.RandomizedRunner$8.evaluate(RandomizedRunner.java:787)
	at com.carrotsearch.randomizedtesting.rules.SystemPropertiesRestoreRule$1.evaluate(SystemPropertiesRestoreRule.java:53)
	at org.apache.lucene.util.TestRuleSetupTeardownChained$1.evaluate(TestRuleSetupTeardownChained.java:50)
	at org.apache.lucene.util.TestRuleFieldCacheSanity$1.evaluate(TestRuleFieldCacheSanity.java:51)
	at org.apache.lucene.util.AbstractBeforeAfterRule$1.evaluate(AbstractBeforeAfterRule.java:46)
	at com.carrotsearch.randomizedtesting.rules.SystemPropertiesInvariantRule$1.evaluate(SystemPropertiesInvariantRule.java:55)
	at org.apache.lucene.util.TestRuleThreadAndTestName$1.evaluate(TestRuleThreadAndTestName.java:49)
	at org.apache.lucene.util.TestRuleIgnoreAfterMaxFailures$1.evaluate(TestRuleIgnoreAfterMaxFailures.java:70)
	at org.apache.lucene.util.TestRuleMarkFailure$1.evaluate(TestRuleMarkFailure.java:48)
	at com.carrotsearch.randomizedtesting.rules.StatementAdapter.evaluate(StatementAdapter.java:36)
	at com.carrotsearch.randomizedtesting.ThreadLeakControl$StatementRunner.run(ThreadLeakControl.java:358)
	at com.carrotsearch.randomizedtesting.ThreadLeakControl.forkTimeoutingTask(ThreadLeakControl.java:782)
	at com.carrotsearch.randomizedtesting.ThreadLeakControl$3.evaluate(ThreadLeakControl.java:442)
	at com.carrotsearch.randomizedtesting.RandomizedRunner.runSingleTest(RandomizedRunner.java:746)
	at com.carrotsearch.randomizedtesting.RandomizedRunner$3.evaluate(RandomizedRunner.java:648)
	at com.carrotsearch.randomizedtesting.RandomizedRunner$4.evaluate(RandomizedRunner.java:682)
	at com.carrotsearch.randomizedtesting.RandomizedRunner$5.evaluate(RandomizedRunner.java:693)
	at com.carrotsearch.randomizedtesting.rules.StatementAdapter.evaluate(StatementAdapter.java:36)
	at com.carrotsearch.randomizedtesting.rules.SystemPropertiesRestoreRule$1.evaluate(SystemPropertiesRestoreRule.java:53)
	at org.apache.lucene.util.AbstractBeforeAfterRule$1.evaluate(AbstractBeforeAfterRule.java:46)
	at org.apache.lucene.util.TestRuleStoreClassName$1.evaluate(TestRuleStoreClassName.java:42)
	at com.carrotsearch.randomizedtesting.rules.SystemPropertiesInvariantRule$1.evaluate(SystemPropertiesInvariantRule.java:55)
	at com.carrotsearch.randomizedtesting.rules.NoShadowingOrOverridesOnMethodsRule$1.evaluate(NoShadowingOrOverridesOnMethodsRule.java:39)
	at com.carrotsearch.randomizedtesting.rules.NoShadowingOrOverridesOnMethodsRule$1.evaluate(NoShadowingOrOverridesOnMethodsRule.java:39)
	at com.carrotsearch.randomizedtesting.rules.StatementAdapter.evaluate(StatementAdapter.java:36)
	at org.apache.lucene.util.TestRuleAssertionsRequired$1.evaluate(TestRuleAssertionsRequired.java:43)
	at org.apache.lucene.util.TestRuleMarkFailure$1.evaluate(TestRuleMarkFailure.java:48)
	at org.apache.lucene.util.TestRuleIgnoreAfterMaxFailures$1.evaluate(TestRuleIgnoreAfterMaxFailures.java:70)
	at org.apache.lucene.util.TestRuleIgnoreTestSuites$1.evaluate(TestRuleIgnoreTestSuites.java:55)
	at com.carrotsearch.randomizedtesting.rules.StatementAdapter.evaluate(StatementAdapter.java:36)
	at com.carrotsearch.randomizedtesting.ThreadLeakControl$StatementRunner.run(ThreadLeakControl.java:358)
	at java.lang.Thread.run(Thread.java:780)


REGRESSION:  org.apache.solr.handler.component.DistributedQueryElevationComponentTest.testDistribSearch

Error Message:
.responseHeader.params.rows!=fl (unordered or missing)

Stack Trace:
junit.framework.AssertionFailedError: .responseHeader.params.rows!=fl (unordered or missing)
	at __randomizedtesting.SeedInfo.seed([EE51E7AC3A7F4D47:6FB769B44D202D7B]:0)
	at junit.framework.Assert.fail(Assert.java:50)
	at org.apache.solr.BaseDistributedSearchTestCase.compareSolrResponses(BaseDistributedSearchTestCase.java:822)
	at org.apache.solr.BaseDistributedSearchTestCase.compareResponses(BaseDistributedSearchTestCase.java:841)
	at org.apache.solr.BaseDistributedSearchTestCase.query(BaseDistributedSearchTestCase.java:544)
	at org.apache.solr.BaseDistributedSearchTestCase.query(BaseDistributedSearchTestCase.java:521)
	at org.apache.solr.handler.component.DistributedQueryElevationComponentTest.doTest(DistributedQueryElevationComponentTest.java:81)
	at org.apache.solr.BaseDistributedSearchTestCase.testDistribSearch(BaseDistributedSearchTestCase.java:849)
	at sun.reflect.NativeMethodAccessorImpl.invoke0(Native Method)
	at sun.reflect.NativeMethodAccessorImpl.invoke(NativeMethodAccessorImpl.java:88)
	at sun.reflect.DelegatingMethodAccessorImpl.invoke(DelegatingMethodAccessorImpl.java:55)
	at java.lang.reflect.Method.invoke(Method.java:613)
	at com.carrotsearch.randomizedtesting.RandomizedRunner.invoke(RandomizedRunner.java:1559)
	at com.carrotsearch.randomizedtesting.RandomizedRunner.access$600(RandomizedRunner.java:79)
	at com.carrotsearch.randomizedtesting.RandomizedRunner$6.evaluate(RandomizedRunner.java:737)
	at com.carrotsearch.randomizedtesting.RandomizedRunner$7.evaluate(RandomizedRunner.java:773)
	at com.carrotsearch.randomizedtesting.RandomizedRunner$8.evaluate(RandomizedRunner.java:787)
	at com.carrotsearch.randomizedtesting.rules.SystemPropertiesRestoreRule$1.evaluate(SystemPropertiesRestoreRule.java:53)
	at org.apache.lucene.util.TestRuleSetupTeardownChained$1.evaluate(TestRuleSetupTeardownChained.java:50)
	at org.apache.lucene.util.TestRuleFieldCacheSanity$1.evaluate(TestRuleFieldCacheSanity.java:51)
	at org.apache.lucene.util.AbstractBeforeAfterRule$1.evaluate(AbstractBeforeAfterRule.java:46)
	at com.carrotsearch.randomizedtesting.rules.SystemPropertiesInvariantRule$1.evaluate(SystemPropertiesInvariantRule.java:55)
	at org.apache.lucene.util.TestRuleThreadAndTestName$1.evaluate(TestRuleThreadAndTestName.java:49)
	at org.apache.lucene.util.TestRuleIgnoreAfterMaxFailures$1.evaluate(TestRuleIgnoreAfterMaxFailures.java:70)
	at org.apache.lucene.util.TestRuleMarkFailure$1.evaluate(TestRuleMarkFailure.java:48)
	at com.carrotsearch.randomizedtesting.rules.StatementAdapter.evaluate(StatementAdapter.java:36)
	at com.carrotsearch.randomizedtesting.ThreadLeakControl$StatementRunner.run(ThreadLeakControl.java:358)
	at com.carrotsearch.randomizedtesting.ThreadLeakControl.forkTimeoutingTask(ThreadLeakControl.java:782)
	at com.carrotsearch.randomizedtesting.ThreadLeakControl$3.evaluate(ThreadLeakControl.java:442)
	at com.carrotsearch.randomizedtesting.RandomizedRunner.runSingleTest(RandomizedRunner.java:746)
	at com.carrotsearch.randomizedtesting.RandomizedRunner$3.evaluate(RandomizedRunner.java:648)
	at com.carrotsearch.randomizedtesting.RandomizedRunner$4.evaluate(RandomizedRunner.java:682)
	at com.carrotsearch.randomizedtesting.RandomizedRunner$5.evaluate(RandomizedRunner.java:693)
	at com.carrotsearch.randomizedtesting.rules.StatementAdapter.evaluate(StatementAdapter.java:36)
	at com.carrotsearch.randomizedtesting.rules.SystemPropertiesRestoreRule$1.evaluate(SystemPropertiesRestoreRule.java:53)
	at org.apache.lucene.util.AbstractBeforeAfterRule$1.evaluate(AbstractBeforeAfterRule.java:46)
	at org.apache.lucene.util.TestRuleStoreClassName$1.evaluate(TestRuleStoreClassName.java:42)
	at com.carrotsearch.randomizedtesting.rules.SystemPropertiesInvariantRule$1.evaluate(SystemPropertiesInvariantRule.java:55)
	at com.carrotsearch.randomizedtesting.rules.NoShadowingOrOverridesOnMethodsRule$1.evaluate(NoShadowingOrOverridesOnMethodsRule.java:39)
	at com.carrotsearch.randomizedtesting.rules.NoShadowingOrOverridesOnMethodsRule$1.evaluate(NoShadowingOrOverridesOnMethodsRule.java:39)
	at com.carrotsearch.randomizedtesting.rules.StatementAdapter.evaluate(StatementAdapter.java:36)
	at org.apache.lucene.util.TestRuleAssertionsRequired$1.evaluate(TestRuleAssertionsRequired.java:43)
	at org.apache.lucene.util.TestRuleMarkFailure$1.evaluate(TestRuleMarkFailure.java:48)
	at org.apache.lucene.util.TestRuleIgnoreAfterMaxFailures$1.evaluate(TestRuleIgnoreAfterMaxFailures.java:70)
	at org.apache.lucene.util.TestRuleIgnoreTestSuites$1.evaluate(TestRuleIgnoreTestSuites.java:55)
	at com.carrotsearch.randomizedtesting.rules.StatementAdapter.evaluate(StatementAdapter.java:36)
	at com.carrotsearch.randomizedtesting.ThreadLeakControl$StatementRunner.run(ThreadLeakControl.java:358)
	at java.lang.Thread.run(Thread.java:780)


REGRESSION:  org.apache.solr.handler.component.TermVectorComponentDistributedTest.testDistribSearch

Error Message:
.termVectors.0.test_offtv!=test_basictv (unordered or missing)

Stack Trace:
junit.framework.AssertionFailedError: .termVectors.0.test_offtv!=test_basictv (unordered or missing)
	at __randomizedtesting.SeedInfo.seed([EE51E7AC3A7F4D47:6FB769B44D202D7B]:0)
	at junit.framework.Assert.fail(Assert.java:50)
	at org.apache.solr.BaseDistributedSearchTestCase.compareSolrResponses(BaseDistributedSearchTestCase.java:822)
	at org.apache.solr.BaseDistributedSearchTestCase.compareResponses(BaseDistributedSearchTestCase.java:841)
	at org.apache.solr.BaseDistributedSearchTestCase.query(BaseDistributedSearchTestCase.java:544)
	at org.apache.solr.BaseDistributedSearchTestCase.query(BaseDistributedSearchTestCase.java:521)
	at org.apache.solr.handler.component.TermVectorComponentDistributedTest.doTest(TermVectorComponentDistributedTest.java:137)
	at org.apache.solr.BaseDistributedSearchTestCase.testDistribSearch(BaseDistributedSearchTestCase.java:855)
	at sun.reflect.NativeMethodAccessorImpl.invoke0(Native Method)
	at sun.reflect.NativeMethodAccessorImpl.invoke(NativeMethodAccessorImpl.java:88)
	at sun.reflect.DelegatingMethodAccessorImpl.invoke(DelegatingMethodAccessorImpl.java:55)
	at java.lang.reflect.Method.invoke(Method.java:613)
	at com.carrotsearch.randomizedtesting.RandomizedRunner.invoke(RandomizedRunner.java:1559)
	at com.carrotsearch.randomizedtesting.RandomizedRunner.access$600(RandomizedRunner.java:79)
	at com.carrotsearch.randomizedtesting.RandomizedRunner$6.evaluate(RandomizedRunner.java:737)
	at com.carrotsearch.randomizedtesting.RandomizedRunner$7.evaluate(RandomizedRunner.java:773)
	at com.carrotsearch.randomizedtesting.RandomizedRunner$8.evaluate(RandomizedRunner.java:787)
	at com.carrotsearch.randomizedtesting.rules.SystemPropertiesRestoreRule$1.evaluate(SystemPropertiesRestoreRule.java:53)
	at org.apache.lucene.util.TestRuleSetupTeardownChained$1.evaluate(TestRuleSetupTeardownChained.java:50)
	at org.apache.lucene.util.TestRuleFieldCacheSanity$1.evaluate(TestRuleFieldCacheSanity.java:51)
	at org.apache.lucene.util.AbstractBeforeAfterRule$1.evaluate(AbstractBeforeAfterRule.java:46)
	at com.carrotsearch.randomizedtesting.rules.SystemPropertiesInvariantRule$1.evaluate(SystemPropertiesInvariantRule.java:55)
	at org.apache.lucene.util.TestRuleThreadAndTestName$1.evaluate(TestRuleThreadAndTestName.java:49)
	at org.apache.lucene.util.TestRuleIgnoreAfterMaxFailures$1.evaluate(TestRuleIgnoreAfterMaxFailures.java:70)
	at org.apache.lucene.util.TestRuleMarkFailure$1.evaluate(TestRuleMarkFailure.java:48)
	at com.carrotsearch.randomizedtesting.rules.StatementAdapter.evaluate(StatementAdapter.java:36)
	at com.carrotsearch.randomizedtesting.ThreadLeakControl$StatementRunner.run(ThreadLeakControl.java:358)
	at com.carrotsearch.randomizedtesting.ThreadLeakControl.forkTimeoutingTask(ThreadLeakControl.java:782)
	at com.carrotsearch.randomizedtesting.ThreadLeakControl$3.evaluate(ThreadLeakControl.java:442)
	at com.carrotsearch.randomizedtesting.RandomizedRunner.runSingleTest(RandomizedRunner.java:746)
	at com.carrotsearch.randomizedtesting.RandomizedRunner$3.evaluate(RandomizedRunner.java:648)
	at com.carrotsearch.randomizedtesting.RandomizedRunner$4.evaluate(RandomizedRunner.java:682)
	at com.carrotsearch.randomizedtesting.RandomizedRunner$5.evaluate(RandomizedRunner.java:693)
	at com.carrotsearch.randomizedtesting.rules.StatementAdapter.evaluate(StatementAdapter.java:36)
	at com.carrotsearch.randomizedtesting.rules.SystemPropertiesRestoreRule$1.evaluate(SystemPropertiesRestoreRule.java:53)
	at org.apache.lucene.util.AbstractBeforeAfterRule$1.evaluate(AbstractBeforeAfterRule.java:46)
	at org.apache.lucene.util.TestRuleStoreClassName$1.evaluate(TestRuleStoreClassName.java:42)
	at com.carrotsearch.randomizedtesting.rules.SystemPropertiesInvariantRule$1.evaluate(SystemPropertiesInvariantRule.java:55)
	at com.carrotsearch.randomizedtesting.rules.NoShadowingOrOverridesOnMethodsRule$1.evaluate(NoShadowingOrOverridesOnMethodsRule.java:39)
	at com.carrotsearch.randomizedtesting.rules.NoShadowingOrOverridesOnMethodsRule$1.evaluate(NoShadowingOrOverridesOnMethodsRule.java:39)
	at com.carrotsearch.randomizedtesting.rules.StatementAdapter.evaluate(StatementAdapter.java:36)
	at org.apache.lucene.util.TestRuleAssertionsRequired$1.evaluate(TestRuleAssertionsRequired.java:43)
	at org.apache.lucene.util.TestRuleMarkFailure$1.evaluate(TestRuleMarkFailure.java:48)
	at org.apache.lucene.util.TestRuleIgnoreAfterMaxFailures$1.evaluate(TestRuleIgnoreAfterMaxFailures.java:70)
	at org.apache.lucene.util.TestRuleIgnoreTestSuites$1.evaluate(TestRuleIgnoreTestSuites.java:55)
	at com.carrotsearch.randomizedtesting.rules.StatementAdapter.evaluate(StatementAdapter.java:36)
	at com.carrotsearch.randomizedtesting.ThreadLeakControl$StatementRunner.run(ThreadLeakControl.java:358)
	at java.lang.Thread.run(Thread.java:780)


REGRESSION:  org.apache.solr.update.processor.SignatureUpdateProcessorFactoryTest.testDupeDetection

Error Message:
expected:<1> but was:<2>

Stack Trace:
java.lang.AssertionError: expected:<1> but was:<2>
	at __randomizedtesting.SeedInfo.seed([EE51E7AC3A7F4D47:B5611C643938EE3B]:0)
	at org.junit.Assert.fail(Assert.java:93)
	at org.junit.Assert.failNotEquals(Assert.java:647)
	at org.junit.Assert.assertEquals(Assert.java:128)
	at org.junit.Assert.assertEquals(Assert.java:472)
	at org.junit.Assert.assertEquals(Assert.java:456)
	at org.apache.solr.update.processor.SignatureUpdateProcessorFactoryTest.checkNumDocs(SignatureUpdateProcessorFactoryTest.java:71)
	at org.apache.solr.update.processor.SignatureUpdateProcessorFactoryTest.testDupeDetection(SignatureUpdateProcessorFactoryTest.java:119)
	at sun.reflect.NativeMethodAccessorImpl.invoke0(Native Method)
	at sun.reflect.NativeMethodAccessorImpl.invoke(NativeMethodAccessorImpl.java:88)
	at sun.reflect.DelegatingMethodAccessorImpl.invoke(DelegatingMethodAccessorImpl.java:55)
	at java.lang.reflect.Method.invoke(Method.java:613)
	at com.carrotsearch.randomizedtesting.RandomizedRunner.invoke(RandomizedRunner.java:1559)
	at com.carrotsearch.randomizedtesting.RandomizedRunner.access$600(RandomizedRunner.java:79)
	at com.carrotsearch.randomizedtesting.RandomizedRunner$6.evaluate(RandomizedRunner.java:737)
	at com.carrotsearch.randomizedtesting.RandomizedRunner$7.evaluate(RandomizedRunner.java:773)
	at com.carrotsearch.randomizedtesting.RandomizedRunner$8.evaluate(RandomizedRunner.java:787)
	at com.carrotsearch.randomizedtesting.rules.SystemPropertiesRestoreRule$1.evaluate(SystemPropertiesRestoreRule.java:53)
	at org.apache.lucene.util.TestRuleSetupTeardownChained$1.evaluate(TestRuleSetupTeardownChained.java:50)
	at org.apache.lucene.util.TestRuleFieldCacheSanity$1.evaluate(TestRuleFieldCacheSanity.java:51)
	at org.apache.lucene.util.AbstractBeforeAfterRule$1.evaluate(AbstractBeforeAfterRule.java:46)
	at com.carrotsearch.randomizedtesting.rules.SystemPropertiesInvariantRule$1.evaluate(SystemPropertiesInvariantRule.java:55)
	at org.apache.lucene.util.TestRuleThreadAndTestName$1.evaluate(TestRuleThreadAndTestName.java:49)
	at org.apache.lucene.util.TestRuleIgnoreAfterMaxFailures$1.evaluate(TestRuleIgnoreAfterMaxFailures.java:70)
	at org.apache.lucene.util.TestRuleMarkFailure$1.evaluate(TestRuleMarkFailure.java:48)
	at com.carrotsearch.randomizedtesting.rules.StatementAdapter.evaluate(StatementAdapter.java:36)
	at com.carrotsearch.randomizedtesting.ThreadLeakControl$StatementRunner.run(ThreadLeakControl.java:358)
	at com.carrotsearch.randomizedtesting.ThreadLeakControl.forkTimeoutingTask(ThreadLeakControl.java:782)
	at com.carrotsearch.randomizedtesting.ThreadLeakControl$3.evaluate(ThreadLeakControl.java:442)
	at com.carrotsearch.randomizedtesting.RandomizedRunner.runSingleTest(RandomizedRunner.java:746)
	at com.carrotsearch.randomizedtesting.RandomizedRunner$3.evaluate(RandomizedRunner.java:648)
	at com.carrotsearch.randomizedtesting.RandomizedRunner$4.evaluate(RandomizedRunner.java:682)
	at com.carrotsearch.randomizedtesting.RandomizedRunner$5.evaluate(RandomizedRunner.java:693)
	at com.carrotsearch.randomizedtesting.rules.StatementAdapter.evaluate(StatementAdapter.java:36)
	at com.carrotsearch.randomizedtesting.rules.SystemPropertiesRestoreRule$1.evaluate(SystemPropertiesRestoreRule.java:53)
	at org.apache.lucene.util.AbstractBeforeAfterRule$1.evaluate(AbstractBeforeAfterRule.java:46)
	at org.apache.lucene.util.TestRuleStoreClassName$1.evaluate(TestRuleStoreClassName.java:42)
	at com.carrotsearch.randomizedtesting.rules.SystemPropertiesInvariantRule$1.evaluate(SystemPropertiesInvariantRule.java:55)
	at com.carrotsearch.randomizedtesting.rules.NoShadowingOrOverridesOnMethodsRule$1.evaluate(NoShadowingOrOverridesOnMethodsRule.java:39)
	at com.carrotsearch.randomizedtesting.rules.NoShadowingOrOverridesOnMethodsRule$1.evaluate(NoShadowingOrOverridesOnMethodsRule.java:39)
	at com.carrotsearch.randomizedtesting.rules.StatementAdapter.evaluate(StatementAdapter.java:36)
	at org.apache.lucene.util.TestRuleAssertionsRequired$1.evaluate(TestRuleAssertionsRequired.java:43)
	at org.apache.lucene.util.TestRuleMarkFailure$1.evaluate(TestRuleMarkFailure.java:48)
	at org.apache.lucene.util.TestRuleIgnoreAfterMaxFailures$1.evaluate(TestRuleIgnoreAfterMaxFailures.java:70)
	at org.apache.lucene.util.TestRuleIgnoreTestSuites$1.evaluate(TestRuleIgnoreTestSuites.java:55)
	at com.carrotsearch.randomizedtesting.rules.StatementAdapter.evaluate(StatementAdapter.java:36)
	at com.carrotsearch.randomizedtesting.ThreadLeakControl$StatementRunner.run(ThreadLeakControl.java:358)
	at java.lang.Thread.run(Thread.java:780)




Build Log:
[...truncated 10176 lines...]
   [junit4] Suite: org.apache.solr.handler.component.TermVectorComponentDistributedTest
   [junit4]   2> 116841 T383 oas.BaseDistributedSearchTestCase.initHostContext Setting hostContext system property: /
   [junit4]   2> 116844 T383 oas.SolrTestCaseJ4.setUp ###Starting testDistribSearch
   [junit4]   2> 116845 T383 oejs.Server.doStart jetty-8.1.10.v20130312
   [junit4]   2> 116848 T383 oejs.AbstractConnector.doStart Started SelectChannelConnector@127.0.0.1:52342
   [junit4]   2> 116849 T383 oass.SolrDispatchFilter.init SolrDispatchFilter.init()
   [junit4]   2> 116850 T383 oasc.SolrResourceLoader.locateSolrHome JNDI not configured for solr (NoInitialContextEx)
   [junit4]   2> 116850 T383 oasc.SolrResourceLoader.locateSolrHome using system property solr.solr.home: /mnt/ssd/jenkins/workspace/Lucene-Solr-4.x-Linux/solr/build/solr-core/test-files/solr
   [junit4]   2> 116851 T383 oasc.SolrResourceLoader.<init> new SolrResourceLoader for directory: '/mnt/ssd/jenkins/workspace/Lucene-Solr-4.x-Linux/solr/build/solr-core/test-files/solr/'
   [junit4]   2> 116860 T383 oasc.ConfigSolr.fromFile Loading container configuration from /mnt/ssd/jenkins/workspace/Lucene-Solr-4.x-Linux/solr/build/solr-core/test-files/solr/solr.xml
   [junit4]   2> 116896 T383 oasc.CoreContainer.<init> New CoreContainer -1735573322
   [junit4]   2> 116897 T383 oasc.CoreContainer.load Loading cores into CoreContainer [instanceDir=/mnt/ssd/jenkins/workspace/Lucene-Solr-4.x-Linux/solr/build/solr-core/test-files/solr/]
   [junit4]   2> 116898 T383 oashc.HttpShardHandlerFactory.getParameter Setting socketTimeout to: 90000
   [junit4]   2> 116899 T383 oashc.HttpShardHandlerFactory.getParameter Setting urlScheme to: http://
   [junit4]   2> 116899 T383 oashc.HttpShardHandlerFactory.getParameter Setting connTimeout to: 15000
   [junit4]   2> 116900 T383 oashc.HttpShardHandlerFactory.getParameter Setting maxConnectionsPerHost to: 20
   [junit4]   2> 116900 T383 oashc.HttpShardHandlerFactory.getParameter Setting corePoolSize to: 0
   [junit4]   2> 116901 T383 oashc.HttpShardHandlerFactory.getParameter Setting maximumPoolSize to: 2147483647
   [junit4]   2> 116902 T383 oashc.HttpShardHandlerFactory.getParameter Setting maxThreadIdleTime to: 5
   [junit4]   2> 116902 T383 oashc.HttpShardHandlerFactory.getParameter Setting sizeOfQueue to: -1
   [junit4]   2> 116903 T383 oashc.HttpShardHandlerFactory.getParameter Setting fairnessPolicy to: false
   [junit4]   2> 116908 T383 oasl.LogWatcher.createWatcher SLF4J impl is org.slf4j.impl.Log4jLoggerFactory
   [junit4]   2> 116909 T383 oasl.LogWatcher.newRegisteredLogWatcher Registering Log Listener [Log4j (org.slf4j.impl.Log4jLoggerFactory)]
   [junit4]   2> 116909 T383 oasc.CoreContainer.load Host Name: 127.0.0.1
   [junit4]   2> 116914 T393 oasc.CoreContainer.create Creating SolrCore 'collection1' using instanceDir: /mnt/ssd/jenkins/workspace/Lucene-Solr-4.x-Linux/solr/build/solr-core/test-files/solr/collection1
   [junit4]   2> 116914 T393 oasc.SolrResourceLoader.<init> new SolrResourceLoader for directory: '/mnt/ssd/jenkins/workspace/Lucene-Solr-4.x-Linux/solr/build/solr-core/test-files/solr/collection1/'
   [junit4]   2> 116915 T393 oasc.SolrResourceLoader.replaceClassLoader Adding 'file:/mnt/ssd/jenkins/workspace/Lucene-Solr-4.x-Linux/solr/build/solr-core/test-files/solr/collection1/lib/classes/' to classloader
   [junit4]   2> 116915 T393 oasc.SolrResourceLoader.replaceClassLoader Adding 'file:/mnt/ssd/jenkins/workspace/Lucene-Solr-4.x-Linux/solr/build/solr-core/test-files/solr/collection1/lib/README' to classloader
   [junit4]   2> 116955 T393 oasc.SolrConfig.<init> Using Lucene MatchVersion: LUCENE_47
   [junit4]   2> 117002 T393 oasc.SolrConfig.<init> Loaded SolrConfig: solrconfig.xml
   [junit4]   2> 117003 T393 oass.IndexSchema.readSchema Reading Solr Schema from schema.xml
   [junit4]   2> 117010 T393 oass.IndexSchema.readSchema [collection1] Schema name=test
   [junit4]   2> 117358 T393 oass.ByteField.init WARN ByteField is deprecated and will be removed in 5.0. You should use TrieIntField instead.
   [junit4]   2> 117358 T393 oass.ShortField.init WARN ShortField is deprecated and will be removed in 5.0. You should use TrieIntField instead.
   [junit4]   2> 117359 T393 oass.OpenExchangeRatesOrgProvider.init Initialized with rates=open-exchange-rates.json, refreshInterval=1440.
   [junit4]   2> 117365 T393 oass.IndexSchema.readSchema default search field in schema is text
   [junit4]   2> 117368 T393 oass.IndexSchema.readSchema unique key field: id
   [junit4]   2> 117375 T393 oass.FileExchangeRateProvider.reload Reloading exchange rates from file currency.xml
   [junit4]   2> 117379 T393 oass.FileExchangeRateProvider.reload Reloading exchange rates from file currency.xml
   [junit4]   2> 117383 T393 oass.OpenExchangeRatesOrgProvider.reload Reloading exchange rates from open-exchange-rates.json
   [junit4]   2> 117383 T393 oass.OpenExchangeRatesOrgProvider$OpenExchangeRates.<init> WARN Unknown key IMPORTANT NOTE
   [junit4]   2> 117384 T393 oass.OpenExchangeRatesOrgProvider$OpenExchangeRates.<init> WARN Expected key, got STRING
   [junit4]   2> 117384 T393 oass.OpenExchangeRatesOrgProvider.reload Reloading exchange rates from open-exchange-rates.json
   [junit4]   2> 117385 T393 oass.OpenExchangeRatesOrgProvider$OpenExchangeRates.<init> WARN Unknown key IMPORTANT NOTE
   [junit4]   2> 117385 T393 oass.OpenExchangeRatesOrgProvider$OpenExchangeRates.<init> WARN Expected key, got STRING
   [junit4]   2> 117385 T393 oasc.SolrCore.initDirectoryFactory org.apache.solr.core.MockDirectoryFactory
   [junit4]   2> 117386 T393 oasc.SolrCore.<init> [collection1] Opening new SolrCore at /mnt/ssd/jenkins/workspace/Lucene-Solr-4.x-Linux/solr/build/solr-core/test-files/solr/collection1/, dataDir=./org.apache.solr.handler.component.TermVectorComponentDistributedTest-1387482488860/control/data/
   [junit4]   2> 117386 T393 oasc.JmxMonitoredMap.<init> JMX monitoring is enabled. Adding Solr mbeans to JMX Server: com.sun.jmx.mbeanserver.JmxMBeanServer@4a2367b1
   [junit4]   2> 117387 T393 oasc.CachingDirectoryFactory.get return new directory for ./org.apache.solr.handler.component.TermVectorComponentDistributedTest-1387482488860/control/data
   [junit4]   2> 117387 T393 oasc.SolrCore.getNewIndexDir New index directory detected: old=null new=./org.apache.solr.handler.component.TermVectorComponentDistributedTest-1387482488860/control/data/index/
   [junit4]   2> 117388 T393 oasc.SolrCore.initIndex WARN [collection1] Solr index directory './org.apache.solr.handler.component.TermVectorComponentDistributedTest-1387482488860/control/data/index' doesn't exist. Creating new index...
   [junit4]   2> 117388 T393 oasc.CachingDirectoryFactory.get return new directory for ./org.apache.solr.handler.component.TermVectorComponentDistributedTest-1387482488860/control/data/index
   [junit4]   2> 117389 T393 oasu.RandomMergePolicy.<init> RandomMergePolicy wrapping class org.apache.lucene.index.LogDocMergePolicy: [LogDocMergePolicy: minMergeSize=1000, mergeFactor=50, maxMergeSize=9223372036854775807, maxMergeSizeForForcedMerge=9223372036854775807, calibrateSizeByDeletes=false, maxMergeDocs=2147483647, maxCFSSegmentSizeMB=8.796093022207999E12, noCFSRatio=0.47087126663264933]
   [junit4]   2> 117389 T393 oasc.SolrDeletionPolicy.onCommit SolrDeletionPolicy.onCommit: commits: num=1
   [junit4]   2> 		commit{dir=RateLimitedDirectoryWrapper(MockDirectoryWrapper(org.apache.lucene.store.RAMDirectory@997e4705 lockFactory=org.apache.lucene.store.SingleInstanceLockFactory@36f009dc)),segFN=segments_1,generation=1}
   [junit4]   2> 117390 T393 oasc.SolrDeletionPolicy.updateCommits newest commit generation = 1
   [junit4]   2> 117390 T393 oasc.SolrCore.initWriters created xml: solr.XMLResponseWriter
   [junit4]   2> 117394 T393 oasup.UpdateRequestProcessorChain.init creating updateRequestProcessorChain "dedupe"
   [junit4]   2> 117394 T393 oasup.UpdateRequestProcessorChain.init inserting DistributedUpdateProcessorFactory into updateRequestProcessorChain "dedupe"
   [junit4]   2> 117395 T393 oasup.UpdateRequestProcessorChain.init creating updateRequestProcessorChain "dedupe-allfields"
   [junit4]   2> 117395 T393 oasup.UpdateRequestProcessorChain.init inserting DistributedUpdateProcessorFactory into updateRequestProcessorChain "dedupe-allfields"
   [junit4]   2> 117395 T393 oasup.UpdateRequestProcessorChain.init creating updateRequestProcessorChain "stored_sig"
   [junit4]   2> 117396 T393 oasup.UpdateRequestProcessorChain.init inserting DistributedUpdateProcessorFactory into updateRequestProcessorChain "stored_sig"
   [junit4]   2> 117396 T393 oasup.UpdateRequestProcessorChain.init creating updateRequestProcessorChain "uniq-fields"
   [junit4]   2> 117396 T393 oasup.UniqFieldsUpdateProcessorFactory.init WARN Use of the 'fields' init param in UniqFieldsUpdateProcessorFactory is deprecated, please use 'fieldName' (or another FieldMutatingUpdateProcessorFactory selector option) instead
   [junit4]   2> 117397 T393 oasup.UniqFieldsUpdateProcessorFactory.init Replacing 'fields' init param with (individual) 'fieldName' params
   [junit4]   2> 117397 T393 oasup.UpdateRequestProcessorChain.init inserting DistributedUpdateProcessorFactory into updateRequestProcessorChain "uniq-fields"
   [junit4]   2> 117397 T393 oasup.UpdateRequestProcessorChain.init creating updateRequestProcessorChain "distrib-dup-test-chain-explicit"
   [junit4]   2> 117398 T393 oasup.UpdateRequestProcessorChain.init creating updateRequestProcessorChain "distrib-dup-test-chain-implicit"
   [junit4]   2> 117398 T393 oasup.UpdateRequestProcessorChain.init inserting DistributedUpdateProcessorFactory into updateRequestProcessorChain "distrib-dup-test-chain-implicit"
   [junit4]   2> 117399 T393 oasc.SolrCore.loadUpdateProcessorChains no updateRequestProcessorChain defined as default, creating implicit default
   [junit4]   2> 117399 T393 oasc.RequestHandlers.initHandlersFromConfig adding lazy requestHandler: solr.ReplicationHandler
   [junit4]   2> 117399 T393 oasc.RequestHandlers.initHandlersFromConfig created /replication: solr.ReplicationHandler
   [junit4]   2> 117400 T393 oasc.RequestHandlers.initHandlersFromConfig created standard: solr.StandardRequestHandler
   [junit4]   2> 117400 T393 oasc.RequestHandlers.initHandlersFromConfig created /get: solr.RealTimeGetHandler
   [junit4]   2> 117401 T393 oasc.RequestHandlers.initHandlersFromConfig created dismax: solr.SearchHandler
   [junit4]   2> 117402 T393 oasc.RequestHandlers.initHandlersFromConfig created mock: org.apache.solr.core.MockQuerySenderListenerReqHandler
   [junit4]   2> 117402 T393 oasc.RequestHandlers.initHandlersFromConfig created /admin/: org.apache.solr.handler.admin.AdminHandlers
   [junit4]   2> 117403 T393 oasc.RequestHandlers.initHandlersFromConfig created /admin/file: solr.admin.ShowFileRequestHandler
   [junit4]   2> 117403 T393 oasc.RequestHandlers.initHandlersFromConfig created defaults: solr.StandardRequestHandler
   [junit4]   2> 117403 T393 oasc.RequestHandlers.initHandlersFromConfig adding lazy requestHandler: solr.StandardRequestHandler
   [junit4]   2> 117404 T393 oasc.RequestHandlers.initHandlersFromConfig created lazy: solr.StandardRequestHandler
   [junit4]   2> 117404 T393 oasc.RequestHandlers.initHandlersFromConfig created /update: solr.UpdateRequestHandler
   [junit4]   2> 117405 T393 oasc.RequestHandlers.initHandlersFromConfig created /terms: org.apache.solr.handler.component.SearchHandler
   [junit4]   2> 117405 T393 oasc.RequestHandlers.initHandlersFromConfig created spellCheckCompRH: org.apache.solr.handler.component.SearchHandler
   [junit4]   2> 117406 T393 oasc.RequestHandlers.initHandlersFromConfig created spellCheckCompRH_Direct: org.apache.solr.handler.component.SearchHandler
   [junit4]   2> 117407 T393 oasc.RequestHandlers.initHandlersFromConfig created spellCheckWithWordbreak: org.apache.solr.handler.component.SearchHandler
   [junit4]   2> 117407 T393 oasc.RequestHandlers.initHandlersFromConfig created spellCheckWithWordbreak_Direct: org.apache.solr.handler.component.SearchHandler
   [junit4]   2> 117408 T393 oasc.RequestHandlers.initHandlersFromConfig created spellCheckCompRH1: org.apache.solr.handler.component.SearchHandler
   [junit4]   2> 117408 T393 oasc.RequestHandlers.initHandlersFromConfig created mltrh: org.apache.solr.handler.component.SearchHandler
   [junit4]   2> 117409 T393 oasc.RequestHandlers.initHandlersFromConfig created tvrh: org.apache.solr.handler.component.SearchHandler
   [junit4]   2> 117409 T393 oasc.RequestHandlers.initHandlersFromConfig created /mlt: solr.MoreLikeThisHandler
   [junit4]   2> 117410 T393 oasc.RequestHandlers.initHandlersFromConfig created /debug/dump: solr.DumpRequestHandler
   [junit4]   2> 117411 T393 oashl.XMLLoader.init xsltCacheLifetimeSeconds=60
   [junit4]   2> 117413 T393 oasc.SolrCore.initDeprecatedSupport WARN solrconfig.xml uses deprecated <admin/gettableFiles>, Please update your config to use the ShowFileRequestHandler.
   [junit4]   2> 117415 T393 oasu.CommitTracker.<init> Hard AutoCommit: disabled
   [junit4]   2> 117415 T393 oasu.CommitTracker.<init> Soft AutoCommit: disabled
   [junit4]   2> 117416 T393 oasu.RandomMergePolicy.<init> RandomMergePolicy wrapping class org.apache.lucene.index.TieredMergePolicy: [TieredMergePolicy: maxMergeAtOnce=17, maxMergeAtOnceExplicit=49, maxMergedSegmentMB=88.5556640625, floorSegmentMB=0.966796875, forceMergeDeletesPctAllowed=25.574114747407798, segmentsPerTier=28.0, maxCFSSegmentSizeMB=8.796093022207999E12, noCFSRatio=1.0
   [junit4]   2> 117417 T393 oasc.SolrDeletionPolicy.onInit SolrDeletionPolicy.onInit: commits: num=1
   [junit4]   2> 		commit{dir=RateLimitedDirectoryWrapper(MockDirectoryWrapper(org.apache.lucene.store.RAMDirectory@997e4705 lockFactory=org.apache.lucene.store.SingleInstanceLockFactory@36f009dc)),segFN=segments_1,generation=1}
   [junit4]   2> 117417 T393 oasc.SolrDeletionPolicy.updateCommits newest commit generation = 1
   [junit4]   2> 117418 T393 oass.SolrIndexSearcher.<init> Opening Searcher@fabc4906 main
   [junit4]   2> 117418 T393 oashc.SpellCheckComponent.inform Initializing spell checkers
   [junit4]   2> 117494 T393 oass.DirectSolrSpellChecker.init init: {name=direct,classname=DirectSolrSpellChecker,field=lowerfilt,minQueryLength=3}
   [junit4]   2> 117521 T394 oasc.SolrCore.registerSearcher [collection1] Registered new searcher Searcher@fabc4906 main{StandardDirectoryReader(segments_1:1:nrt)}
   [junit4]   2> 117529 T393 oasc.CoreContainer.registerCore registering core: collection1
   [junit4]   2> 117530 T383 oass.SolrDispatchFilter.init user.dir=/mnt/ssd/jenkins/workspace/Lucene-Solr-4.x-Linux/solr/build/solr-core/test/J1
   [junit4]   2> 117530 T383 oass.SolrDispatchFilter.init SolrDispatchFilter.init() done
   [junit4]   2> 117532 T383 oejs.Server.doStart jetty-8.1.10.v20130312
   [junit4]   2> 117534 T383 oejs.AbstractConnector.doStart Started SelectChannelConnector@127.0.0.1:41068
   [junit4]   2> 117535 T383 oass.SolrDispatchFilter.init SolrDispatchFilter.init()
   [junit4]   2> 117535 T383 oasc.SolrResourceLoader.locateSolrHome JNDI not configured for solr (NoInitialContextEx)
   [junit4]   2> 117536 T383 oasc.SolrResourceLoader.locateSolrHome using system property solr.solr.home: /mnt/ssd/jenkins/workspace/Lucene-Solr-4.x-Linux/solr/build/solr-core/test-files/solr
   [junit4]   2> 117536 T383 oasc.SolrResourceLoader.<init> new SolrResourceLoader for directory: '/mnt/ssd/jenkins/workspace/Lucene-Solr-4.x-Linux/solr/build/solr-core/test-files/solr/'
   [junit4]   2> 117549 T383 oasc.ConfigSolr.fromFile Loading container configuration from /mnt/ssd/jenkins/workspace/Lucene-Solr-4.x-Linux/solr/build/solr-core/test-files/solr/solr.xml
   [junit4]   2> 117583 T383 oasc.CoreContainer.<init> New CoreContainer -1972357892
   [junit4]   2> 117584 T383 oasc.CoreContainer.load Loading cores into CoreContainer [instanceDir=/mnt/ssd/jenkins/workspace/Lucene-Solr-4.x-Linux/solr/build/solr-core/test-files/solr/]
   [junit4]   2> 117585 T383 oashc.HttpShardHandlerFactory.getParameter Setting socketTimeout to: 90000
   [junit4]   2> 117586 T383 oashc.HttpShardHandlerFactory.getParameter Setting urlScheme to: http://
   [junit4]   2> 117586 T383 oashc.HttpShardHandlerFactory.getParameter Setting connTimeout to: 15000
   [junit4]   2> 117587 T383 oashc.HttpShardHandlerFactory.getParameter Setting maxConnectionsPerHost to: 20
   [junit4]   2> 117587 T383 oashc.HttpShardHandlerFactory.getParameter Setting corePoolSize to: 0
   [junit4]   2> 117588 T383 oashc.HttpShardHandlerFactory.getParameter Setting maximumPoolSize to: 2147483647
   [junit4]   2> 117589 T383 oashc.HttpShardHandlerFactory.getParameter Setting maxThreadIdleTime to: 5
   [junit4]   2> 117589 T383 oashc.HttpShardHandlerFactory.getParameter Setting sizeOfQueue to: -1
   [junit4]   2> 117590 T383 oashc.HttpShardHandlerFactory.getParameter Setting fairnessPolicy to: false
   [junit4]   2> 117595 T383 oasl.LogWatcher.createWatcher SLF4J impl is org.slf4j.impl.Log4jLoggerFactory
   [junit4]   2> 117595 T383 oasl.LogWatcher.newRegisteredLogWatcher Registering Log Listener [Log4j (org.slf4j.impl.Log4jLoggerFactory)]
   [junit4]   2> 117596 T383 oasc.CoreContainer.load Host Name: 127.0.0.1
   [junit4]   2> 117599 T405 oasc.CoreContainer.create Creating SolrCore 'collection1' using instanceDir: /mnt/ssd/jenkins/workspace/Lucene-Solr-4.x-Linux/solr/build/solr-core/test-files/solr/collection1
   [junit4]   2> 117600 T405 oasc.SolrResourceLoader.<init> new SolrResourceLoader for directory: '/mnt/ssd/jenkins/workspace/Lucene-Solr-4.x-Linux/solr/build/solr-core/test-files/solr/collection1/'
   [junit4]   2> 117600 T405 oasc.SolrResourceLoader.replaceClassLoader Adding 'file:/mnt/ssd/jenkins/workspace/Lucene-Solr-4.x-Linux/solr/build/solr-core/test-files/solr/collection1/lib/classes/' to classloader
   [junit4]   2> 117601 T405 oasc.SolrResourceLoader.replaceClassLoader Adding 'file:/mnt/ssd/jenkins/workspace/Lucene-Solr-4.x-Linux/solr/build/solr-core/test-files/solr/collection1/lib/README' to classloader
   [junit4]   2> 117667 T405 oasc.SolrConfig.<init> Using Lucene MatchVersion: LUCENE_47
   [junit4]   2> 117721 T405 oasc.SolrConfig.<init> Loaded SolrConfig: solrconfig.xml
   [junit4]   2> 117721 T405 oass.IndexSchema.readSchema Reading Solr Schema from schema.xml
   [junit4]   2> 117728 T405 oass.IndexSchema.readSchema [collection1] Schema name=test
   [junit4]   2> 118121 T405 oass.ByteField.init WARN ByteField is deprecated and will be removed in 5.0. You should use TrieIntField instead.
   [junit4]   2> 118121 T405 oass.ShortField.init WARN ShortField is deprecated and will be removed in 5.0. You should use TrieIntField instead.
   [junit4]   2> 118122 T405 oass.OpenExchangeRatesOrgProvider.init Initialized with rates=open-exchange-rates.json, refreshInterval=1440.
   [junit4]   2> 118128 T405 oass.IndexSchema.readSchema default search field in schema is text
   [junit4]   2> 118131 T405 oass.IndexSchema.readSchema unique key field: id
   [junit4]   2> 118139 T405 oass.FileExchangeRateProvider.reload Reloading exchange rates from file currency.xml
   [junit4]   2> 118143 T405 oass.FileExchangeRateProvider.reload Reloading exchange rates from file currency.xml
   [junit4]   2> 118146 T405 oass.OpenExchangeRatesOrgProvider.reload Reloading exchange rates from open-exchange-rates.json
   [junit4]   2> 118147 T405 oass.OpenExchangeRatesOrgProvider$OpenExchangeRates.<init> WARN Unknown key IMPORTANT NOTE
   [junit4]   2> 118147 T405 oass.OpenExchangeRatesOrgProvider$OpenExchangeRates.<init> WARN Expected key, got STRING
   [junit4]   2> 118148 T405 oass.OpenExchangeRatesOrgProvider.reload Reloading exchange rates from open-exchange-rates.json
   [junit4]   2> 118148 T405 oass.OpenExchangeRatesOrgProvider$OpenExchangeRates.<init> WARN Unknown key IMPORTANT NOTE
   [junit4]   2> 118148 T405 oass.OpenExchangeRatesOrgProvider$OpenExchangeRates.<init> WARN Expected key, got STRING
   [junit4]   2> 118149 T405 oasc.SolrCore.initDirectoryFactory org.apache.solr.core.MockDirectoryFactory
   [junit4]   2> 118149 T405 oasc.SolrCore.<init> [collection1] Opening new SolrCore at /mnt/ssd/jenkins/workspace/Lucene-Solr-4.x-Linux/solr/build/solr-core/test-files/solr/collection1/, dataDir=./org.apache.solr.handler.component.TermVectorComponentDistributedTest-1387482488860/shard0/data/
   [junit4]   2> 118150 T405 oasc.JmxMonitoredMap.<init> JMX monitoring is enabled. Adding Solr mbeans to JMX Server: com.sun.jmx.mbeanserver.JmxMBeanServer@4a2367b1
   [junit4]   2> 118151 T405 oasc.CachingDirectoryFactory.get return new directory for ./org.apache.solr.handler.component.TermVectorComponentDistributedTest-1387482488860/shard0/data
   [junit4]   2> 118151 T405 oasc.SolrCore.getNewIndexDir New index directory detected: old=null new=./org.apache.solr.handler.component.TermVectorComponentDistributedTest-1387482488860/shard0/data/index/
   [junit4]   2> 118151 T405 oasc.SolrCore.initIndex WARN [collection1] Solr index directory './org.apache.solr.handler.component.TermVectorComponentDistributedTest-1387482488860/shard0/data/index' doesn't exist. Creating new index...
   [junit4]   2> 118152 T405 oasc.CachingDirectoryFactory.get return new directory for ./org.apache.solr.handler.component.TermVectorComponentDistributedTest-1387482488860/shard0/data/index
   [junit4]   2> 118152 T405 oasu.RandomMergePolicy.<init> RandomMergePolicy wrapping class org.apache.lucene.index.LogDocMergePolicy: [LogDocMergePolicy: minMergeSize=1000, mergeFactor=50, maxMergeSize=9223372036854775807, maxMergeSizeForForcedMerge=9223372036854775807, calibrateSizeByDeletes=false, maxMergeDocs=2147483647, maxCFSSegmentSizeMB=8.796093022207999E12, noCFSRatio=0.47087126663264933]
   [junit4]   2> 118153 T405 oasc.SolrDeletionPolicy.onCommit SolrDeletionPolicy.onCommit: commits: num=1
   [junit4]   2> 		commit{dir=RateLimitedDirectoryWrapper(MockDirectoryWrapper(org.apache.lucene.store.RAMDirectory@37b1f2dc lockFactory=org.apache.lucene.store.SingleInstanceLockFactory@75d3b721)),segFN=segments_1,generation=1}
   [junit4]   2> 118154 T405 oasc.SolrDeletionPolicy.updateCommits newest commit generation = 1
   [junit4]   2> 118154 T405 oasc.SolrCore.initWriters created xml: solr.XMLResponseWriter
   [junit4]   2> 118160 T405 oasup.UpdateRequestProcessorChain.init creating updateRequestProcessorChain "dedupe"
   [junit4]   2> 118160 T405 oasup.UpdateRequestProcessorChain.init inserting DistributedUpdateProcessorFactory into updateRequestProcessorChain "dedupe"
   [junit4]   2> 118161 T405 oasup.UpdateRequestProcessorChain.init creating updateRequestProcessorChain "dedupe-allfields"
   [junit4]   2> 118161 T405 oasup.UpdateRequestProcessorChain.init inserting DistributedUpdateProcessorFactory into updateRequestProcessorChain "dedupe-allfields"
   [junit4]   2> 118161 T405 oasup.UpdateRequestProcessorChain.init creating updateRequestProcessorChain "stored_sig"
   [junit4]   2> 118162 T405 oasup.UpdateRequestProcessorChain.init inserting DistributedUpdateProcessorFactory into updateRequestProcessorChain "stored_sig"
   [junit4]   2> 118162 T405 oasup.UpdateRequestProcessorChain.init creating updateRequestProcessorChain "uniq-fields"
   [junit4]   2> 118163 T405 oasup.UniqFieldsUpdateProcessorFactory.init WARN Use of the 'fields' init param in UniqFieldsUpdateProcessorFactory is deprecated, please use 'fieldName' (or another FieldMutatingUpdateProcessorFactory selector option) instead
   [junit4]   2> 118163 T405 oasup.UniqFieldsUpdateProcessorFactory.init Replacing 'fields' init param with (individual) 'fieldName' params
   [junit4]   2> 118163 T405 oasup.UpdateRequestProcessorChain.init inserting DistributedUpdateProcessorFactory into updateRequestProcessorChain "uniq-fields"
   [junit4]   2> 118164 T405 oasup.UpdateRequestProcessorChain.init creating updateRequestProcessorChain "distrib-dup-test-chain-explicit"
   [junit4]   2> 118164 T405 oasup.UpdateRequestProcessorChain.init creating updateRequestProcessorChain "distrib-dup-test-chain-implicit"
   [junit4]   2> 118165 T405 oasup.UpdateRequestProcessorChain.init inserting DistributedUpdateProcessorFactory into updateRequestProcessorChain "distrib-dup-test-chain-implicit"
   [junit4]   2> 118165 T405 oasc.SolrCore.loadUpdateProcessorChains no updateRequestProcessorChain defined as default, creating implicit default
   [junit4]   2> 118165 T405 oasc.RequestHandlers.initHandlersFromConfig adding lazy requestHandler: solr.ReplicationHandler
   [junit4]   2> 118166 T405 oasc.RequestHandlers.initHandlersFromConfig created /replication: solr.ReplicationHandler
   [junit4]   2> 118167 T405 oasc.RequestHandlers.initHandlersFromConfig created standard: solr.StandardRequestHandler
   [junit4]   2> 118167 T405 oasc.RequestHandlers.initHandlersFromConfig created /get: solr.RealTimeGetHandler
   [junit4]   2> 118168 T405 oasc.RequestHandlers.initHandlersFromConfig created dismax: solr.SearchHandler
   [junit4]   2> 118169 T405 oasc.RequestHandlers.initHandlersFromConfig created mock: org.apache.solr.core.MockQuerySenderListenerReqHandler
   [junit4]   2> 118170 T405 oasc.RequestHandlers.initHandlersFromConfig created /admin/: org.apache.solr.handler.admin.AdminHandlers
   [junit4]   2> 118170 T405 oasc.RequestHandlers.initHandlersFromConfig created /admin/file: solr.admin.ShowFileRequestHandler
   [junit4]   2> 118171 T405 oasc.RequestHandlers.initHandlersFromConfig created defaults: solr.StandardRequestHandler
   [junit4]   2> 118172 T405 oasc.RequestHandlers.initHandlersFromConfig adding lazy requestHandler: solr.StandardRequestHandler
   [junit4]   2> 118172 T405 oasc.RequestHandlers.initHandlersFromConfig created lazy: solr.StandardRequestHandler
   [junit4]   2> 118173 T405 oasc.RequestHandlers.initHandlersFromConfig created /update: solr.UpdateRequestHandler
   [junit4]   2> 118174 T405 oasc.RequestHandlers.initHandlersFromConfig created /terms: org.apache.solr.handler.component.SearchHandler
   [junit4]   2> 118175 T405 oasc.RequestHandlers.initHandlersFromConfig created spellCheckCompRH: org.apache.solr.handler.component.SearchHandler
   [junit4]   2> 118175 T405 oasc.RequestHandlers.initHandlersFromConfig created spellCheckCompRH_Direct: org.apache.solr.handler.component.SearchHandler
   [junit4]   2> 118176 T405 oasc.RequestHandlers.initHandlersFromConfig created spellCheckWithWordbreak: org.apache.solr.handler.component.SearchHandler
   [junit4]   2> 118177 T405 oasc.RequestHandlers.initHandlersFromConfig created spellCheckWithWordbreak_Direct: org.apache.solr.handler.component.SearchHandler
   [junit4]   2> 118178 T405 oasc.RequestHandlers.initHandlersFromConfig created spellCheckCompRH1: org.apache.solr.handler.component.SearchHandler
   [junit4]   2> 118179 T405 oasc.RequestHandlers.initHandlersFromConfig created mltrh: org.apache.solr.handler.component.SearchHandler
   [junit4]   2> 118180 T405 oasc.RequestHandlers.initHandlersFromConfig created tvrh: org.apache.solr.handler.component.SearchHandler
   [junit4]   2> 118180 T405 oasc.RequestHandlers.initHandlersFromConfig created /mlt: solr.MoreLikeThisHandler
   [junit4]   2> 118181 T405 oasc.RequestHandlers.initHandlersFromConfig created /debug/dump: solr.DumpRequestHandler
   [junit4]   2> 118183 T405 oashl.XMLLoader.init xsltCacheLifetimeSeconds=60
   [junit4]   2> 118184 T405 oasc.SolrCore.initDeprecatedSupport WARN solrconfig.xml uses deprecated <admin/gettableFiles>, Please update your config to use the ShowFileRequestHandler.
   [junit4]   2> 118187 T405 oasu.CommitTracker.<init> Hard AutoCommit: disabled
   [junit4]   2> 118187 T405 oasu.CommitTracker.<init> Soft AutoCommit: disabled
   [junit4]   2> 118189 T405 oasu.RandomMergePolicy.<init> RandomMergePolicy wrapping class org.apache.lucene.index.TieredMergePolicy: [TieredMergePolicy: maxMergeAtOnce=17, maxMergeAtOnceExplicit=49, maxMergedSegmentMB=88.5556640625, floorSegmentMB=0.966796875, forceMergeDeletesPctAllowed=25.574114747407798, segmentsPerTier=28.0, maxCFSSegmentSizeMB=8.796093022207999E12, noCFSRatio=1.0
   [junit4]   2> 118190 T405 oasc.SolrDeletionPolicy.onInit SolrDeletionPolicy.onInit: commits: num=1
   [junit4]   2> 		commit{dir=RateLimitedDirectoryWrapper(MockDirectoryWrapper(org.apache.lucene.store.RAMDirectory@37b1f2dc lockFactory=org.apache.lucene.store.SingleInstanceLockFactory@75d3b721)),segFN=segments_1,generation=1}
   [junit4]   2> 118191 T405 oasc.SolrDeletionPolicy.updateCommits newest commit generation = 1
   [junit4]   2> 118191 T405 oass.SolrIndexSearcher.<init> Opening Searcher@c391be15 main
   [junit4]   2> 118192 T405 oashc.SpellCheckComponent.inform Initializing spell checkers
   [junit4]   2> 118197 T405 oass.DirectSolrSpellChecker.init init: {name=direct,classname=DirectSolrSpellChecker,field=lowerfilt,minQueryLength=3}
   [junit4]   2> 118222 T406 oasc.SolrCore.registerSearcher [collection1] Registered new searcher Searcher@c391be15 main{StandardDirectoryReader(segments_1:1:nrt)}
   [junit4]   2> 118233 T405 oasc.CoreContainer.registerCore registering core: collection1
   [junit4]   2> 118234 T383 oass.SolrDispatchFilter.init user.dir=/mnt/ssd/jenkins/workspace/Lucene-Solr-4.x-Linux/solr/build/solr-core/test/J1
   [junit4]   2> 118235 T383 oass.SolrDispatchFilter.init SolrDispatchFilter.init() done
   [junit4]   2> ASYNC  NEW_CORE C268 name=collection1 org.apache.solr.core.SolrCore@90eaa233
   [junit4]   2> 118252 T390 C268 oasup.LogUpdateProcessor.finish [collection1] webapp= path=/update params={version=2&wt=javabin} {add=[0 (1454880839710015488)]} 0 6
   [junit4]   2> ASYNC  NEW_CORE C269 name=collection1 org.apache.solr.core.SolrCore@73164357
   [junit4]   2> 118261 T402 C269 oasup.LogUpdateProcessor.finish [collection1] webapp= path=/update params={wt=javabin&version=2} {add=[0 (1454880839723646976)]} 0 1
   [junit4]   2> 118266 T389 C268 oasup.LogUpdateProcessor.finish [collection1] webapp= path=/update params={version=2&wt=javabin} {add=[1 (1454880839727841280)]} 0 2
   [junit4]   2> 118269 T403 C269 oasup.LogUpdateProcessor.finish [collection1] webapp= path=/update params={version=2&wt=javabin} {add=[1 (1454880839732035584)]} 0 1
   [junit4]   2> 118273 T391 C268 oasup.LogUpdateProcessor.finish [collection1] webapp= path=/update params={version=2&wt=javabin} {add=[2 (1454880839736229888)]} 0 1
   [junit4]   2> 118276 T404 C269 oasup.LogUpdateProcessor.finish [collection1] webapp= path=/update params={version=2&wt=javabin} {add=[2 (1454880839739375616)]} 0 1
   [junit4]   2> 118279 T392 C268 oasup.LogUpdateProcessor.finish [collection1] webapp= path=/update params={wt=javabin&version=2} {add=[3 (1454880839742521344)]} 0 1
   [junit4]   2> 118283 T401 C269 oasup.LogUpdateProcessor.finish [collection1] webapp= path=/update params={version=2&wt=javabin} {add=[3 (1454880839746715648)]} 0 1
   [junit4]   2> 118286 T390 C268 oasup.LogUpdateProcessor.finish [collection1] webapp= path=/update params={wt=javabin&version=2} {add=[4 (1454880839749861376)]} 0 1
   [junit4]   2> 118289 T402 C269 oasup.LogUpdateProcessor.finish [collection1] webapp= path=/update params={version=2&wt=javabin} {add=[4 (1454880839753007104)]} 0 1
   [junit4]   2> 118292 T389 C268 oasup.LogUpdateProcessor.finish [collection1] webapp= path=/update params={wt=javabin&version=2} {add=[5 (1454880839756152832)]} 0 1
   [junit4]   2> 118295 T403 C269 oasup.LogUpdateProcessor.finish [collection1] webapp= path=/update params={wt=javabin&version=2} {add=[5 (1454880839759298560)]} 0 1
   [junit4]   2> 118298 T391 C268 oasup.LogUpdateProcessor.finish [collection1] webapp= path=/update params={version=2&wt=javabin} {add=[6 (1454880839762444288)]} 0 1
   [junit4]   2> 118300 T404 C269 oasup.LogUpdateProcessor.finish [collection1] webapp= path=/update params={version=2&wt=javabin} {add=[6 (1454880839765590016)]} 0 0
   [junit4]   2> 118304 T392 C268 oasup.LogUpdateProcessor.finish [collection1] webapp= path=/update params={version=2&wt=javabin} {add=[7 (1454880839768735744)]} 0 1
   [junit4]   2> 118307 T401 C269 oasup.LogUpdateProcessor.finish [collection1] webapp= path=/update params={version=2&wt=javabin} {add=[7 (1454880839771881472)]} 0 1
   [junit4]   2> 118310 T390 C268 oasup.LogUpdateProcessor.finish [collection1] webapp= path=/update params={wt=javabin&version=2} {add=[8 (1454880839775027200)]} 0 1
   [junit4]   2> 118313 T402 C269 oasup.LogUpdateProcessor.finish [collection1] webapp= path=/update params={wt=javabin&version=2} {add=[8 (1454880839778172928)]} 0 1
   [junit4]   2> 118316 T389 C268 oasup.LogUpdateProcessor.finish [collection1] webapp= path=/update params={wt=javabin&version=2} {add=[9 (1454880839781318656)]} 0 1
   [junit4]   2> 118319 T403 C269 oasup.LogUpdateProcessor.finish [collection1] webapp= path=/update params={wt=javabin&version=2} {add=[9 (1454880839785512960)]} 0 1
   [junit4]   2> 119032 T391 C268 oasu.DirectUpdateHandler2.commit start commit{,optimize=false,openSearcher=true,waitSearcher=true,expungeDeletes=false,softCommit=false,prepareCommit=false}
   [junit4]   2> 119039 T391 C268 oasc.SolrDeletionPolicy.onCommit SolrDeletionPolicy.onCommit: commits: num=2
   [junit4]   2> 		commit{dir=RateLimitedDirectoryWrapper(MockDirectoryWrapper(org.apache.lucene.store.RAMDirectory@997e4705 lockFactory=org.apache.lucene.store.SingleInstanceLockFactory@36f009dc)),segFN=segments_1,generation=1}
   [junit4]   2> 		commit{dir=RateLimitedDirectoryWrapper(MockDirectoryWrapper(org.apache.lucene.store.RAMDirectory@997e4705 lockFactory=org.apache.lucene.store.SingleInstanceLockFactory@36f009dc)),segFN=segments_2,generation=2}
   [junit4]   2> 119040 T391 C268 oasc.SolrDeletionPolicy.updateCommits newest commit generation = 2
   [junit4]   2> 119044 T391 C268 oass.SolrIndexSearcher.<init> Opening Searcher@2d203b08 main
   [junit4]   2> 119045 T391 C268 oasu.DirectUpdateHandler2.commit end_commit_flush
   [junit4]   2> 119047 T394 oasc.SolrCore.registerSearcher [collection1] Registered new searcher Searcher@2d203b08 main{StandardDirectoryReader(segments_2:3:nrt _0(4.7):c10)}
   [junit4]   2> 119048 T391 C268 oasup.LogUpdateProcessor.finish [collection1] webapp= path=/update params={wt=javabin&commit=true&waitSearcher=true&version=2&softCommit=false} {commit=} 0 16
   [junit4]   2> 119050 T402 C269 oasu.DirectUpdateHandler2.commit start commit{,optimize=false,openSearcher=true,waitSearcher=true,expungeDeletes=false,softCommit=false,prepareCommit=false}
   [junit4]   2> 119058 T402 C269 oasc.SolrDeletionPolicy.onCommit SolrDeletionPolicy.onCommit: commits: num=2
   [junit4]   2> 		commit{dir=RateLimitedDirectoryWrapper(MockDirectoryWrapper(org.apache.lucene.store.RAMDirectory@37b1f2dc lockFactory=org.apache.lucene.store.SingleInstanceLockFactory@75d3b721)),segFN=segments_1,generation=1}
   [junit4]   2> 		commit{dir=RateLimitedDirectoryWrapper(MockDirectoryWrapper(org.apache.lucene.store.RAMDirectory@37b1f2dc lockFactory=org.apache.lucene.store.SingleInstanceLockFactory@75d3b721)),segFN=segments_2,generation=2}
   [junit4]   2> 119059 T402 C269 oasc.SolrDeletionPolicy.updateCommits newest commit generation = 2
   [junit4]   2> 119061 T402 C269 oass.SolrIndexSearcher.<init> Opening Searcher@aef3673 main
   [junit4]   2> 119062 T402 C269 oasu.DirectUpdateHandler2.commit end_commit_flush
   [junit4]   2> 119065 T406 oasc.SolrCore.registerSearcher [collection1] Registered new searcher Searcher@aef3673 main{StandardDirectoryReader(segments_2:3:nrt _0(4.7):c10)}
   [junit4]   2> 119065 T402 C269 oasup.LogUpdateProcessor.finish [collection1] webapp= path=/update params={waitSearcher=true&commit=true&version=2&softCommit=false&wt=javabin} {commit=} 0 15
   [junit4]   2> 119073 T389 C268 oasc.SolrCore.execute [collection1] webapp= path=/select params={tv.tf=true&shards.qt=tvrh&version=2&q=id:0&wt=javabin&distrib=false&qt=tvrh&sort=id+desc&tv=true} hits=1 status=0 QTime=5 
   [junit4]   2> 119078 T401 C269 oasc.SolrCore.execute [collection1] webapp= path=/select params={fl=id&wt=javabin&q=id:0&qt=tvrh&tv=true&sort=id+desc&start=0&shard.url=[ff01::213]:33332/|[ff01::083]:33332/|127.0.0.1:41068/&tv.tf=true&shards.qt=tvrh&fsv=true&version=2&rows=10&isShard=true&distrib=false&NOW=1387482491091} hits=1 status=0 QTime=1 
   [junit4]   2> 119083 T402 C269 oasc.SolrCore.execute [collection1] webapp= path=/select params={tv=true&NOW=1387482491091&qt=tvrh&distrib=false&wt=javabin&isShard=true&q=id:0&version=2&ids=0&shard.url=[ff01::213]:33332/|[ff01::083]:33332/|127.0.0.1:41068/&shards.qt=tvrh&tv.tf=true} status=0 QTime=1 
   [junit4]   2> 119085 T403 C269 oasc.SolrCore.execute [collection1] webapp= path=/select params={q=id:0&wt=javabin&shards=[ff01::213]:33332/|[ff01::083]:33332/|127.0.0.1:41068/&sort=id+desc&tv=true&qt=tvrh&tv.tf=true&shards.qt=tvrh&version=2} hits=1 status=0 QTime=10 
   [junit4]   2> 119089 T392 C268 oasc.SolrCore.execute [collection1] webapp= path=/select params={q=id:0&wt=javabin&sort=id+asc&tv=true&distrib=false&qt=tvrh&tv.tf=true&tv.fl=test_basictv,test_offtv&shards.qt=tvrh&fl=*,score&version=2} hits=1 status=0 QTime=1 
   [junit4]   2> 119097 T401 C269 oasc.SolrCore.execute [collection1] webapp= path=/select params={distrib=false&NOW=1387482491108&rows=10&isShard=true&fsv=true&version=2&start=0&shard.url=[ff01::083]:33332/|127.0.0.1:41068/|[ff01::213]:33332/|[ff01::114]:33332/&tv.tf=true&tv.fl=test_basictv,test_offtv&shards.qt=tvrh&qt=tvrh&tv=true&sort=id+asc&wt=javabin&q=id:0&fl=id,score} hits=1 status=0 QTime=2 
   [junit4]   2> 119100 T403 C269 oasc.SolrCore.execute [collection1] webapp= path=/select params={qt=tvrh&tv=true&wt=javabin&q=id:0&ids=0&fl=*,score&distrib=false&NOW=1387482491108&isShard=true&version=2&shard.url=[ff01::083]:33332/|127.0.0.1:41068/|[ff01::213]:33332/|[ff01::114]:33332/&tv.tf=true&tv.fl=test_basictv,test_offtv&shards.qt=tvrh} status=0 QTime=1 
   [junit4]   2> 119101 T404 C269 oasc.SolrCore.execute [collection1] webapp= path=/select params={shards=[ff01::083]:33332/|127.0.0.1:41068/|[ff01::213]:33332/|[ff01::114]:33332/&wt=javabin&q=id:0&qt=tvrh&tv=true&sort=id+asc&fl=*,score&tv.tf=true&tv.fl=test_basictv,test_offtv&shards.qt=tvrh&version=2} hits=1 status=0 QTime=9 
   [junit4]   2> 119104 T390 C268 oasc.SolrCore.execute [collection1] webapp= path=/select params={distrib=false&qt=tvrh&sort=id+asc&tv=true&q=id:0&wt=javabin&version=2&fl=*,score&tv.tf=true&tv.fl=test_basictv&tv.fl=test_offtv&shards.qt=tvrh} hits=1 status=0 QTime=1 
   [junit4]   2> 119111 T401 C269 oasc.SolrCore.execute [collection1] webapp= path=/select params={wt=javabin&q=id:0&qt=tvrh&tv=true&sort=id+asc&fl=id,score&rows=10&isShard=true&distrib=false&NOW=1387482491122&start=0&shard.url=[ff01::083]:33332/|[ff01::213]:33332/|127.0.0.1:41068/&tv.tf=true&tv.fl=test_basictv&tv.fl=test_offtv&shards.qt=tvrh&fsv=true&version=2} hits=1 status=0 QTime=1 
   [junit4]   2> 119114 T403 C269 oasc.SolrCore.execute [collection1] webapp= path=/select params={ids=0&fl=*,score&tv=true&qt=tvrh&wt=javabin&q=id:0&version=2&shard.url=[ff01::083]:33332/|[ff01::213]:33332/|127.0.0.1:41068/&tv.tf=true&tv.fl=test_basictv&tv.fl=test_offtv&shards.qt=tvrh&NOW=1387482491122&distrib=false&isShard=true} status=0 QTime=1 
   [junit4]   2> 119115 T402 C269 oasc.SolrCore.execute [collection1] webapp= path=/select params={tv=true&sort=id+asc&qt=tvrh&wt=javabin&q=id:0&shards=[ff01::083]:33332/|[ff01::213]:33332/|127.0.0.1:41068/&version=2&tv.tf=true&tv.fl=test_basictv&tv.fl=test_offtv&shards.qt=tvrh&fl=*,score} hits=1 status=0 QTime=9 
   [junit4]   2> 119116 T383 oas.BaseDistributedSearchTestCase.compareSolrResponses ERROR Mismatched responses:
   [junit4]   2> 	{responseHeader={status=0,QTime=9},response={numFound=1,start=0,maxScore=2.609438,docs=[SolrDocument{id=0, range_facet_si=0, range_facet_l=[0], range_facet_sl=[0], test_posofftv=[This is a title and another title], test_basictv=[This is a title and another title], test_notv=[This is a title and another title], test_postv=[This is a title and another title], test_offtv=[This is a title and another title], _version_=1454880839723646976, intDefault=42, timestamp=Thu Dec 19 14:48:10 EST 2013, multiDefault=[muLti-Default], score=2.609438}]},termVectors={uniqueKeyFieldName=id,0={uniqueKey=0,test_offtv={anoth={tf=1},titl={tf=2}},test_basictv={anoth={tf=1},titl={tf=2}}}}}
   [junit4]   2> 	{responseHeader={status=0,QTime=1},response={numFound=1,start=0,maxScore=2.609438,docs=[SolrDocument{id=0, range_facet_si=0, range_facet_l=[0], range_facet_sl=[0], test_posofftv=[This is a title and another title], test_basictv=[This is a title and another title], test_notv=[This is a title and another title], test_postv=[This is a title and another title], test_offtv=[This is a title and another title], _version_=1454880839710015488, intDefault=42, timestamp=Thu Dec 19 14:48:10 EST 2013, multiDefault=[muLti-Default], score=2.609438}]},termVectors={uniqueKeyFieldName=id,0={uniqueKey=0,test_basictv={anoth={tf=1},titl={tf=2}},test_offtv={anoth={tf=1},titl={tf=2}}}}}
   [junit4]   2> 119139 T383 oasc.CoreContainer.shutdown Shutting down CoreContainer instance=-1735573322
   [junit4]   2> 119140 T383 oasc.SolrCore.close [collection1]  CLOSING SolrCore org.apache.solr.core.SolrCore@90eaa233
   [junit4]   2> 119159 T383 oasu.DirectUpdateHandler2.close closing DirectUpdateHandler2{commits=1,autocommits=0,soft autocommits=0,optimizes=0,rollbacks=0,expungeDeletes=0,docsPending=0,adds=0,deletesById=0,deletesByQuery=0,errors=0,cumulative_adds=10,cumulative_deletesById=0,cumulative_deletesByQuery=0,cumulative_errors=0,transaction_logs_total_size=1285,transaction_logs_total_number=1}
   [junit4]   2> 119160 T383 oasu.SolrCoreState.decrefSolrCoreState Closing SolrCoreState
   [junit4]   2> 119161 T383 oasu.DefaultSolrCoreState.closeIndexWriter SolrCoreState ref count has reached 0 - closing IndexWriter
   [junit4]   2> 119161 T383 oasu.DefaultSolrCoreState.closeIndexWriter closing IndexWriter with IndexWriterCloser
   [junit4]   2> 119162 T383 oasc.SolrCore.closeSearcher [collection1] Closing main searcher on request.
   [junit4]   2> 119163 T383 oasc.CachingDirectoryFactory.close Closing MockDirectoryFactory - 2 directories currently being tracked
   [junit4]   2> 119164 T383 oasc.CachingDirectoryFactory.closeCacheValue looking to close ./org.apache.solr.handler.component.TermVectorComponentDistributedTest-1387482488860/control/data/index [CachedDir<<refCount=0;path=./org.apache.solr.handler.component.TermVectorComponentDistributedTest-1387482488860/control/data/index;done=false>>]
   [junit4]   2> 119165 T383 oasc.CachingDirectoryFactory.close Closing directory: ./org.apache.solr.handler.component.TermVectorComponentDistributedTest-1387482488860/control/data/index
   [junit4]   2> 119166 T383 oasc.CachingDirectoryFactory.closeCacheValue looking to close ./org.apache.solr.handler.component.TermVectorComponentDistributedTest-1387482488860/control/data [CachedDir<<refCount=0;path=./org.apache.solr.handler.component.TermVectorComponentDistributedTest-1387482488860/control/data;done=false>>]
   [junit4]   2> 119167 T383 oasc.CachingDirectoryFactory.close Closing directory: ./org.apache.solr.handler.component.TermVectorComponentDistributedTest-1387482488860/control/data
   [junit4]   2> 119168 T383 oejsh.ContextHandler.doStop stopped o.e.j.s.ServletContextHandler{/,null}
   [junit4]   2> 119241 T383 oasc.CoreContainer.shutdown Shutting down CoreContainer instance=-1972357892
   [junit4]   2> 119242 T383 oasc.SolrCore.close [collection1]  CLOSING SolrCore org.apache.solr.core.SolrCore@73164357
   [junit4]   2> 119262 T383 oasu.DirectUpdateHandler2.close closing DirectUpdateHandler2{commits=1,autocommits=0,soft autocommits=0,optimizes=0,rollbacks=0,expungeDeletes=0,docsPending=0,adds=0,deletesById=0,deletesByQuery=0,errors=0,cumulative_adds=10,cumulative_deletesById=0,cumulative_deletesByQuery=0,cumulative_errors=0,transaction_logs_total_size=1285,transaction_logs_total_number=1}
   [junit4]   2> 119263 T383 oasu.SolrCoreState.decrefSolrCoreState Closing SolrCoreState
   [junit4]   2> 119263 T383 oasu.DefaultSolrCoreState.closeIndexWriter SolrCoreState ref count has reached 0 - closing IndexWriter
   [junit4]   2> 119264 T383 oasu.DefaultSolrCoreState.closeIndexWriter closing IndexWriter with IndexWriterCloser
   [junit4]   2> 119265 T383 oasc.SolrCore.closeSearcher [collection1] Closing main searcher on request.
   [junit4]   2> 119265 T383 oasc.CachingDirectoryFactory.close Closing MockDirectoryFactory - 2 directories currently being tracked
   [junit4]   2> 119266 T383 oasc.CachingDirectoryFactory.closeCacheValue looking to close ./org.apache.solr.handler.component.TermVectorComponentDistributedTest-1387482488860/shard0/data/index [CachedDir<<refCount=0;path=./org.apache.solr.handler.component.TermVectorComponentDistributedTest-1387482488860/shard0/data/index;done=false>>]
   [junit4]   2> 119267 T383 oasc.CachingDirectoryFactory.close Closing directory: ./org.apache.solr.handler.component.TermVectorComponentDistributedTest-1387482488860/shard0/data/index
   [junit4]   2> 119267 T383 oasc.CachingDirectoryFactory.closeCacheValue looking to close ./org.apache.solr.handler.component.TermVectorComponentDistributedTest-1387482488860/shard0/data [CachedDir<<refCount=0;path=./org.apache.solr.handler.component.TermVectorComponentDistributedTest-1387482488860/shard0/data;done=false>>]
   [junit4]   2> 119268 T383 oasc.CachingDirectoryFactory.close Closing directory: ./org.apache.solr.handler.component.TermVectorComponentDistributedTest-1387482488860/shard0/data
   [junit4]   2> 119269 T383 oejsh.ContextHandler.doStop stopped o.e.j.s.ServletContextHandler{/,null}
   [junit4]   2> 119328 T383 oas.SolrTestCaseJ4.tearDown ###Ending testDistribSearch
   [junit4]   2> NOTE: reproduce with: ant test  -Dtestcase=TermVectorComponentDistributedTest -Dtests.method=testDistribSearch -Dtests.seed=EE51E7AC3A7F4D47 -Dtests.multiplier=3 -Dtests.slow=true -Dtests.locale=es_PE -Dtests.timezone=SystemV/EST5EDT -Dtests.file.encoding=ISO-8859-1
   [junit4] FAILURE 2.50s J1 | TermVectorComponentDistributedTest.testDistribSearch <<<
   [junit4]    > Throwable #1: junit.framework.AssertionFailedError: .termVectors.0.test_offtv!=test_basictv (unordered or missing)
   [junit4]    > 	at __randomizedtesting.SeedInfo.seed([EE51E7AC3A7F4D47:6FB769B44D202D7B]:0)
   [junit4]    > 	at junit.framework.Assert.fail(Assert.java:50)
   [junit4]    > 	at org.apache.solr.BaseDistributedSearchTestCase.compareSolrResponses(BaseDistributedSearchTestCase.java:822)
   [junit4]    > 	at org.apache.solr.BaseDistributedSearchTestCase.compareResponses(BaseDistributedSearchTestCase.java:841)
   [junit4]    > 	at org.apache.solr.BaseDistributedSearchTestCase.query(BaseDistributedSearchTestCase.java:544)
   [junit4]    > 	at org.apache.solr.BaseDistributedSearchTestCase.query(BaseDistributedSearchTestCase.java:521)
   [junit4]    > 	at org.apache.solr.handler.component.TermVectorComponentDistributedTest.doTest(TermVectorComponentDistributedTest.java:137)
   [junit4]    > 	at org.apache.solr.BaseDistributedSearchTestCase.testDistribSearch(BaseDistributedSearchTestCase.java:855)
   [junit4]    > 	at java.lang.Thread.run(Thread.java:780)
   [junit4]   2> 119340 T383 oas.SolrTestCaseJ4.deleteCore ###deleteCore
   [junit4]   2> NOTE: test params are: codec=Lucene45, sim=RandomSimilarityProvider(queryNorm=true,coord=no): {}, locale=es_PE, timezone=SystemV/EST5EDT
   [junit4]   2> NOTE: Linux 3.8.0-34-generic x86/IBM Corporation 1.7.0 (32-bit)/cpus=8,threads=1,free=43614376,total=139001856
   [junit4]   2> NOTE: All tests run in this JVM: [TestBinaryField, TestPhraseSuggestions, TestDynamicFieldCollectionResource, OutputWriterTest, DocValuesMissingTest, TestDistributedGrouping, TestSolr4Spatial, CoreContainerCoreInitFailuresTest, HdfsBasicDistributedZk2Test, FileUtilsTest, TestComponentsName, PreAnalyzedUpdateProcessorTest, FullSolrCloudDistribCmdsTest, TestAnalyzeInfixSuggestions, StatsComponentTest, TestFastWriter, TestRecoveryHdfs, TermVectorComponentDistributedTest]
   [junit4] Completed on J1 in 2.53s, 1 test, 1 failure <<< FAILURES!

[...truncated 472 lines...]
   [junit4] Suite: org.apache.solr.cloud.OverseerTest
   [junit4]   2> 989616 T3288 oas.SolrTestCaseJ4.initCore ####initCore
   [junit4]   2> Creating dataDir: /mnt/ssd/jenkins/workspace/Lucene-Solr-4.x-Linux/solr/build/solr-core/test/J0/./solrtest-OverseerTest-1387483361765
   [junit4]   2> 989617 T3288 oas.SolrTestCaseJ4.initCore ####initCore end
   [junit4]   2> 989620 T3288 oas.SolrTestCaseJ4.setUp ###Starting testDoubleAssignment
   [junit4]   2> 989621 T3288 oasc.ZkTestServer.run STARTING ZK TEST SERVER
   [junit4]   2> 989621 T3289 oasc.ZkTestServer$ZKServerMain.runFromConfig Starting server
   [junit4]   2> 989722 T3288 oasc.ZkTestServer.run start zk server on port:60896
   [junit4]   2> 989723 T3288 oascc.ConnectionManager.waitForConnected Waiting for client to connect to ZooKeeper
   [junit4]   2> 990265 T3295 oascc.ConnectionManager.process Watcher org.apache.solr.common.cloud.ConnectionManager@877a5b27 name:ZooKeeperConnection Watcher:127.0.0.1:60896/solr got event WatchedEvent state:SyncConnected type:None path:null path:null type:None
   [junit4]   2> 990266 T3288 oascc.ConnectionManager.waitForConnected Client is connected to ZooKeeper
   [junit4]   2> 990267 T3288 oascc.ConnectionManager.waitForConnected Waiting for client to connect to ZooKeeper
   [junit4]   2> 990269 T3297 oascc.ConnectionManager.process Watcher org.apache.solr.common.cloud.ConnectionManager@63d7eed5 name:ZooKeeperConnection Watcher:127.0.0.1:60896 got event WatchedEvent state:SyncConnected type:None path:null path:null type:None
   [junit4]   2> 990269 T3288 oascc.ConnectionManager.waitForConnected Client is connected to ZooKeeper
   [junit4]   2> 990271 T3288 oascc.ConnectionManager.waitForConnected Waiting for client to connect to ZooKeeper
   [junit4]   2> 990272 T3299 oascc.ConnectionManager.process Watcher org.apache.solr.common.cloud.ConnectionManager@1353976a name:ZooKeeperConnection Watcher:127.0.0.1:60896 got event WatchedEvent state:SyncConnected type:None path:null path:null type:None
   [junit4]   2> 990272 T3288 oascc.ConnectionManager.waitForConnected Client is connected to ZooKeeper
   [junit4]   2> 990273 T3288 oascc.SolrZkClient.makePath makePath: /solr
   [junit4]   2> 990275 T3288 oascc.SolrZkClient.makePath makePath: /live_nodes
   [junit4]   2> 990277 T3288 oascc.SolrZkClient.makePath makePath: /clusterstate.json
   [junit4]   2> 990279 T3288 oascc.SolrZkClient.makePath makePath: /aliases.json
   [junit4]   2> 990281 T3288 oascc.ZkStateReader.createClusterStateWatchersAndUpdate Updating cluster state from ZooKeeper... 
   [junit4]   2> 990283 T3288 oascc.ConnectionManager.waitForConnected Waiting for client to connect to ZooKeeper
   [junit4]   2> 990284 T3301 oascc.ConnectionManager.process Watcher org.apache.solr.common.cloud.ConnectionManager@9b49444d name:ZooKeeperConnection Watcher:127.0.0.1:60896/solr got event WatchedEvent state:SyncConnected type:None path:null path:null type:None
   [junit4]   2> 990285 T3288 oascc.ConnectionManager.waitForConnected Client is connected to ZooKeeper
   [junit4]   2> 990286 T3288 oascc.ZkStateReader.createClusterStateWatchersAndUpdate Updating cluster state from ZooKeeper... 
   [junit4]   2> 990288 T3288 oascc.SolrZkClient.makePath makePath: /live_nodes/node1
   [junit4]   2> 990290 T3301 oascc.ZkStateReader$3.process Updating live nodes... (1)
   [junit4]   2> 990290 T3295 oascc.ZkStateReader$3.process Updating live nodes... (1)
   [junit4]   2> 990290 T3288 oascc.ConnectionManager.waitForConnected Waiting for client to connect to ZooKeeper
   [junit4]   2> 990291 T3303 oascc.ConnectionManager.process Watcher org.apache.solr.common.cloud.ConnectionManager@9f090ac8 name:ZooKeeperConnection Watcher:127.0.0.1:60896/solr got event WatchedEvent state:SyncConnected type:None path:null path:null type:None
   [junit4]   2> 990291 T3288 oascc.ConnectionManager.waitForConnected Client is connected to ZooKeeper
   [junit4]   2> 990293 T3288 oascc.SolrZkClient.makePath makePath: /overseer_elect/election
   [junit4]   2> 990298 T3288 oascc.SolrZkClient.makePath makePath: /overseer_elect/leader
   [junit4]   2> 990300 T3288 oasc.Overseer.start Overseer (id=90930109597024260-127.0.0.1:60896_solr-n_0000000000) starting
   [junit4]   2> 990302 T3288 oascc.SolrZkClient.makePath makePath: /overseer/queue
   [junit4]   2> 990305 T3288 oascc.SolrZkClient.makePath makePath: /overseer/queue-work
   [junit4]   2> 990308 T3288 oascc.SolrZkClient.makePath makePath: /overseer/collection-queue-work
   [junit4]   2> 990310 T3305 oasc.OverseerCollectionProcessor.run Process current queue of collection creations
   [junit4]   2> 990311 T3304 oasc.Overseer$ClusterStateUpdater.run Starting to work on the main queue
   [junit4]   2> 990313 T3304 oascc.ZkStateReader.updateClusterState Updating cloud state from ZooKeeper... 
   [junit4]   2> 990313 T3304 oasc.Overseer$ClusterStateUpdater.updateState Update state numShards=1 message={
   [junit4]   2> 	  "operation":"state",
   [junit4]   2> 	  "state":"recovering",
   [junit4]   2> 	  "node_name":"node1",
   [junit4]   2> 	  "core":"core1",
   [junit4]   2> 	  "core_node_name":"core_node1",
   [junit4]   2> 	  "collection":"collection1",
   [junit4]   2> 	  "numShards":"1",
   [junit4]   2> 	  "base_url":"http://node1/solr/"}
   [junit4]   2> 990313 T3304 oasc.Overseer$ClusterStateUpdater.createCollection Create collection collection1 with shards [shard1]
   [junit4]   2> 990314 T3304 oasc.Overseer$ClusterStateUpdater.updateState Assigning new node to shard shard=shard1
   [junit4]   2> 990315 T3303 oasc.DistributedQueue$LatchChildWatcher.process LatchChildWatcher fired on path: /overseer/queue state: SyncConnected type NodeChildrenChanged
   [junit4]   2> 990316 T3301 oascc.ZkStateReader$2.process A cluster state change: WatchedEvent state:SyncConnected type:NodeDataChanged path:/clusterstate.json, has occurred - updating... (live nodes size: 1)
   [junit4]   2> 990316 T3295 oascc.ZkStateReader$2.process A cluster state change: WatchedEvent state:SyncConnected type:NodeDataChanged path:/clusterstate.json, has occurred - updating... (live nodes size: 1)
   [junit4]   2> 990812 T3288 oascc.SolrZkClient.makePath makePath: /collections/collection1/leader_elect/shard1/election
   [junit4]   2> 990819 T3288 oascc.SolrZkClient.makePath makePath: /collections/collection1/leaders/shard1
   [junit4]   2> 990823 T3303 oasc.DistributedQueue$LatchChildWatcher.process LatchChildWatcher fired on path: /overseer/queue state: SyncConnected type NodeChildrenChanged
   [junit4]   2> 990823 T3288 oascc.ZkStateReader.updateClusterState Updating cloud state from ZooKeeper... 
   [junit4]   2> 990824 T3304 oascc.ZkStateReader.updateClusterState Updating cloud state from ZooKeeper... 
   [junit4]   2> 990827 T3295 oascc.ZkStateReader$3.process Updating live nodes... (0)
   [junit4]   2> 990827 T3301 oascc.ZkStateReader$3.process Updating live nodes... (0)
   [junit4]   2> 990829 T3288 oascc.ConnectionManager.waitForConnected Waiting for client to connect to ZooKeeper
   [junit4]   2> 990830 T3303 oasc.DistributedQueue$LatchChildWatcher.process LatchChildWatcher fired on path: /overseer/queue state: SyncConnected type NodeChildrenChanged
   [junit4]   2> 990831 T3307 oascc.ConnectionManager.process Watcher org.apache.solr.common.cloud.ConnectionManager@c695bc9d name:ZooKeeperConnection Watcher:127.0.0.1:60896/solr got event WatchedEvent state:SyncConnected type:None path:null path:null type:None
   [junit4]   2> 990831 T3288 oascc.ConnectionManager.waitForConnected Client is connected to ZooKeeper
   [junit4]   2> 990832 T3288 oascc.ZkStateReader.createClusterStateWatchersAndUpdate Updating cluster state from ZooKeeper... 
   [junit4]   2> 990834 T3288 oascc.SolrZkClient.makePath makePath: /live_nodes/node1
   [junit4]   2> 990836 T3295 oascc.ZkStateReader$3.process Updating live nodes... (1)
   [junit4]   2> 990836 T3307 oascc.ZkStateReader$3.process Updating live nodes... (1)
   [junit4]   2> 990838 T3303 oasc.DistributedQueue$LatchChildWatcher.process LatchChildWatcher fired on path: /overseer/queue state: SyncConnected type NodeChildrenChanged
   [junit4]   2> 990838 T3288 oascc.SolrZkClient.makePath makePath: /collections/collection1/leader_elect/shard1/election
   [junit4]   2> 990839 T3304 oasc.Overseer$ClusterStateUpdater.updateState Update state numShards=1 message={
   [junit4]   2> 	  "operation":"state",
   [junit4]   2> 	  "state":"recovering",
   [junit4]   2> 	  "node_name":"node1",
   [junit4]   2> 	  "core":"core1",
   [junit4]   2> 	  "core_node_name":"core_node1",
   [junit4]   2> 	  "collection":"collection1",
   [junit4]   2> 	  "numShards":"1",
   [junit4]   2> 	  "base_url":"http://node1/solr/"}
   [junit4]   2> 990839 T3304 oasc.Overseer$ClusterStateUpdater.updateState shard=shard1 is already registered
   [junit4]   2> 990841 T3303 oasc.DistributedQueue$LatchChildWatcher.process LatchChildWatcher fired on path: /overseer/queue state: SyncConnected type NodeChildrenChanged
   [junit4]   2> 990842 T3288 oascc.SolrZkClient.makePath makePath: /collections/collection1/leaders/shard1
   [junit4]   2> 990846 T3303 oasc.DistributedQueue$LatchChildWatcher.process LatchChildWatcher fired on path: /overseer/queue state: SyncConnected type NodeChildrenChanged
   [junit4]   2> 990848 T3303 oasc.DistributedQueue$LatchChildWatcher.process LatchChildWatcher fired on path: /overseer/queue state: SyncConnected type NodeChildrenChanged
   [junit4]   2> 990950 T3295 oascc.ZkStateReader$2.process A cluster state change: WatchedEvent state:SyncConnected type:NodeDataChanged path:/clusterstate.json, has occurred - updating... (live nodes size: 1)
   [junit4]   2> 990950 T3307 oascc.ZkStateReader$2.process A cluster state change: WatchedEvent state:SyncConnected type:NodeDataChanged path:/clusterstate.json, has occurred - updating... (live nodes size: 1)
   [junit4]   2> 990951 T3288 oascc.ZkStateReader.updateClusterState Updating cloud state from ZooKeeper... 
   [junit4]   2> 990962 T3307 oascc.ZkStateReader$3.process Updating live nodes... (0)
   [junit4]   2> 990962 T3295 oascc.ZkStateReader$3.process Updating live nodes... (0)
   [junit4]   2> 990963 T3288 oasc.ZkTestServer.send4LetterWord connecting to 127.0.0.1:60896 60896
   [junit4]   2> 991063 T3288 oas.SolrTestCaseJ4.tearDown ###Ending testDoubleAssignment
   [junit4]   1> client port:0.0.0.0/0.0.0.0:0
   [junit4]   2> 991068 T3288 oas.SolrTestCaseJ4.setUp ###Starting testStateChange
   [junit4]   2> 991069 T3288 oasc.ZkTestServer.run STARTING ZK TEST SERVER
   [junit4]   2> 991069 T3308 oasc.ZkTestServer$ZKServerMain.runFromConfig Starting server
   [junit4]   2> 991169 T3288 oasc.ZkTestServer.run start zk server on port:54989
   [junit4]   2> 991170 T3288 oascc.ConnectionManager.waitForConnected Waiting for client to connect to ZooKeeper
   [junit4]   2> 991172 T3314 oascc.ConnectionManager.process Watcher org.apache.solr.common.cloud.ConnectionManager@a314df9d name:ZooKeeperConnection Watcher:127.0.0.1:54989/solr got event WatchedEvent state:SyncConnected type:None path:null path:null type:None
   [junit4]   2> 991173 T3288 oascc.ConnectionManager.waitForConnected Client is connected to ZooKeeper
   [junit4]   2> 991174 T3288 oascc.ConnectionManager.waitForConnected Waiting for client to connect to ZooKeeper
   [junit4]   2> 991175 T3316 oascc.ConnectionManager.process Watcher org.apache.solr.common.cloud.ConnectionManager@9c4d9a91 name:ZooKeeperConnection Watcher:127.0.0.1:54989 got event WatchedEvent state:SyncConnected type:None path:null path:null type:None
   [junit4]   2> 991175 T3288 oascc.ConnectionManager.waitForConnected Client is connected to ZooKeeper
   [junit4]   2> 991188 T3288 oascc.ConnectionManager.waitForConnected Waiting for client to connect to ZooKeeper
   [junit4]   2> 991190 T3318 oascc.ConnectionManager.process Watcher org.apache.solr.common.cloud.ConnectionManager@1e811287 name:ZooKeeperConnection Watcher:127.0.0.1:54989 got event WatchedEvent state:SyncConnected type:None path:null path:null type:None
   [junit4]   2> 991190 T3288 oascc.ConnectionManager.waitForConnected Client is connected to ZooKeeper
   [junit4]   2> 991190 T3288 oascc.SolrZkClient.makePath makePath: /solr
   [junit4]   2> 991192 T3288 oascc.SolrZkClient.makePath makePath: /live_nodes
   [junit4]   2> 991194 T3288 oascc.SolrZkClient.makePath makePath: /clusterstate.json
   [junit4]   2> 991197 T3288 oascc.SolrZkClient.makePath makePath: /aliases.json
   [junit4]   2> 991198 T3288 oascc.ZkStateReader.createClusterStateWatchersAndUpdate Updating cluster state from ZooKeeper... 
   [junit4]   2> 991200 T3288 oascc.ConnectionManager.waitForConnected Waiting for client to connect to ZooKeeper
   [junit4]   2> 991202 T3320 oascc.ConnectionManager.process Watcher org.apache.solr.common.cloud.ConnectionManager@7a500ebd name:ZooKeeperConnection Watcher:127.0.0.1:54989/solr got event WatchedEvent state:SyncConnected type:None path:null path:null type:None
   [junit4]   2> 991202 T3288 oascc.ConnectionManager.waitForConnected Client is connected to ZooKeeper
   [junit4]   2> 991203 T3288 oascc.SolrZkClient.makePath makePath: /overseer_elect/election
   [junit4]   2> 991206 T3288 oascc.SolrZkClient.makePath makePath: /overseer_elect/leader
   [junit4]   2> 991208 T3288 oasc.Overseer.start Overseer (id=90930109691985923-127.0.0.1:54989_solr-n_0000000000) starting
   [junit4]   2> 991210 T3288 oascc.SolrZkClient.makePath makePath: /overseer/queue
   [junit4]   2> 991212 T3288 oascc.SolrZkClient.makePath makePath: /overseer/queue-work
   [junit4]   2> 991214 T3288 oascc.SolrZkClient.makePath makePath: /overseer/collection-queue-work
   [junit4]   2> 991217 T3322 oasc.OverseerCollectionProcessor.run Process current queue of collection creations
   [junit4]   2> 991217 T3321 oasc.Overseer$ClusterStateUpdater.run Starting to work on the main queue
   [junit4]   2> 991219 T3320 oasc.DistributedQueue$LatchChildWatcher.process LatchChildWatcher fired on path: /overseer/queue state: SyncConnected type NodeChildrenChanged
   [junit4]   2> 991219 T3288 oascc.ZkStateReader.updateClusterState Updating cloud state from ZooKeeper... 
   [junit4]   2> 991220 T3321 oascc.ZkStateReader.updateClusterState Updating cloud state from ZooKeeper... 
   [junit4]   2> 991220 T3321 oasc.Overseer$ClusterStateUpdater.updateState Update state numShards=null message={
   [junit4]   2> 	  "operation":"state",
   [junit4]   2> 	  "base_url":"http://127.0.0.1/solr",
   [junit4]   2> 	  "node_name":"node1",
   [junit4]   2> 	  "collection":"collection1",
   [junit4]   2> 	  "core":"core1",
   [junit4]   2> 	  "roles":"",
   [junit4]   2> 	  "state":"recovering"}
   [junit4]   2> 991220 T3321 oasc.Overseer$ClusterStateUpdater.updateState Assigning new node to shard shard=shard1
   [junit4]   2> 991222 T3320 oasc.DistributedQueue$LatchChildWatcher.process LatchChildWatcher fired on path: /overseer/queue state: SyncConnected type NodeChildrenChanged
   [junit4]   2> 991223 T3314 oascc.ZkStateReader$2.process A cluster state change: WatchedEvent state:SyncConnected type:NodeDataChanged path:/clusterstate.json, has occurred - updating... (live nodes size: 0)
   [junit4]   2> 991270 T3288 oascc.ZkStateReader.updateClusterState Updating cloud state from ZooKeeper... 
   [junit4]   2> 991273 T3320 oasc.DistributedQueue$LatchChildWatcher.process LatchChildWatcher fired on path: /overseer/queue state: SyncConnected type NodeChildrenChanged
   [junit4]   2> 991275 T3321 oascc.ZkStateReader.updateClusterState Updating cloud state from ZooKeeper... 
   [junit4]   2> 991275 T3321 oasc.Overseer$ClusterStateUpdater.updateState Update state numShards=null message={
   [junit4]   2> 	  "operation":"state",
   [junit4]   2> 	  "base_url":"http://127.0.0.1/solr",
   [junit4]   2> 	  "node_name":"node1",
   [junit4]   2> 	  "collection":"collection1",
   [junit4]   2> 	  "core":"core1",
   [junit4]   2> 	  "roles":"",
   [junit4]   2> 	  "state":"active"}
   [junit4]   2> 991276 T3321 oasc.Overseer$ClusterStateUpdater.updateState node=core_node1 is already registered
   [junit4]   2> 991276 T3321 oasc.Overseer$ClusterStateUpdater.updateState shard=shard1 is already registered
   [junit4]   2> 991278 T3320 oasc.DistributedQueue$LatchChildWatcher.process LatchChildWatcher fired on path: /overseer/queue state: SyncConnected type NodeChildrenChanged
   [junit4]   2> 991380 T3314 oascc.ZkStateReader$2.process A cluster state change: WatchedEvent state:SyncConnected type:NodeDataChanged path:/clusterstate.json, has occurred - updating... (live nodes size: 0)
   [junit4]   2> 991425 T3288 oasc.ZkTestServer.send4LetterWord connecting to 127.0.0.1:54989 54989
   [junit4]   2> 991792 T3288 oas.SolrTestCaseJ4.tearDown ###Ending testStateChange
   [junit4]   1> client port:0.0.0.0/0.0.0.0:0
   [junit4]   2> 991799 T3288 oas.SolrTestCaseJ4.setUp ###Starting testOverseerFailure
   [junit4]   2> 991800 T3288 oasc.ZkTestServer.run STARTING ZK TEST SERVER
   [junit4]   2> 991801 T3323 oasc.ZkTestServer$ZKServerMain.runFromConfig Starting server
   [junit4]   2> 991901 T3288 oasc.ZkTestServer.run start zk server on port:48047
   [junit4]   2> 991903 T3288 oascc.ConnectionManager.waitForConnected Waiting for client to connect to ZooKeeper
   [junit4]   2> 991905 T3329 oascc.ConnectionManager.process Watcher org.apache.solr.common.cloud.ConnectionManager@8320bff name:ZooKeeperConnection Watcher:127.0.0.1:48047/solr got event WatchedEvent state:SyncConnected type:None path:null path:null type:None
   [junit4]   2> 991905 T3288 oascc.ConnectionManager.waitForConnected Client is connected to ZooKeeper
   [junit4]   2> 991906 T3288 oascc.ConnectionManager.waitForConnected Waiting for client to connect to ZooKeeper
   [junit4]   2> 991907 T3331 oascc.ConnectionManager.process Watcher org.apache.solr.common.cloud.ConnectionManager@e993c452 name:ZooKeeperConnection Watcher:127.0.0.1:48047 got event WatchedEvent state:SyncConnected type:None path:null path:null type:None
   [junit4]   2> 991907 T3288 oascc.ConnectionManager.waitForConnected Client is connected to ZooKeeper
   [junit4]   2> 991919 T3288 oascc.ConnectionManager.waitForConnected Waiting for client to connect to ZooKeeper
   [junit4]   2> 991920 T3333 oascc.ConnectionManager.process Watcher org.apache.solr.common.cloud.ConnectionManager@b0256e56 name:ZooKeeperConnection Watcher:127.0.0.1:48047 got event WatchedEvent state:SyncConnected type:None path:null path:null type:None
   [junit4]   2> 991920 T3288 oascc.ConnectionManager.waitForConnected Client is connected to ZooKeeper
   [junit4]   2> 991921 T3288 oascc.SolrZkClient.makePath makePath: /solr
   [junit4]   2> 991924 T3288 oascc.SolrZkClient.makePath makePath: /live_nodes
   [junit4]   2> 991924 T3324 oazs.NIOServerCnxn.doIO WARN caught end of stream exception EndOfStreamException: Unable to read additional data from client sessionid 0x1430c73fa700002, likely client has closed socket
   [junit4]   2> 	at org.apache.zookeeper.server.NIOServerCnxn.doIO(NIOServerCnxn.java:220)
   [junit4]   2> 	at org.apache.zookeeper.server.NIOServerCnxnFactory.run(NIOServerCnxnFactory.java:208)
   [junit4]   2> 	at java.lang.Thread.run(Thread.java:780)
   [junit4]   2> 
   [junit4]   2> 991926 T3288 oascc.SolrZkClient.makePath makePath: /clusterstate.json
   [junit4]   2> 991929 T3288 oascc.SolrZkClient.makePath makePath: /aliases.json
   [junit4]   2> 991930 T3288 oascc.ZkStateReader.createClusterStateWatchersAndUpdate Updating cluster state from ZooKeeper... 
   [junit4]   2> 991933 T3288 oascc.ConnectionManager.waitForConnected Waiting for client to connect to ZooKeeper
   [junit4]   2> 991934 T3335 oascc.ConnectionManager.process Watcher org.apache.solr.common.cloud.ConnectionManager@97b46621 name:ZooKeeperConnection Watcher:127.0.0.1:48047/solr got event WatchedEvent state:SyncConnected type:None path:null path:null type:None
   [junit4]   2> 991935 T3288 oascc.ConnectionManager.waitForConnected Client is connected to ZooKeeper
   [junit4]   2> 991936 T3288 oascc.ZkStateReader.createClusterStateWatchersAndUpdate Updating cluster state from ZooKeeper... 
   [junit4]   2> 991938 T3288 oascc.SolrZkClient.makePath makePath: /live_nodes/node1
   [junit4]   2> 991941 T3329 oascc.ZkStateReader$3.process Updating live nodes... (1)
   [junit4]   2> 991941 T3335 oascc.ZkStateReader$3.process Updating live nodes... (1)
   [junit4]   2> 991941 T3288 oascc.ConnectionManager.waitForConnected Waiting for client to connect to ZooKeeper
   [junit4]   2> 991942 T3337 oascc.ConnectionManager.process Watcher org.apache.solr.common.cloud.ConnectionManager@d71d0aa1 name:ZooKeeperConnection Watcher:127.0.0.1:48047/solr got event WatchedEvent state:SyncConnected type:None path:null path:null type:None
   [junit4]   2> 991943 T3288 oascc.ConnectionManager.waitForConnected Client is connected to ZooKeeper
   [junit4]   2> 991944 T3288 oascc.SolrZkClient.makePath makePath: /overseer_elect/election
   [junit4]   2> 991948 T3288 oascc.SolrZkClient.makePath makePath: /overseer_elect/leader
   [junit4]   2> 991950 T3288 oasc.Overseer.start Overseer (id=90930109739958276-127.0.0.1:48047_solr-n_0000000000) starting
   [junit4]   2> 991952 T3288 oascc.SolrZkClient.makePath makePath: /overseer/queue
   [junit4]   2> 991956 T3288 oascc.SolrZkClient.makePath makePath: /overseer/queue-wo

[...truncated too long message...]

nit4]   2> 1341087 T3521 oasu.DirectUpdateHandler2.commit start commit{,optimize=false,openSearcher=true,waitSearcher=true,expungeDeletes=false,softCommit=false,prepareCommit=false}
   [junit4]   2> 1341093 T3521 oasc.SolrDeletionPolicy.onCommit SolrDeletionPolicy.onCommit: commits: num=2
   [junit4]   2> 		commit{dir=RateLimitedDirectoryWrapper(MockDirectoryWrapper(org.apache.lucene.store.RAMDirectory@49865c6a lockFactory=org.apache.lucene.store.SingleInstanceLockFactory@c72f661b)),segFN=segments_v,generation=31}
   [junit4]   2> 		commit{dir=RateLimitedDirectoryWrapper(MockDirectoryWrapper(org.apache.lucene.store.RAMDirectory@49865c6a lockFactory=org.apache.lucene.store.SingleInstanceLockFactory@c72f661b)),segFN=segments_w,generation=32}
   [junit4]   2> 1341093 T3521 oasc.SolrDeletionPolicy.updateCommits newest commit generation = 32
   [junit4]   2> 1341094 T3521 oass.SolrIndexSearcher.<init> Opening Searcher@18fb2d6a main
   [junit4]   2> 1341095 T3521 oasu.DirectUpdateHandler2.commit end_commit_flush
   [junit4]   2> 1341096 T3523 oasc.SolrCore.registerSearcher [collection1] Registered new searcher Searcher@18fb2d6a main{StandardDirectoryReader(segments_w:135:nrt _13(4.7):c2/1:delGen=1)}
   [junit4]   2> 1341100 T3521 oasu.DirectUpdateHandler2.commit start commit{,optimize=false,openSearcher=true,waitSearcher=true,expungeDeletes=false,softCommit=false,prepareCommit=false}
   [junit4]   2> 1341104 T3521 oasc.SolrDeletionPolicy.onCommit SolrDeletionPolicy.onCommit: commits: num=2
   [junit4]   2> 		commit{dir=RateLimitedDirectoryWrapper(MockDirectoryWrapper(org.apache.lucene.store.RAMDirectory@49865c6a lockFactory=org.apache.lucene.store.SingleInstanceLockFactory@c72f661b)),segFN=segments_w,generation=32}
   [junit4]   2> 		commit{dir=RateLimitedDirectoryWrapper(MockDirectoryWrapper(org.apache.lucene.store.RAMDirectory@49865c6a lockFactory=org.apache.lucene.store.SingleInstanceLockFactory@c72f661b)),segFN=segments_x,generation=33}
   [junit4]   2> 1341105 T3521 oasc.SolrDeletionPolicy.updateCommits newest commit generation = 33
   [junit4]   2> 1341106 T3521 oass.SolrIndexSearcher.<init> Opening Searcher@d3c79cc3 main
   [junit4]   2> 1341107 T3521 oasu.DirectUpdateHandler2.commit end_commit_flush
   [junit4]   2> 1341108 T3523 oasc.SolrCore.registerSearcher [collection1] Registered new searcher Searcher@d3c79cc3 main{StandardDirectoryReader(segments_x:137:nrt _13(4.7):c2/1:delGen=1 _14(4.7):c1)}
   [junit4]   2> 1341109 T3521 oas.SolrTestCaseJ4.tearDown ###Ending testDupeDetection
   [junit4]   2> NOTE: reproduce with: ant test  -Dtestcase=SignatureUpdateProcessorFactoryTest -Dtests.method=testDupeDetection -Dtests.seed=EE51E7AC3A7F4D47 -Dtests.multiplier=3 -Dtests.slow=true -Dtests.locale=nl_BE -Dtests.timezone=Australia/NSW -Dtests.file.encoding=ISO-8859-1
   [junit4] FAILURE 0.06s J1 | SignatureUpdateProcessorFactoryTest.testDupeDetection <<<
   [junit4]    > Throwable #1: java.lang.AssertionError: expected:<1> but was:<2>
   [junit4]    > 	at __randomizedtesting.SeedInfo.seed([EE51E7AC3A7F4D47:B5611C643938EE3B]:0)
   [junit4]    > 	at org.apache.solr.update.processor.SignatureUpdateProcessorFactoryTest.checkNumDocs(SignatureUpdateProcessorFactoryTest.java:71)
   [junit4]    > 	at org.apache.solr.update.processor.SignatureUpdateProcessorFactoryTest.testDupeDetection(SignatureUpdateProcessorFactoryTest.java:119)
   [junit4]    > 	at java.lang.Thread.run(Thread.java:780)
   [junit4]   2> 1341115 T3521 oas.SolrTestCaseJ4.deleteCore ###deleteCore
   [junit4]   2> 1341115 T3521 oasc.CoreContainer.shutdown Shutting down CoreContainer instance=1458525186
   [junit4]   2> 1341116 T3521 oasc.SolrCore.close [collection1]  CLOSING SolrCore org.apache.solr.core.SolrCore@7a53af2a
   [junit4]   2> 1341125 T3521 oasu.DirectUpdateHandler2.close closing DirectUpdateHandler2{commits=42,autocommits=0,soft autocommits=0,optimizes=0,rollbacks=0,expungeDeletes=0,docsPending=0,adds=0,deletesById=0,deletesByQuery=0,errors=0,cumulative_adds=253,cumulative_deletesById=0,cumulative_deletesByQuery=6,cumulative_errors=0}
   [junit4]   2> 1341126 T3521 oasu.SolrCoreState.decrefSolrCoreState Closing SolrCoreState
   [junit4]   2> 1341126 T3521 oasu.DefaultSolrCoreState.closeIndexWriter SolrCoreState ref count has reached 0 - closing IndexWriter
   [junit4]   2> 1341127 T3521 oasu.DefaultSolrCoreState.closeIndexWriter closing IndexWriter with IndexWriterCloser
   [junit4]   2> 1341127 T3521 oasc.SolrCore.closeSearcher [collection1] Closing main searcher on request.
   [junit4]   2> 1341128 T3521 oasc.CachingDirectoryFactory.close Closing MockDirectoryFactory - 2 directories currently being tracked
   [junit4]   2> 1341128 T3521 oasc.CachingDirectoryFactory.closeCacheValue looking to close /mnt/ssd/jenkins/workspace/Lucene-Solr-4.x-Linux/solr/build/solr-core/test/J1/./solrtest-SignatureUpdateProcessorFactoryTest-1387483711070 [CachedDir<<refCount=0;path=/mnt/ssd/jenkins/workspace/Lucene-Solr-4.x-Linux/solr/build/solr-core/test/J1/./solrtest-SignatureUpdateProcessorFactoryTest-1387483711070;done=false>>]
   [junit4]   2> 1341129 T3521 oasc.CachingDirectoryFactory.close Closing directory: /mnt/ssd/jenkins/workspace/Lucene-Solr-4.x-Linux/solr/build/solr-core/test/J1/./solrtest-SignatureUpdateProcessorFactoryTest-1387483711070
   [junit4]   2> 1341129 T3521 oasc.CachingDirectoryFactory.closeCacheValue looking to close /mnt/ssd/jenkins/workspace/Lucene-Solr-4.x-Linux/solr/build/solr-core/test/J1/./solrtest-SignatureUpdateProcessorFactoryTest-1387483711070/index [CachedDir<<refCount=0;path=/mnt/ssd/jenkins/workspace/Lucene-Solr-4.x-Linux/solr/build/solr-core/test/J1/./solrtest-SignatureUpdateProcessorFactoryTest-1387483711070/index;done=false>>]
   [junit4]   2> 1341130 T3521 oasc.CachingDirectoryFactory.close Closing directory: /mnt/ssd/jenkins/workspace/Lucene-Solr-4.x-Linux/solr/build/solr-core/test/J1/./solrtest-SignatureUpdateProcessorFactoryTest-1387483711070/index
   [junit4]   2> NOTE: test params are: codec=Lucene3x, sim=DefaultSimilarity, locale=nl_BE, timezone=Australia/NSW
   [junit4]   2> NOTE: Linux 3.8.0-34-generic x86/IBM Corporation 1.7.0 (32-bit)/cpus=8,threads=1,free=97143752,total=258146304
   [junit4]   2> NOTE: All tests run in this JVM: [TestBinaryField, TestPhraseSuggestions, TestDynamicFieldCollectionResource, OutputWriterTest, DocValuesMissingTest, TestDistributedGrouping, TestSolr4Spatial, CoreContainerCoreInitFailuresTest, HdfsBasicDistributedZk2Test, FileUtilsTest, TestComponentsName, PreAnalyzedUpdateProcessorTest, FullSolrCloudDistribCmdsTest, TestAnalyzeInfixSuggestions, StatsComponentTest, TestFastWriter, TestRecoveryHdfs, TermVectorComponentDistributedTest, TestRandomFaceting, DirectUpdateHandlerTest, CurrencyFieldXmlFileTest, TestNumberUtils, TestStressRecovery, TestFieldTypeCollectionResource, SuggesterWFSTTest, TestIndexSearcher, DisMaxRequestHandlerTest, PreAnalyzedFieldTest, LeaderElectionIntegrationTest, RequiredFieldsTest, TestQuerySenderListener, HighlighterConfigTest, DistributedQueryComponentCustomSortTest, TestCustomSort, SolrCmdDistributorTest, CurrencyFieldOpenExchangeTest, MinimalSchemaTest, DeleteShardTest, TestSchemaNameResource, AlternateDirectoryTest, ChaosMonkeySafeLeaderTest, TestIndexingPerformance, OpenCloseCoreStressTest, HighlighterTest, DebugComponentTest, ZkSolrClientTest, TestDistributedSearch, TestDefaultSimilarityFactory, IndexSchemaRuntimeFieldTest, TestJmxIntegration, DefaultValueUpdateProcessorTest, TestCoreDiscovery, MultiTermTest, SolrIndexConfigTest, ChangedSchemaMergeTest, TestZkChroot, RAMDirectoryFactoryTest, DateFieldTest, CoreMergeIndexesAdminHandlerTest, BasicDistributedZk2Test, TestSolrXml, TestAddFieldRealTimeGet, TestWordDelimiterFilterFactory, TestCollationField, TestRandomMergePolicy, SpellingQueryConverterTest, TestStressReorder, BlockCacheTest, TestMultiCoreConfBootstrap, HdfsLockFactoryTest, BlockDirectoryTest, IndexBasedSpellCheckerTest, TriLevelCompositeIdRoutingTest, TestCodecSupport, DistributedDebugComponentTest, TestDistribDocBasedVersion, TestStressLucene, TestFastOutputStream, SolrRequestParserTest, TestQuerySenderNoQuery, SpellCheckComponentTest, DistributedSuggestComponentTest, DeleteInactiveReplicaTest, RecoveryZkTest, TestReload, TestStressVersions, HardAutoCommitTest, TestRangeQuery, SimpleFacetsTest, BadIndexSchemaTest, ConvertedLegacyTest, TestFiltering, ShowFileRequestHandlerTest, DistributedQueryElevationComponentTest, SolrIndexSplitterTest, SignatureUpdateProcessorFactoryTest]
   [junit4] Completed on J1 in 2.10s, 6 tests, 1 failure <<< FAILURES!

[...truncated 431 lines...]
BUILD FAILED
/mnt/ssd/jenkins/workspace/Lucene-Solr-4.x-Linux/build.xml:459: The following error occurred while executing this line:
/mnt/ssd/jenkins/workspace/Lucene-Solr-4.x-Linux/build.xml:452: The following error occurred while executing this line:
/mnt/ssd/jenkins/workspace/Lucene-Solr-4.x-Linux/build.xml:39: The following error occurred while executing this line:
/mnt/ssd/jenkins/workspace/Lucene-Solr-4.x-Linux/extra-targets.xml:37: The following error occurred while executing this line:
/mnt/ssd/jenkins/workspace/Lucene-Solr-4.x-Linux/solr/build.xml:189: The following error occurred while executing this line:
/mnt/ssd/jenkins/workspace/Lucene-Solr-4.x-Linux/solr/common-build.xml:491: The following error occurred while executing this line:
/mnt/ssd/jenkins/workspace/Lucene-Solr-4.x-Linux/lucene/common-build.xml:1307: The following error occurred while executing this line:
/mnt/ssd/jenkins/workspace/Lucene-Solr-4.x-Linux/lucene/common-build.xml:940: There were test failures: 347 suites, 1517 tests, 1 error, 3 failures, 34 ignored (6 assumptions)

Total time: 55 minutes 56 seconds
Build step 'Invoke Ant' marked build as failure
Description set: Java: 32bit/ibm-j9-jdk7 -Xjit:exclude={org/apache/lucene/util/fst/FST.pack(IIF)Lorg/apache/lucene/util/fst/FST;}
Archiving artifacts
Recording test results
Email was triggered for: Failure
Sending email for trigger: Failure



Mime
View raw message