lucene-dev mailing list archives

Site index · List index
Message view « Date » · « Thread »
Top « Date » · « Thread »
From Policeman Jenkins Server <jenk...@thetaphi.de>
Subject [JENKINS] Lucene-Solr-trunk-Linux (32bit/ibm-j9-jdk7) - Build # 8541 - Still Failing!
Date Mon, 02 Dec 2013 06:40:43 GMT
Build: http://jenkins.thetaphi.de/job/Lucene-Solr-trunk-Linux/8541/
Java: 32bit/ibm-j9-jdk7 -Xjit:exclude={org/apache/lucene/util/fst/FST.pack(IIF)Lorg/apache/lucene/util/fst/FST;}

5 tests failed.
REGRESSION:  org.apache.solr.analytics.expression.ExpressionTest.multiplyTest

Error Message:
Caught exception in getStatResult, xPath = /response/lst[@name='stats']/lst[@name='mr']/double[@name='sum']  raw data: <?xml version="1.0" encoding="UTF-8"?> <response>  <lst name="responseHeader">   <int name="status">0</int>   <int name="QTime">11</int> </lst> <result name="response" numFound="100" start="0"> </result> <lst name="stats">   <lst name="stats_fields"/> </lst> <lst name="stats">   <lst name="rr">     <str name="max">str9</str>     <str name="min">str0</str>     <str name="rmax">9rts</str>     <str name="rmin">0rts</str>   </lst>   <lst name="mr">     <long name="count">100</long>     <null name="mcm"/>     <null name="mean"/>     <null name="median"/>     <null name="su"/>     <null name="sum"/>     <null name="unique"/>   </lst>   <lst name="dmr">     <str name="cma">+2MONTHS</str>     <str name="cme">+2YEARS</str>     <date name="dmma">1812-02-29T23:59:59Z</date>     <date name="dmme">1807-12-31T23:59:59Z</date>     <date name="max">1811-12-31T23:59:59Z</date>     <date name="median">1805-12-31T23:59:59Z</date>   </lst>   <lst name="avr">     <double name="c">100.0</double>     <long name="count">100</long>     <double name="s">2891.0</double>     <double name="sum">2891.0</double>   </lst>   <lst name="pr">     <long name="count">100</long>     <double name="mc">1.2729436151389237E146</double>     <double name="mean">28.91</double>     <double name="su">3.9603293116911423E124</double>     <double name="sum">2891.0</double>     <long name="unique">36</long>   </lst>   <lst name="nr">     <double name="c">-100.0</double>     <long name="count">100</long>     <double name="s">-2891.0</double>     <double name="sum">2891.0</double>   </lst>   <lst name="dr">     <long name="count">100</long>     <double name="mc">0.2891</double>     <double name="mean">28.91</double>     <double name="su">80.30555555555556</double>     <double name="sum">2891.0</double>     <long name="unique">36</long>   </lst>   <lst name="cr">     <str name="ccmax">this is the secondstr9</str>     <str name="ccmin">this is the firststr0</str>     <str name="csmax">this is the second</str>     <str name="csmin">this is the first</str>     <str name="max">str9</str>     <str name="min">str0</str>   </lst>   <lst name="cdr">     <date name="cd1">1800-12-31T23:59:59Z</date>     <date name="cd2">1804-06-30T23:59:59Z</date>     <str name="cs1">1800-12-31T23:59:59Z</str>     <str name="cs2">1804-06-30T23:59:59Z</str>   </lst>   <lst name="cnr">     <double name="c10">10.0</double>     <double name="c8">8.0</double>   </lst>   <lst name="ar">     <long name="count">100</long>     <double name="mcm">153.41</double>     <double name="mean">28.91</double>     <double name="median">24.5</double>     <double name="su">2927.0</double>     <double name="sum">2891.0</double>     <long name="unique">36</long>   </lst>   <lst name="csr">     <str name="cs1">this is the first</str>     <str name="cs2">this is the second</str>     <str name="cs3">this is the third</str>   </lst> </lst> </response> 

Stack Trace:
java.lang.AssertionError: Caught exception in getStatResult, xPath = /response/lst[@name='stats']/lst[@name='mr']/double[@name='sum'] 
raw data: <?xml version="1.0" encoding="UTF-8"?>
<response>

<lst name="responseHeader">
  <int name="status">0</int>
  <int name="QTime">11</int>
</lst>
<result name="response" numFound="100" start="0">
</result>
<lst name="stats">
  <lst name="stats_fields"/>
</lst>
<lst name="stats">
  <lst name="rr">
    <str name="max">str9</str>
    <str name="min">str0</str>
    <str name="rmax">9rts</str>
    <str name="rmin">0rts</str>
  </lst>
  <lst name="mr">
    <long name="count">100</long>
    <null name="mcm"/>
    <null name="mean"/>
    <null name="median"/>
    <null name="su"/>
    <null name="sum"/>
    <null name="unique"/>
  </lst>
  <lst name="dmr">
    <str name="cma">+2MONTHS</str>
    <str name="cme">+2YEARS</str>
    <date name="dmma">1812-02-29T23:59:59Z</date>
    <date name="dmme">1807-12-31T23:59:59Z</date>
    <date name="max">1811-12-31T23:59:59Z</date>
    <date name="median">1805-12-31T23:59:59Z</date>
  </lst>
  <lst name="avr">
    <double name="c">100.0</double>
    <long name="count">100</long>
    <double name="s">2891.0</double>
    <double name="sum">2891.0</double>
  </lst>
  <lst name="pr">
    <long name="count">100</long>
    <double name="mc">1.2729436151389237E146</double>
    <double name="mean">28.91</double>
    <double name="su">3.9603293116911423E124</double>
    <double name="sum">2891.0</double>
    <long name="unique">36</long>
  </lst>
  <lst name="nr">
    <double name="c">-100.0</double>
    <long name="count">100</long>
    <double name="s">-2891.0</double>
    <double name="sum">2891.0</double>
  </lst>
  <lst name="dr">
    <long name="count">100</long>
    <double name="mc">0.2891</double>
    <double name="mean">28.91</double>
    <double name="su">80.30555555555556</double>
    <double name="sum">2891.0</double>
    <long name="unique">36</long>
  </lst>
  <lst name="cr">
    <str name="ccmax">this is the secondstr9</str>
    <str name="ccmin">this is the firststr0</str>
    <str name="csmax">this is the second</str>
    <str name="csmin">this is the first</str>
    <str name="max">str9</str>
    <str name="min">str0</str>
  </lst>
  <lst name="cdr">
    <date name="cd1">1800-12-31T23:59:59Z</date>
    <date name="cd2">1804-06-30T23:59:59Z</date>
    <str name="cs1">1800-12-31T23:59:59Z</str>
    <str name="cs2">1804-06-30T23:59:59Z</str>
  </lst>
  <lst name="cnr">
    <double name="c10">10.0</double>
    <double name="c8">8.0</double>
  </lst>
  <lst name="ar">
    <long name="count">100</long>
    <double name="mcm">153.41</double>
    <double name="mean">28.91</double>
    <double name="median">24.5</double>
    <double name="su">2927.0</double>
    <double name="sum">2891.0</double>
    <long name="unique">36</long>
  </lst>
  <lst name="csr">
    <str name="cs1">this is the first</str>
    <str name="cs2">this is the second</str>
    <str name="cs3">this is the third</str>
  </lst>
</lst>
</response>

	at __randomizedtesting.SeedInfo.seed([B3B55E2FE3804A8D:D8344051D68E7CE3]:0)
	at org.junit.Assert.fail(Assert.java:93)
	at org.apache.solr.analytics.AbstractAnalyticsStatsTest.getStatResult(AbstractAnalyticsStatsTest.java:113)
	at org.apache.solr.analytics.expression.ExpressionTest.multiplyTest(ExpressionTest.java:92)
	at sun.reflect.NativeMethodAccessorImpl.invoke0(Native Method)
	at sun.reflect.NativeMethodAccessorImpl.invoke(NativeMethodAccessorImpl.java:88)
	at sun.reflect.DelegatingMethodAccessorImpl.invoke(DelegatingMethodAccessorImpl.java:55)
	at java.lang.reflect.Method.invoke(Method.java:613)
	at com.carrotsearch.randomizedtesting.RandomizedRunner.invoke(RandomizedRunner.java:1559)
	at com.carrotsearch.randomizedtesting.RandomizedRunner.access$600(RandomizedRunner.java:79)
	at com.carrotsearch.randomizedtesting.RandomizedRunner$6.evaluate(RandomizedRunner.java:737)
	at com.carrotsearch.randomizedtesting.RandomizedRunner$7.evaluate(RandomizedRunner.java:773)
	at com.carrotsearch.randomizedtesting.RandomizedRunner$8.evaluate(RandomizedRunner.java:787)
	at com.carrotsearch.randomizedtesting.rules.SystemPropertiesRestoreRule$1.evaluate(SystemPropertiesRestoreRule.java:53)
	at org.apache.lucene.util.TestRuleSetupTeardownChained$1.evaluate(TestRuleSetupTeardownChained.java:50)
	at org.apache.lucene.util.TestRuleFieldCacheSanity$1.evaluate(TestRuleFieldCacheSanity.java:51)
	at org.apache.lucene.util.AbstractBeforeAfterRule$1.evaluate(AbstractBeforeAfterRule.java:46)
	at com.carrotsearch.randomizedtesting.rules.SystemPropertiesInvariantRule$1.evaluate(SystemPropertiesInvariantRule.java:55)
	at org.apache.lucene.util.TestRuleThreadAndTestName$1.evaluate(TestRuleThreadAndTestName.java:49)
	at org.apache.lucene.util.TestRuleIgnoreAfterMaxFailures$1.evaluate(TestRuleIgnoreAfterMaxFailures.java:70)
	at org.apache.lucene.util.TestRuleMarkFailure$1.evaluate(TestRuleMarkFailure.java:48)
	at com.carrotsearch.randomizedtesting.rules.StatementAdapter.evaluate(StatementAdapter.java:36)
	at com.carrotsearch.randomizedtesting.ThreadLeakControl$StatementRunner.run(ThreadLeakControl.java:358)
	at com.carrotsearch.randomizedtesting.ThreadLeakControl.forkTimeoutingTask(ThreadLeakControl.java:782)
	at com.carrotsearch.randomizedtesting.ThreadLeakControl$3.evaluate(ThreadLeakControl.java:442)
	at com.carrotsearch.randomizedtesting.RandomizedRunner.runSingleTest(RandomizedRunner.java:746)
	at com.carrotsearch.randomizedtesting.RandomizedRunner$3.evaluate(RandomizedRunner.java:648)
	at com.carrotsearch.randomizedtesting.RandomizedRunner$4.evaluate(RandomizedRunner.java:682)
	at com.carrotsearch.randomizedtesting.RandomizedRunner$5.evaluate(RandomizedRunner.java:693)
	at com.carrotsearch.randomizedtesting.rules.StatementAdapter.evaluate(StatementAdapter.java:36)
	at com.carrotsearch.randomizedtesting.rules.SystemPropertiesRestoreRule$1.evaluate(SystemPropertiesRestoreRule.java:53)
	at org.apache.lucene.util.AbstractBeforeAfterRule$1.evaluate(AbstractBeforeAfterRule.java:46)
	at org.apache.lucene.util.TestRuleStoreClassName$1.evaluate(TestRuleStoreClassName.java:42)
	at com.carrotsearch.randomizedtesting.rules.SystemPropertiesInvariantRule$1.evaluate(SystemPropertiesInvariantRule.java:55)
	at com.carrotsearch.randomizedtesting.rules.NoShadowingOrOverridesOnMethodsRule$1.evaluate(NoShadowingOrOverridesOnMethodsRule.java:39)
	at com.carrotsearch.randomizedtesting.rules.NoShadowingOrOverridesOnMethodsRule$1.evaluate(NoShadowingOrOverridesOnMethodsRule.java:39)
	at com.carrotsearch.randomizedtesting.rules.StatementAdapter.evaluate(StatementAdapter.java:36)
	at org.apache.lucene.util.TestRuleAssertionsRequired$1.evaluate(TestRuleAssertionsRequired.java:43)
	at org.apache.lucene.util.TestRuleMarkFailure$1.evaluate(TestRuleMarkFailure.java:48)
	at org.apache.lucene.util.TestRuleIgnoreAfterMaxFailures$1.evaluate(TestRuleIgnoreAfterMaxFailures.java:70)
	at org.apache.lucene.util.TestRuleIgnoreTestSuites$1.evaluate(TestRuleIgnoreTestSuites.java:55)
	at com.carrotsearch.randomizedtesting.rules.StatementAdapter.evaluate(StatementAdapter.java:36)
	at com.carrotsearch.randomizedtesting.ThreadLeakControl$StatementRunner.run(ThreadLeakControl.java:358)
	at java.lang.Thread.run(Thread.java:780)


FAILED:  org.apache.solr.handler.component.DistributedQueryElevationComponentTest.testDistribSearch

Error Message:
.responseHeader.params.rows!=fl (unordered or missing)

Stack Trace:
junit.framework.AssertionFailedError: .responseHeader.params.rows!=fl (unordered or missing)
	at __randomizedtesting.SeedInfo.seed([B3B55E2FE3804A8D:3253D03794DF2AB1]:0)
	at junit.framework.Assert.fail(Assert.java:50)
	at org.apache.solr.BaseDistributedSearchTestCase.compareSolrResponses(BaseDistributedSearchTestCase.java:816)
	at org.apache.solr.BaseDistributedSearchTestCase.compareResponses(BaseDistributedSearchTestCase.java:835)
	at org.apache.solr.BaseDistributedSearchTestCase.query(BaseDistributedSearchTestCase.java:538)
	at org.apache.solr.BaseDistributedSearchTestCase.query(BaseDistributedSearchTestCase.java:515)
	at org.apache.solr.handler.component.DistributedQueryElevationComponentTest.doTest(DistributedQueryElevationComponentTest.java:81)
	at org.apache.solr.BaseDistributedSearchTestCase.testDistribSearch(BaseDistributedSearchTestCase.java:843)
	at sun.reflect.NativeMethodAccessorImpl.invoke0(Native Method)
	at sun.reflect.NativeMethodAccessorImpl.invoke(NativeMethodAccessorImpl.java:88)
	at sun.reflect.DelegatingMethodAccessorImpl.invoke(DelegatingMethodAccessorImpl.java:55)
	at java.lang.reflect.Method.invoke(Method.java:613)
	at com.carrotsearch.randomizedtesting.RandomizedRunner.invoke(RandomizedRunner.java:1559)
	at com.carrotsearch.randomizedtesting.RandomizedRunner.access$600(RandomizedRunner.java:79)
	at com.carrotsearch.randomizedtesting.RandomizedRunner$6.evaluate(RandomizedRunner.java:737)
	at com.carrotsearch.randomizedtesting.RandomizedRunner$7.evaluate(RandomizedRunner.java:773)
	at com.carrotsearch.randomizedtesting.RandomizedRunner$8.evaluate(RandomizedRunner.java:787)
	at com.carrotsearch.randomizedtesting.rules.SystemPropertiesRestoreRule$1.evaluate(SystemPropertiesRestoreRule.java:53)
	at org.apache.lucene.util.TestRuleSetupTeardownChained$1.evaluate(TestRuleSetupTeardownChained.java:50)
	at org.apache.lucene.util.TestRuleFieldCacheSanity$1.evaluate(TestRuleFieldCacheSanity.java:51)
	at org.apache.lucene.util.AbstractBeforeAfterRule$1.evaluate(AbstractBeforeAfterRule.java:46)
	at com.carrotsearch.randomizedtesting.rules.SystemPropertiesInvariantRule$1.evaluate(SystemPropertiesInvariantRule.java:55)
	at org.apache.lucene.util.TestRuleThreadAndTestName$1.evaluate(TestRuleThreadAndTestName.java:49)
	at org.apache.lucene.util.TestRuleIgnoreAfterMaxFailures$1.evaluate(TestRuleIgnoreAfterMaxFailures.java:70)
	at org.apache.lucene.util.TestRuleMarkFailure$1.evaluate(TestRuleMarkFailure.java:48)
	at com.carrotsearch.randomizedtesting.rules.StatementAdapter.evaluate(StatementAdapter.java:36)
	at com.carrotsearch.randomizedtesting.ThreadLeakControl$StatementRunner.run(ThreadLeakControl.java:358)
	at com.carrotsearch.randomizedtesting.ThreadLeakControl.forkTimeoutingTask(ThreadLeakControl.java:782)
	at com.carrotsearch.randomizedtesting.ThreadLeakControl$3.evaluate(ThreadLeakControl.java:442)
	at com.carrotsearch.randomizedtesting.RandomizedRunner.runSingleTest(RandomizedRunner.java:746)
	at com.carrotsearch.randomizedtesting.RandomizedRunner$3.evaluate(RandomizedRunner.java:648)
	at com.carrotsearch.randomizedtesting.RandomizedRunner$4.evaluate(RandomizedRunner.java:682)
	at com.carrotsearch.randomizedtesting.RandomizedRunner$5.evaluate(RandomizedRunner.java:693)
	at com.carrotsearch.randomizedtesting.rules.StatementAdapter.evaluate(StatementAdapter.java:36)
	at com.carrotsearch.randomizedtesting.rules.SystemPropertiesRestoreRule$1.evaluate(SystemPropertiesRestoreRule.java:53)
	at org.apache.lucene.util.AbstractBeforeAfterRule$1.evaluate(AbstractBeforeAfterRule.java:46)
	at org.apache.lucene.util.TestRuleStoreClassName$1.evaluate(TestRuleStoreClassName.java:42)
	at com.carrotsearch.randomizedtesting.rules.SystemPropertiesInvariantRule$1.evaluate(SystemPropertiesInvariantRule.java:55)
	at com.carrotsearch.randomizedtesting.rules.NoShadowingOrOverridesOnMethodsRule$1.evaluate(NoShadowingOrOverridesOnMethodsRule.java:39)
	at com.carrotsearch.randomizedtesting.rules.NoShadowingOrOverridesOnMethodsRule$1.evaluate(NoShadowingOrOverridesOnMethodsRule.java:39)
	at com.carrotsearch.randomizedtesting.rules.StatementAdapter.evaluate(StatementAdapter.java:36)
	at org.apache.lucene.util.TestRuleAssertionsRequired$1.evaluate(TestRuleAssertionsRequired.java:43)
	at org.apache.lucene.util.TestRuleMarkFailure$1.evaluate(TestRuleMarkFailure.java:48)
	at org.apache.lucene.util.TestRuleIgnoreAfterMaxFailures$1.evaluate(TestRuleIgnoreAfterMaxFailures.java:70)
	at org.apache.lucene.util.TestRuleIgnoreTestSuites$1.evaluate(TestRuleIgnoreTestSuites.java:55)
	at com.carrotsearch.randomizedtesting.rules.StatementAdapter.evaluate(StatementAdapter.java:36)
	at com.carrotsearch.randomizedtesting.ThreadLeakControl$StatementRunner.run(ThreadLeakControl.java:358)
	at java.lang.Thread.run(Thread.java:780)


FAILED:  org.apache.solr.handler.component.TermVectorComponentDistributedTest.testDistribSearch

Error Message:
.termVectors.0.test_basictv!=test_offtv (unordered or missing)

Stack Trace:
junit.framework.AssertionFailedError: .termVectors.0.test_basictv!=test_offtv (unordered or missing)
	at __randomizedtesting.SeedInfo.seed([B3B55E2FE3804A8D:3253D03794DF2AB1]:0)
	at junit.framework.Assert.fail(Assert.java:50)
	at org.apache.solr.BaseDistributedSearchTestCase.compareSolrResponses(BaseDistributedSearchTestCase.java:816)
	at org.apache.solr.BaseDistributedSearchTestCase.compareResponses(BaseDistributedSearchTestCase.java:835)
	at org.apache.solr.BaseDistributedSearchTestCase.query(BaseDistributedSearchTestCase.java:538)
	at org.apache.solr.BaseDistributedSearchTestCase.query(BaseDistributedSearchTestCase.java:515)
	at org.apache.solr.handler.component.TermVectorComponentDistributedTest.doTest(TermVectorComponentDistributedTest.java:127)
	at org.apache.solr.BaseDistributedSearchTestCase.testDistribSearch(BaseDistributedSearchTestCase.java:849)
	at sun.reflect.NativeMethodAccessorImpl.invoke0(Native Method)
	at sun.reflect.NativeMethodAccessorImpl.invoke(NativeMethodAccessorImpl.java:88)
	at sun.reflect.DelegatingMethodAccessorImpl.invoke(DelegatingMethodAccessorImpl.java:55)
	at java.lang.reflect.Method.invoke(Method.java:613)
	at com.carrotsearch.randomizedtesting.RandomizedRunner.invoke(RandomizedRunner.java:1559)
	at com.carrotsearch.randomizedtesting.RandomizedRunner.access$600(RandomizedRunner.java:79)
	at com.carrotsearch.randomizedtesting.RandomizedRunner$6.evaluate(RandomizedRunner.java:737)
	at com.carrotsearch.randomizedtesting.RandomizedRunner$7.evaluate(RandomizedRunner.java:773)
	at com.carrotsearch.randomizedtesting.RandomizedRunner$8.evaluate(RandomizedRunner.java:787)
	at com.carrotsearch.randomizedtesting.rules.SystemPropertiesRestoreRule$1.evaluate(SystemPropertiesRestoreRule.java:53)
	at org.apache.lucene.util.TestRuleSetupTeardownChained$1.evaluate(TestRuleSetupTeardownChained.java:50)
	at org.apache.lucene.util.TestRuleFieldCacheSanity$1.evaluate(TestRuleFieldCacheSanity.java:51)
	at org.apache.lucene.util.AbstractBeforeAfterRule$1.evaluate(AbstractBeforeAfterRule.java:46)
	at com.carrotsearch.randomizedtesting.rules.SystemPropertiesInvariantRule$1.evaluate(SystemPropertiesInvariantRule.java:55)
	at org.apache.lucene.util.TestRuleThreadAndTestName$1.evaluate(TestRuleThreadAndTestName.java:49)
	at org.apache.lucene.util.TestRuleIgnoreAfterMaxFailures$1.evaluate(TestRuleIgnoreAfterMaxFailures.java:70)
	at org.apache.lucene.util.TestRuleMarkFailure$1.evaluate(TestRuleMarkFailure.java:48)
	at com.carrotsearch.randomizedtesting.rules.StatementAdapter.evaluate(StatementAdapter.java:36)
	at com.carrotsearch.randomizedtesting.ThreadLeakControl$StatementRunner.run(ThreadLeakControl.java:358)
	at com.carrotsearch.randomizedtesting.ThreadLeakControl.forkTimeoutingTask(ThreadLeakControl.java:782)
	at com.carrotsearch.randomizedtesting.ThreadLeakControl$3.evaluate(ThreadLeakControl.java:442)
	at com.carrotsearch.randomizedtesting.RandomizedRunner.runSingleTest(RandomizedRunner.java:746)
	at com.carrotsearch.randomizedtesting.RandomizedRunner$3.evaluate(RandomizedRunner.java:648)
	at com.carrotsearch.randomizedtesting.RandomizedRunner$4.evaluate(RandomizedRunner.java:682)
	at com.carrotsearch.randomizedtesting.RandomizedRunner$5.evaluate(RandomizedRunner.java:693)
	at com.carrotsearch.randomizedtesting.rules.StatementAdapter.evaluate(StatementAdapter.java:36)
	at com.carrotsearch.randomizedtesting.rules.SystemPropertiesRestoreRule$1.evaluate(SystemPropertiesRestoreRule.java:53)
	at org.apache.lucene.util.AbstractBeforeAfterRule$1.evaluate(AbstractBeforeAfterRule.java:46)
	at org.apache.lucene.util.TestRuleStoreClassName$1.evaluate(TestRuleStoreClassName.java:42)
	at com.carrotsearch.randomizedtesting.rules.SystemPropertiesInvariantRule$1.evaluate(SystemPropertiesInvariantRule.java:55)
	at com.carrotsearch.randomizedtesting.rules.NoShadowingOrOverridesOnMethodsRule$1.evaluate(NoShadowingOrOverridesOnMethodsRule.java:39)
	at com.carrotsearch.randomizedtesting.rules.NoShadowingOrOverridesOnMethodsRule$1.evaluate(NoShadowingOrOverridesOnMethodsRule.java:39)
	at com.carrotsearch.randomizedtesting.rules.StatementAdapter.evaluate(StatementAdapter.java:36)
	at org.apache.lucene.util.TestRuleAssertionsRequired$1.evaluate(TestRuleAssertionsRequired.java:43)
	at org.apache.lucene.util.TestRuleMarkFailure$1.evaluate(TestRuleMarkFailure.java:48)
	at org.apache.lucene.util.TestRuleIgnoreAfterMaxFailures$1.evaluate(TestRuleIgnoreAfterMaxFailures.java:70)
	at org.apache.lucene.util.TestRuleIgnoreTestSuites$1.evaluate(TestRuleIgnoreTestSuites.java:55)
	at com.carrotsearch.randomizedtesting.rules.StatementAdapter.evaluate(StatementAdapter.java:36)
	at com.carrotsearch.randomizedtesting.ThreadLeakControl$StatementRunner.run(ThreadLeakControl.java:358)
	at java.lang.Thread.run(Thread.java:780)


FAILED:  org.apache.solr.update.processor.SignatureUpdateProcessorFactoryTest.testMultiThreaded

Error Message:
expected:<1> but was:<2>

Stack Trace:
java.lang.AssertionError: expected:<1> but was:<2>
	at __randomizedtesting.SeedInfo.seed([B3B55E2FE3804A8D:D22084CF0B51407B]:0)
	at org.junit.Assert.fail(Assert.java:93)
	at org.junit.Assert.failNotEquals(Assert.java:647)
	at org.junit.Assert.assertEquals(Assert.java:128)
	at org.junit.Assert.assertEquals(Assert.java:472)
	at org.junit.Assert.assertEquals(Assert.java:456)
	at org.apache.solr.update.processor.SignatureUpdateProcessorFactoryTest.checkNumDocs(SignatureUpdateProcessorFactoryTest.java:71)
	at org.apache.solr.update.processor.SignatureUpdateProcessorFactoryTest.testMultiThreaded(SignatureUpdateProcessorFactoryTest.java:222)
	at sun.reflect.NativeMethodAccessorImpl.invoke0(Native Method)
	at sun.reflect.NativeMethodAccessorImpl.invoke(NativeMethodAccessorImpl.java:88)
	at sun.reflect.DelegatingMethodAccessorImpl.invoke(DelegatingMethodAccessorImpl.java:55)
	at java.lang.reflect.Method.invoke(Method.java:613)
	at com.carrotsearch.randomizedtesting.RandomizedRunner.invoke(RandomizedRunner.java:1559)
	at com.carrotsearch.randomizedtesting.RandomizedRunner.access$600(RandomizedRunner.java:79)
	at com.carrotsearch.randomizedtesting.RandomizedRunner$6.evaluate(RandomizedRunner.java:737)
	at com.carrotsearch.randomizedtesting.RandomizedRunner$7.evaluate(RandomizedRunner.java:773)
	at com.carrotsearch.randomizedtesting.RandomizedRunner$8.evaluate(RandomizedRunner.java:787)
	at com.carrotsearch.randomizedtesting.rules.SystemPropertiesRestoreRule$1.evaluate(SystemPropertiesRestoreRule.java:53)
	at org.apache.lucene.util.TestRuleSetupTeardownChained$1.evaluate(TestRuleSetupTeardownChained.java:50)
	at org.apache.lucene.util.TestRuleFieldCacheSanity$1.evaluate(TestRuleFieldCacheSanity.java:51)
	at org.apache.lucene.util.AbstractBeforeAfterRule$1.evaluate(AbstractBeforeAfterRule.java:46)
	at com.carrotsearch.randomizedtesting.rules.SystemPropertiesInvariantRule$1.evaluate(SystemPropertiesInvariantRule.java:55)
	at org.apache.lucene.util.TestRuleThreadAndTestName$1.evaluate(TestRuleThreadAndTestName.java:49)
	at org.apache.lucene.util.TestRuleIgnoreAfterMaxFailures$1.evaluate(TestRuleIgnoreAfterMaxFailures.java:70)
	at org.apache.lucene.util.TestRuleMarkFailure$1.evaluate(TestRuleMarkFailure.java:48)
	at com.carrotsearch.randomizedtesting.rules.StatementAdapter.evaluate(StatementAdapter.java:36)
	at com.carrotsearch.randomizedtesting.ThreadLeakControl$StatementRunner.run(ThreadLeakControl.java:358)
	at com.carrotsearch.randomizedtesting.ThreadLeakControl.forkTimeoutingTask(ThreadLeakControl.java:782)
	at com.carrotsearch.randomizedtesting.ThreadLeakControl$3.evaluate(ThreadLeakControl.java:442)
	at com.carrotsearch.randomizedtesting.RandomizedRunner.runSingleTest(RandomizedRunner.java:746)
	at com.carrotsearch.randomizedtesting.RandomizedRunner$3.evaluate(RandomizedRunner.java:648)
	at com.carrotsearch.randomizedtesting.RandomizedRunner$4.evaluate(RandomizedRunner.java:682)
	at com.carrotsearch.randomizedtesting.RandomizedRunner$5.evaluate(RandomizedRunner.java:693)
	at com.carrotsearch.randomizedtesting.rules.StatementAdapter.evaluate(StatementAdapter.java:36)
	at com.carrotsearch.randomizedtesting.rules.SystemPropertiesRestoreRule$1.evaluate(SystemPropertiesRestoreRule.java:53)
	at org.apache.lucene.util.AbstractBeforeAfterRule$1.evaluate(AbstractBeforeAfterRule.java:46)
	at org.apache.lucene.util.TestRuleStoreClassName$1.evaluate(TestRuleStoreClassName.java:42)
	at com.carrotsearch.randomizedtesting.rules.SystemPropertiesInvariantRule$1.evaluate(SystemPropertiesInvariantRule.java:55)
	at com.carrotsearch.randomizedtesting.rules.NoShadowingOrOverridesOnMethodsRule$1.evaluate(NoShadowingOrOverridesOnMethodsRule.java:39)
	at com.carrotsearch.randomizedtesting.rules.NoShadowingOrOverridesOnMethodsRule$1.evaluate(NoShadowingOrOverridesOnMethodsRule.java:39)
	at com.carrotsearch.randomizedtesting.rules.StatementAdapter.evaluate(StatementAdapter.java:36)
	at org.apache.lucene.util.TestRuleAssertionsRequired$1.evaluate(TestRuleAssertionsRequired.java:43)
	at org.apache.lucene.util.TestRuleMarkFailure$1.evaluate(TestRuleMarkFailure.java:48)
	at org.apache.lucene.util.TestRuleIgnoreAfterMaxFailures$1.evaluate(TestRuleIgnoreAfterMaxFailures.java:70)
	at org.apache.lucene.util.TestRuleIgnoreTestSuites$1.evaluate(TestRuleIgnoreTestSuites.java:55)
	at com.carrotsearch.randomizedtesting.rules.StatementAdapter.evaluate(StatementAdapter.java:36)
	at com.carrotsearch.randomizedtesting.ThreadLeakControl$StatementRunner.run(ThreadLeakControl.java:358)
	at java.lang.Thread.run(Thread.java:780)


FAILED:  org.apache.solr.update.processor.SignatureUpdateProcessorFactoryTest.testDupeDetection

Error Message:
expected:<1> but was:<3>

Stack Trace:
java.lang.AssertionError: expected:<1> but was:<3>
	at __randomizedtesting.SeedInfo.seed([B3B55E2FE3804A8D:E885A5E7E0C7E9F1]:0)
	at org.junit.Assert.fail(Assert.java:93)
	at org.junit.Assert.failNotEquals(Assert.java:647)
	at org.junit.Assert.assertEquals(Assert.java:128)
	at org.junit.Assert.assertEquals(Assert.java:472)
	at org.junit.Assert.assertEquals(Assert.java:456)
	at org.apache.solr.update.processor.SignatureUpdateProcessorFactoryTest.checkNumDocs(SignatureUpdateProcessorFactoryTest.java:71)
	at org.apache.solr.update.processor.SignatureUpdateProcessorFactoryTest.testDupeDetection(SignatureUpdateProcessorFactoryTest.java:119)
	at sun.reflect.NativeMethodAccessorImpl.invoke0(Native Method)
	at sun.reflect.NativeMethodAccessorImpl.invoke(NativeMethodAccessorImpl.java:88)
	at sun.reflect.DelegatingMethodAccessorImpl.invoke(DelegatingMethodAccessorImpl.java:55)
	at java.lang.reflect.Method.invoke(Method.java:613)
	at com.carrotsearch.randomizedtesting.RandomizedRunner.invoke(RandomizedRunner.java:1559)
	at com.carrotsearch.randomizedtesting.RandomizedRunner.access$600(RandomizedRunner.java:79)
	at com.carrotsearch.randomizedtesting.RandomizedRunner$6.evaluate(RandomizedRunner.java:737)
	at com.carrotsearch.randomizedtesting.RandomizedRunner$7.evaluate(RandomizedRunner.java:773)
	at com.carrotsearch.randomizedtesting.RandomizedRunner$8.evaluate(RandomizedRunner.java:787)
	at com.carrotsearch.randomizedtesting.rules.SystemPropertiesRestoreRule$1.evaluate(SystemPropertiesRestoreRule.java:53)
	at org.apache.lucene.util.TestRuleSetupTeardownChained$1.evaluate(TestRuleSetupTeardownChained.java:50)
	at org.apache.lucene.util.TestRuleFieldCacheSanity$1.evaluate(TestRuleFieldCacheSanity.java:51)
	at org.apache.lucene.util.AbstractBeforeAfterRule$1.evaluate(AbstractBeforeAfterRule.java:46)
	at com.carrotsearch.randomizedtesting.rules.SystemPropertiesInvariantRule$1.evaluate(SystemPropertiesInvariantRule.java:55)
	at org.apache.lucene.util.TestRuleThreadAndTestName$1.evaluate(TestRuleThreadAndTestName.java:49)
	at org.apache.lucene.util.TestRuleIgnoreAfterMaxFailures$1.evaluate(TestRuleIgnoreAfterMaxFailures.java:70)
	at org.apache.lucene.util.TestRuleMarkFailure$1.evaluate(TestRuleMarkFailure.java:48)
	at com.carrotsearch.randomizedtesting.rules.StatementAdapter.evaluate(StatementAdapter.java:36)
	at com.carrotsearch.randomizedtesting.ThreadLeakControl$StatementRunner.run(ThreadLeakControl.java:358)
	at com.carrotsearch.randomizedtesting.ThreadLeakControl.forkTimeoutingTask(ThreadLeakControl.java:782)
	at com.carrotsearch.randomizedtesting.ThreadLeakControl$3.evaluate(ThreadLeakControl.java:442)
	at com.carrotsearch.randomizedtesting.RandomizedRunner.runSingleTest(RandomizedRunner.java:746)
	at com.carrotsearch.randomizedtesting.RandomizedRunner$3.evaluate(RandomizedRunner.java:648)
	at com.carrotsearch.randomizedtesting.RandomizedRunner$4.evaluate(RandomizedRunner.java:682)
	at com.carrotsearch.randomizedtesting.RandomizedRunner$5.evaluate(RandomizedRunner.java:693)
	at com.carrotsearch.randomizedtesting.rules.StatementAdapter.evaluate(StatementAdapter.java:36)
	at com.carrotsearch.randomizedtesting.rules.SystemPropertiesRestoreRule$1.evaluate(SystemPropertiesRestoreRule.java:53)
	at org.apache.lucene.util.AbstractBeforeAfterRule$1.evaluate(AbstractBeforeAfterRule.java:46)
	at org.apache.lucene.util.TestRuleStoreClassName$1.evaluate(TestRuleStoreClassName.java:42)
	at com.carrotsearch.randomizedtesting.rules.SystemPropertiesInvariantRule$1.evaluate(SystemPropertiesInvariantRule.java:55)
	at com.carrotsearch.randomizedtesting.rules.NoShadowingOrOverridesOnMethodsRule$1.evaluate(NoShadowingOrOverridesOnMethodsRule.java:39)
	at com.carrotsearch.randomizedtesting.rules.NoShadowingOrOverridesOnMethodsRule$1.evaluate(NoShadowingOrOverridesOnMethodsRule.java:39)
	at com.carrotsearch.randomizedtesting.rules.StatementAdapter.evaluate(StatementAdapter.java:36)
	at org.apache.lucene.util.TestRuleAssertionsRequired$1.evaluate(TestRuleAssertionsRequired.java:43)
	at org.apache.lucene.util.TestRuleMarkFailure$1.evaluate(TestRuleMarkFailure.java:48)
	at org.apache.lucene.util.TestRuleIgnoreAfterMaxFailures$1.evaluate(TestRuleIgnoreAfterMaxFailures.java:70)
	at org.apache.lucene.util.TestRuleIgnoreTestSuites$1.evaluate(TestRuleIgnoreTestSuites.java:55)
	at com.carrotsearch.randomizedtesting.rules.StatementAdapter.evaluate(StatementAdapter.java:36)
	at com.carrotsearch.randomizedtesting.ThreadLeakControl$StatementRunner.run(ThreadLeakControl.java:358)
	at java.lang.Thread.run(Thread.java:780)




Build Log:
[...truncated 10199 lines...]
   [junit4] Suite: org.apache.solr.handler.component.TermVectorComponentDistributedTest
   [junit4]   2> 517989 T1659 oas.BaseDistributedSearchTestCase.initHostContext Setting hostContext system property: /
   [junit4]   2> 517994 T1659 oas.SolrTestCaseJ4.setUp ###Starting testDistribSearch
   [junit4]   2> 517996 T1659 oejs.Server.doStart jetty-8.1.10.v20130312
   [junit4]   2> 517998 T1659 oejs.AbstractConnector.doStart Started SelectChannelConnector@127.0.0.1:?????
   [junit4]   2> 517999 T1659 oass.SolrDispatchFilter.init SolrDispatchFilter.init()
   [junit4]   2> 518000 T1659 oasc.SolrResourceLoader.locateSolrHome JNDI not configured for solr (NoInitialContextEx)
   [junit4]   2> 518000 T1659 oasc.SolrResourceLoader.locateSolrHome using system property solr.solr.home: /mnt/ssd/jenkins/workspace/Lucene-Solr-trunk-Linux/solr/build/solr-core/test-files/solr
   [junit4]   2> 518001 T1659 oasc.SolrResourceLoader.<init> new SolrResourceLoader for directory: '/mnt/ssd/jenkins/workspace/Lucene-Solr-trunk-Linux/solr/build/solr-core/test-files/solr/'
   [junit4]   2> 518009 T1659 oasc.ConfigSolr.fromFile Loading container configuration from /mnt/ssd/jenkins/workspace/Lucene-Solr-trunk-Linux/solr/build/solr-core/test-files/solr/solr.xml
   [junit4]   2> 518041 T1659 oasc.CoreContainer.<init> New CoreContainer 580703382
   [junit4]   2> 518042 T1659 oasc.CoreContainer.load Loading cores into CoreContainer [instanceDir=/mnt/ssd/jenkins/workspace/Lucene-Solr-trunk-Linux/solr/build/solr-core/test-files/solr/]
   [junit4]   2> 518043 T1659 oashc.HttpShardHandlerFactory.getParameter Setting socketTimeout to: 90000
   [junit4]   2> 518044 T1659 oashc.HttpShardHandlerFactory.getParameter Setting urlScheme to: http://
   [junit4]   2> 518045 T1659 oashc.HttpShardHandlerFactory.getParameter Setting connTimeout to: 15000
   [junit4]   2> 518045 T1659 oashc.HttpShardHandlerFactory.getParameter Setting maxConnectionsPerHost to: 20
   [junit4]   2> 518046 T1659 oashc.HttpShardHandlerFactory.getParameter Setting corePoolSize to: 0
   [junit4]   2> 518046 T1659 oashc.HttpShardHandlerFactory.getParameter Setting maximumPoolSize to: 2147483647
   [junit4]   2> 518047 T1659 oashc.HttpShardHandlerFactory.getParameter Setting maxThreadIdleTime to: 5
   [junit4]   2> 518047 T1659 oashc.HttpShardHandlerFactory.getParameter Setting sizeOfQueue to: -1
   [junit4]   2> 518048 T1659 oashc.HttpShardHandlerFactory.getParameter Setting fairnessPolicy to: false
   [junit4]   2> 518052 T1659 oasl.LogWatcher.createWatcher SLF4J impl is org.slf4j.impl.Log4jLoggerFactory
   [junit4]   2> 518053 T1659 oasl.LogWatcher.newRegisteredLogWatcher Registering Log Listener [Log4j (org.slf4j.impl.Log4jLoggerFactory)]
   [junit4]   2> 518053 T1659 oasc.CoreContainer.load Host Name: 127.0.0.1
   [junit4]   2> 518057 T1669 oasc.CoreContainer.create Creating SolrCore 'collection1' using instanceDir: /mnt/ssd/jenkins/workspace/Lucene-Solr-trunk-Linux/solr/build/solr-core/test-files/solr/collection1
   [junit4]   2> 518058 T1669 oasc.SolrResourceLoader.<init> new SolrResourceLoader for directory: '/mnt/ssd/jenkins/workspace/Lucene-Solr-trunk-Linux/solr/build/solr-core/test-files/solr/collection1/'
   [junit4]   2> 518059 T1669 oasc.SolrResourceLoader.replaceClassLoader Adding 'file:/mnt/ssd/jenkins/workspace/Lucene-Solr-trunk-Linux/solr/build/solr-core/test-files/solr/collection1/lib/classes/' to classloader
   [junit4]   2> 518059 T1669 oasc.SolrResourceLoader.replaceClassLoader Adding 'file:/mnt/ssd/jenkins/workspace/Lucene-Solr-trunk-Linux/solr/build/solr-core/test-files/solr/collection1/lib/README' to classloader
   [junit4]   2> 518097 T1669 oasc.SolrConfig.<init> Using Lucene MatchVersion: LUCENE_50
   [junit4]   2> 518157 T1669 oasc.SolrConfig.<init> Loaded SolrConfig: solrconfig.xml
   [junit4]   2> 518158 T1669 oass.IndexSchema.readSchema Reading Solr Schema from schema.xml
   [junit4]   2> 518169 T1669 oass.IndexSchema.readSchema [collection1] Schema name=test
   [junit4]   2> 518522 T1669 oass.OpenExchangeRatesOrgProvider.init Initialized with rates=open-exchange-rates.json, refreshInterval=1440.
   [junit4]   2> 518528 T1669 oass.IndexSchema.readSchema default search field in schema is text
   [junit4]   2> 518530 T1669 oass.IndexSchema.readSchema unique key field: id
   [junit4]   2> 518544 T1669 oass.FileExchangeRateProvider.reload Reloading exchange rates from file currency.xml
   [junit4]   2> 518548 T1669 oass.FileExchangeRateProvider.reload Reloading exchange rates from file currency.xml
   [junit4]   2> 518551 T1669 oass.OpenExchangeRatesOrgProvider.reload Reloading exchange rates from open-exchange-rates.json
   [junit4]   2> 518552 T1669 oass.OpenExchangeRatesOrgProvider$OpenExchangeRates.<init> WARN Unknown key IMPORTANT NOTE
   [junit4]   2> 518552 T1669 oass.OpenExchangeRatesOrgProvider$OpenExchangeRates.<init> WARN Expected key, got STRING
   [junit4]   2> 518552 T1669 oass.OpenExchangeRatesOrgProvider.reload Reloading exchange rates from open-exchange-rates.json
   [junit4]   2> 518553 T1669 oass.OpenExchangeRatesOrgProvider$OpenExchangeRates.<init> WARN Unknown key IMPORTANT NOTE
   [junit4]   2> 518553 T1669 oass.OpenExchangeRatesOrgProvider$OpenExchangeRates.<init> WARN Expected key, got STRING
   [junit4]   2> 518554 T1669 oasc.SolrCore.initDirectoryFactory org.apache.solr.core.MockDirectoryFactory
   [junit4]   2> 518554 T1669 oasc.SolrCore.<init> [collection1] Opening new SolrCore at /mnt/ssd/jenkins/workspace/Lucene-Solr-trunk-Linux/solr/build/solr-core/test-files/solr/collection1/, dataDir=./org.apache.solr.handler.component.TermVectorComponentDistributedTest-1385965195098/control/data/
   [junit4]   2> 518554 T1669 oasc.JmxMonitoredMap.<init> JMX monitoring is enabled. Adding Solr mbeans to JMX Server: com.sun.jmx.mbeanserver.JmxMBeanServer@94b803f4
   [junit4]   2> 518555 T1669 oasc.CachingDirectoryFactory.get return new directory for ./org.apache.solr.handler.component.TermVectorComponentDistributedTest-1385965195098/control/data
   [junit4]   2> 518556 T1669 oasc.SolrCore.getNewIndexDir New index directory detected: old=null new=./org.apache.solr.handler.component.TermVectorComponentDistributedTest-1385965195098/control/data/index/
   [junit4]   2> 518556 T1669 oasc.SolrCore.initIndex WARN [collection1] Solr index directory './org.apache.solr.handler.component.TermVectorComponentDistributedTest-1385965195098/control/data/index' doesn't exist. Creating new index...
   [junit4]   2> 518556 T1669 oasc.CachingDirectoryFactory.get return new directory for ./org.apache.solr.handler.component.TermVectorComponentDistributedTest-1385965195098/control/data/index
   [junit4]   2> 518557 T1669 oasu.RandomMergePolicy.<init> RandomMergePolicy wrapping class org.apache.lucene.index.LogByteSizeMergePolicy: [LogByteSizeMergePolicy: minMergeSize=1677721, mergeFactor=41, maxMergeSize=2147483648, maxMergeSizeForForcedMerge=9223372036854775807, calibrateSizeByDeletes=false, maxMergeDocs=2147483647, maxCFSSegmentSizeMB=8.796093022207999E12, noCFSRatio=1.0]
   [junit4]   2> 518557 T1669 oasc.SolrDeletionPolicy.onCommit SolrDeletionPolicy.onCommit: commits: num=1
   [junit4]   2> 		commit{dir=RateLimitedDirectoryWrapper(MockDirectoryWrapper(org.apache.lucene.store.RAMDirectory@c2a7b31b lockFactory=org.apache.lucene.store.SingleInstanceLockFactory@87563cb7)),segFN=segments_1,generation=1}
   [junit4]   2> 518558 T1669 oasc.SolrDeletionPolicy.updateCommits newest commit generation = 1
   [junit4]   2> 518558 T1669 oasc.SolrCore.initWriters created xml: solr.XMLResponseWriter
   [junit4]   2> 518561 T1669 oasup.UpdateRequestProcessorChain.init creating updateRequestProcessorChain "dedupe"
   [junit4]   2> 518561 T1669 oasup.UpdateRequestProcessorChain.init inserting DistributedUpdateProcessorFactory into updateRequestProcessorChain "dedupe"
   [junit4]   2> 518561 T1669 oasup.UpdateRequestProcessorChain.init creating updateRequestProcessorChain "dedupe-allfields"
   [junit4]   2> 518562 T1669 oasup.UpdateRequestProcessorChain.init inserting DistributedUpdateProcessorFactory into updateRequestProcessorChain "dedupe-allfields"
   [junit4]   2> 518562 T1669 oasup.UpdateRequestProcessorChain.init creating updateRequestProcessorChain "stored_sig"
   [junit4]   2> 518562 T1669 oasup.UpdateRequestProcessorChain.init inserting DistributedUpdateProcessorFactory into updateRequestProcessorChain "stored_sig"
   [junit4]   2> 518563 T1669 oasup.UpdateRequestProcessorChain.init creating updateRequestProcessorChain "uniq-fields"
   [junit4]   2> 518563 T1669 oasup.UpdateRequestProcessorChain.init inserting DistributedUpdateProcessorFactory into updateRequestProcessorChain "uniq-fields"
   [junit4]   2> 518564 T1669 oasup.UpdateRequestProcessorChain.init creating updateRequestProcessorChain "distrib-dup-test-chain-explicit"
   [junit4]   2> 518564 T1669 oasup.UpdateRequestProcessorChain.init creating updateRequestProcessorChain "distrib-dup-test-chain-implicit"
   [junit4]   2> 518565 T1669 oasup.UpdateRequestProcessorChain.init inserting DistributedUpdateProcessorFactory into updateRequestProcessorChain "distrib-dup-test-chain-implicit"
   [junit4]   2> 518565 T1669 oasc.SolrCore.loadUpdateProcessorChains no updateRequestProcessorChain defined as default, creating implicit default
   [junit4]   2> 518565 T1669 oasc.RequestHandlers.initHandlersFromConfig adding lazy requestHandler: solr.ReplicationHandler
   [junit4]   2> 518566 T1669 oasc.RequestHandlers.initHandlersFromConfig created /replication: solr.ReplicationHandler
   [junit4]   2> 518566 T1669 oasc.RequestHandlers.initHandlersFromConfig created standard: solr.StandardRequestHandler
   [junit4]   2> 518566 T1669 oasc.RequestHandlers.initHandlersFromConfig created /get: solr.RealTimeGetHandler
   [junit4]   2> 518567 T1669 oasc.RequestHandlers.initHandlersFromConfig created dismax: solr.SearchHandler
   [junit4]   2> 518567 T1669 oasc.RequestHandlers.initHandlersFromConfig created mock: org.apache.solr.core.MockQuerySenderListenerReqHandler
   [junit4]   2> 518568 T1669 oasc.RequestHandlers.initHandlersFromConfig created /admin/: org.apache.solr.handler.admin.AdminHandlers
   [junit4]   2> 518568 T1669 oasc.RequestHandlers.initHandlersFromConfig created /admin/file: solr.admin.ShowFileRequestHandler
   [junit4]   2> 518569 T1669 oasc.RequestHandlers.initHandlersFromConfig created defaults: solr.StandardRequestHandler
   [junit4]   2> 518569 T1669 oasc.RequestHandlers.initHandlersFromConfig adding lazy requestHandler: solr.StandardRequestHandler
   [junit4]   2> 518569 T1669 oasc.RequestHandlers.initHandlersFromConfig created lazy: solr.StandardRequestHandler
   [junit4]   2> 518570 T1669 oasc.RequestHandlers.initHandlersFromConfig created /update: solr.UpdateRequestHandler
   [junit4]   2> 518570 T1669 oasc.RequestHandlers.initHandlersFromConfig created /terms: org.apache.solr.handler.component.SearchHandler
   [junit4]   2> 518571 T1669 oasc.RequestHandlers.initHandlersFromConfig created spellCheckCompRH: org.apache.solr.handler.component.SearchHandler
   [junit4]   2> 518571 T1669 oasc.RequestHandlers.initHandlersFromConfig created spellCheckCompRH_Direct: org.apache.solr.handler.component.SearchHandler
   [junit4]   2> 518571 T1669 oasc.RequestHandlers.initHandlersFromConfig created spellCheckWithWordbreak: org.apache.solr.handler.component.SearchHandler
   [junit4]   2> 518572 T1669 oasc.RequestHandlers.initHandlersFromConfig created spellCheckWithWordbreak_Direct: org.apache.solr.handler.component.SearchHandler
   [junit4]   2> 518572 T1669 oasc.RequestHandlers.initHandlersFromConfig created spellCheckCompRH1: org.apache.solr.handler.component.SearchHandler
   [junit4]   2> 518573 T1669 oasc.RequestHandlers.initHandlersFromConfig created mltrh: org.apache.solr.handler.component.SearchHandler
   [junit4]   2> 518573 T1669 oasc.RequestHandlers.initHandlersFromConfig created tvrh: org.apache.solr.handler.component.SearchHandler
   [junit4]   2> 518574 T1669 oasc.RequestHandlers.initHandlersFromConfig created /mlt: solr.MoreLikeThisHandler
   [junit4]   2> 518574 T1669 oasc.RequestHandlers.initHandlersFromConfig created /debug/dump: solr.DumpRequestHandler
   [junit4]   2> 518575 T1669 oashl.XMLLoader.init xsltCacheLifetimeSeconds=60
   [junit4]   2> 518577 T1669 oasc.SolrCore.initDeprecatedSupport WARN solrconfig.xml uses deprecated <admin/gettableFiles>, Please update your config to use the ShowFileRequestHandler.
   [junit4]   2> 518579 T1669 oasu.CommitTracker.<init> Hard AutoCommit: disabled
   [junit4]   2> 518579 T1669 oasu.CommitTracker.<init> Soft AutoCommit: disabled
   [junit4]   2> 518580 T1669 oasu.RandomMergePolicy.<init> RandomMergePolicy wrapping class org.apache.lucene.index.LogDocMergePolicy: [LogDocMergePolicy: minMergeSize=1000, mergeFactor=25, maxMergeSize=9223372036854775807, maxMergeSizeForForcedMerge=9223372036854775807, calibrateSizeByDeletes=true, maxMergeDocs=2147483647, maxCFSSegmentSizeMB=8.796093022207999E12, noCFSRatio=0.0]
   [junit4]   2> 518580 T1669 oasc.SolrDeletionPolicy.onInit SolrDeletionPolicy.onInit: commits: num=1
   [junit4]   2> 		commit{dir=RateLimitedDirectoryWrapper(MockDirectoryWrapper(org.apache.lucene.store.RAMDirectory@c2a7b31b lockFactory=org.apache.lucene.store.SingleInstanceLockFactory@87563cb7)),segFN=segments_1,generation=1}
   [junit4]   2> 518581 T1669 oasc.SolrDeletionPolicy.updateCommits newest commit generation = 1
   [junit4]   2> 518581 T1669 oass.SolrIndexSearcher.<init> Opening Searcher@3196a40a main
   [junit4]   2> 518582 T1669 oashc.SpellCheckComponent.inform Initializing spell checkers
   [junit4]   2> 518586 T1669 oass.DirectSolrSpellChecker.init init: {name=direct,classname=DirectSolrSpellChecker,field=lowerfilt,minQueryLength=3}
   [junit4]   2> 518606 T1670 oasc.SolrCore.registerSearcher [collection1] Registered new searcher Searcher@3196a40a main{StandardDirectoryReader(segments_1:1:nrt)}
   [junit4]   2> 518609 T1669 oasc.CoreContainer.registerCore registering core: collection1
   [junit4]   2> 518609 T1659 oass.SolrDispatchFilter.init user.dir=/mnt/ssd/jenkins/workspace/Lucene-Solr-trunk-Linux/solr/build/solr-core/test/J1
   [junit4]   2> 518610 T1659 oass.SolrDispatchFilter.init SolrDispatchFilter.init() done
   [junit4]   2> 518612 T1659 oejs.Server.doStart jetty-8.1.10.v20130312
   [junit4]   2> 518614 T1659 oejs.AbstractConnector.doStart Started SelectChannelConnector@127.0.0.1:?????
   [junit4]   2> 518615 T1659 oass.SolrDispatchFilter.init SolrDispatchFilter.init()
   [junit4]   2> 518615 T1659 oasc.SolrResourceLoader.locateSolrHome JNDI not configured for solr (NoInitialContextEx)
   [junit4]   2> 518616 T1659 oasc.SolrResourceLoader.locateSolrHome using system property solr.solr.home: /mnt/ssd/jenkins/workspace/Lucene-Solr-trunk-Linux/solr/build/solr-core/test-files/solr
   [junit4]   2> 518616 T1659 oasc.SolrResourceLoader.<init> new SolrResourceLoader for directory: '/mnt/ssd/jenkins/workspace/Lucene-Solr-trunk-Linux/solr/build/solr-core/test-files/solr/'
   [junit4]   2> 518624 T1659 oasc.ConfigSolr.fromFile Loading container configuration from /mnt/ssd/jenkins/workspace/Lucene-Solr-trunk-Linux/solr/build/solr-core/test-files/solr/solr.xml
   [junit4]   2> 518656 T1659 oasc.CoreContainer.<init> New CoreContainer 246908116
   [junit4]   2> 518656 T1659 oasc.CoreContainer.load Loading cores into CoreContainer [instanceDir=/mnt/ssd/jenkins/workspace/Lucene-Solr-trunk-Linux/solr/build/solr-core/test-files/solr/]
   [junit4]   2> 518657 T1659 oashc.HttpShardHandlerFactory.getParameter Setting socketTimeout to: 90000
   [junit4]   2> 518658 T1659 oashc.HttpShardHandlerFactory.getParameter Setting urlScheme to: http://
   [junit4]   2> 518659 T1659 oashc.HttpShardHandlerFactory.getParameter Setting connTimeout to: 15000
   [junit4]   2> 518659 T1659 oashc.HttpShardHandlerFactory.getParameter Setting maxConnectionsPerHost to: 20
   [junit4]   2> 518660 T1659 oashc.HttpShardHandlerFactory.getParameter Setting corePoolSize to: 0
   [junit4]   2> 518660 T1659 oashc.HttpShardHandlerFactory.getParameter Setting maximumPoolSize to: 2147483647
   [junit4]   2> 518661 T1659 oashc.HttpShardHandlerFactory.getParameter Setting maxThreadIdleTime to: 5
   [junit4]   2> 518661 T1659 oashc.HttpShardHandlerFactory.getParameter Setting sizeOfQueue to: -1
   [junit4]   2> 518662 T1659 oashc.HttpShardHandlerFactory.getParameter Setting fairnessPolicy to: false
   [junit4]   2> 518666 T1659 oasl.LogWatcher.createWatcher SLF4J impl is org.slf4j.impl.Log4jLoggerFactory
   [junit4]   2> 518667 T1659 oasl.LogWatcher.newRegisteredLogWatcher Registering Log Listener [Log4j (org.slf4j.impl.Log4jLoggerFactory)]
   [junit4]   2> 518667 T1659 oasc.CoreContainer.load Host Name: 127.0.0.1
   [junit4]   2> 518671 T1681 oasc.CoreContainer.create Creating SolrCore 'collection1' using instanceDir: /mnt/ssd/jenkins/workspace/Lucene-Solr-trunk-Linux/solr/build/solr-core/test-files/solr/collection1
   [junit4]   2> 518671 T1681 oasc.SolrResourceLoader.<init> new SolrResourceLoader for directory: '/mnt/ssd/jenkins/workspace/Lucene-Solr-trunk-Linux/solr/build/solr-core/test-files/solr/collection1/'
   [junit4]   2> 518672 T1681 oasc.SolrResourceLoader.replaceClassLoader Adding 'file:/mnt/ssd/jenkins/workspace/Lucene-Solr-trunk-Linux/solr/build/solr-core/test-files/solr/collection1/lib/classes/' to classloader
   [junit4]   2> 518672 T1681 oasc.SolrResourceLoader.replaceClassLoader Adding 'file:/mnt/ssd/jenkins/workspace/Lucene-Solr-trunk-Linux/solr/build/solr-core/test-files/solr/collection1/lib/README' to classloader
   [junit4]   2> 518708 T1681 oasc.SolrConfig.<init> Using Lucene MatchVersion: LUCENE_50
   [junit4]   2> 518750 T1681 oasc.SolrConfig.<init> Loaded SolrConfig: solrconfig.xml
   [junit4]   2> 518750 T1681 oass.IndexSchema.readSchema Reading Solr Schema from schema.xml
   [junit4]   2> 518756 T1681 oass.IndexSchema.readSchema [collection1] Schema name=test
   [junit4]   2> 519059 T1681 oass.OpenExchangeRatesOrgProvider.init Initialized with rates=open-exchange-rates.json, refreshInterval=1440.
   [junit4]   2> 519065 T1681 oass.IndexSchema.readSchema default search field in schema is text
   [junit4]   2> 519067 T1681 oass.IndexSchema.readSchema unique key field: id
   [junit4]   2> 519074 T1681 oass.FileExchangeRateProvider.reload Reloading exchange rates from file currency.xml
   [junit4]   2> 519077 T1681 oass.FileExchangeRateProvider.reload Reloading exchange rates from file currency.xml
   [junit4]   2> 519081 T1681 oass.OpenExchangeRatesOrgProvider.reload Reloading exchange rates from open-exchange-rates.json
   [junit4]   2> 519081 T1681 oass.OpenExchangeRatesOrgProvider$OpenExchangeRates.<init> WARN Unknown key IMPORTANT NOTE
   [junit4]   2> 519081 T1681 oass.OpenExchangeRatesOrgProvider$OpenExchangeRates.<init> WARN Expected key, got STRING
   [junit4]   2> 519082 T1681 oass.OpenExchangeRatesOrgProvider.reload Reloading exchange rates from open-exchange-rates.json
   [junit4]   2> 519082 T1681 oass.OpenExchangeRatesOrgProvider$OpenExchangeRates.<init> WARN Unknown key IMPORTANT NOTE
   [junit4]   2> 519083 T1681 oass.OpenExchangeRatesOrgProvider$OpenExchangeRates.<init> WARN Expected key, got STRING
   [junit4]   2> 519083 T1681 oasc.SolrCore.initDirectoryFactory org.apache.solr.core.MockDirectoryFactory
   [junit4]   2> 519083 T1681 oasc.SolrCore.<init> [collection1] Opening new SolrCore at /mnt/ssd/jenkins/workspace/Lucene-Solr-trunk-Linux/solr/build/solr-core/test-files/solr/collection1/, dataDir=./org.apache.solr.handler.component.TermVectorComponentDistributedTest-1385965195098/shard0/data/
   [junit4]   2> 519084 T1681 oasc.JmxMonitoredMap.<init> JMX monitoring is enabled. Adding Solr mbeans to JMX Server: com.sun.jmx.mbeanserver.JmxMBeanServer@94b803f4
   [junit4]   2> 519085 T1681 oasc.CachingDirectoryFactory.get return new directory for ./org.apache.solr.handler.component.TermVectorComponentDistributedTest-1385965195098/shard0/data
   [junit4]   2> 519085 T1681 oasc.SolrCore.getNewIndexDir New index directory detected: old=null new=./org.apache.solr.handler.component.TermVectorComponentDistributedTest-1385965195098/shard0/data/index/
   [junit4]   2> 519085 T1681 oasc.SolrCore.initIndex WARN [collection1] Solr index directory './org.apache.solr.handler.component.TermVectorComponentDistributedTest-1385965195098/shard0/data/index' doesn't exist. Creating new index...
   [junit4]   2> 519086 T1681 oasc.CachingDirectoryFactory.get return new directory for ./org.apache.solr.handler.component.TermVectorComponentDistributedTest-1385965195098/shard0/data/index
   [junit4]   2> 519086 T1681 oasu.RandomMergePolicy.<init> RandomMergePolicy wrapping class org.apache.lucene.index.LogByteSizeMergePolicy: [LogByteSizeMergePolicy: minMergeSize=1677721, mergeFactor=41, maxMergeSize=2147483648, maxMergeSizeForForcedMerge=9223372036854775807, calibrateSizeByDeletes=false, maxMergeDocs=2147483647, maxCFSSegmentSizeMB=8.796093022207999E12, noCFSRatio=1.0]
   [junit4]   2> 519087 T1681 oasc.SolrDeletionPolicy.onCommit SolrDeletionPolicy.onCommit: commits: num=1
   [junit4]   2> 		commit{dir=RateLimitedDirectoryWrapper(MockDirectoryWrapper(org.apache.lucene.store.RAMDirectory@80c8d8d9 lockFactory=org.apache.lucene.store.SingleInstanceLockFactory@80a9f9c6)),segFN=segments_1,generation=1}
   [junit4]   2> 519087 T1681 oasc.SolrDeletionPolicy.updateCommits newest commit generation = 1
   [junit4]   2> 519088 T1681 oasc.SolrCore.initWriters created xml: solr.XMLResponseWriter
   [junit4]   2> 519090 T1681 oasup.UpdateRequestProcessorChain.init creating updateRequestProcessorChain "dedupe"
   [junit4]   2> 519091 T1681 oasup.UpdateRequestProcessorChain.init inserting DistributedUpdateProcessorFactory into updateRequestProcessorChain "dedupe"
   [junit4]   2> 519091 T1681 oasup.UpdateRequestProcessorChain.init creating updateRequestProcessorChain "dedupe-allfields"
   [junit4]   2> 519091 T1681 oasup.UpdateRequestProcessorChain.init inserting DistributedUpdateProcessorFactory into updateRequestProcessorChain "dedupe-allfields"
   [junit4]   2> 519092 T1681 oasup.UpdateRequestProcessorChain.init creating updateRequestProcessorChain "stored_sig"
   [junit4]   2> 519092 T1681 oasup.UpdateRequestProcessorChain.init inserting DistributedUpdateProcessorFactory into updateRequestProcessorChain "stored_sig"
   [junit4]   2> 519092 T1681 oasup.UpdateRequestProcessorChain.init creating updateRequestProcessorChain "uniq-fields"
   [junit4]   2> 519093 T1681 oasup.UpdateRequestProcessorChain.init inserting DistributedUpdateProcessorFactory into updateRequestProcessorChain "uniq-fields"
   [junit4]   2> 519093 T1681 oasup.UpdateRequestProcessorChain.init creating updateRequestProcessorChain "distrib-dup-test-chain-explicit"
   [junit4]   2> 519094 T1681 oasup.UpdateRequestProcessorChain.init creating updateRequestProcessorChain "distrib-dup-test-chain-implicit"
   [junit4]   2> 519094 T1681 oasup.UpdateRequestProcessorChain.init inserting DistributedUpdateProcessorFactory into updateRequestProcessorChain "distrib-dup-test-chain-implicit"
   [junit4]   2> 519094 T1681 oasc.SolrCore.loadUpdateProcessorChains no updateRequestProcessorChain defined as default, creating implicit default
   [junit4]   2> 519095 T1681 oasc.RequestHandlers.initHandlersFromConfig adding lazy requestHandler: solr.ReplicationHandler
   [junit4]   2> 519095 T1681 oasc.RequestHandlers.initHandlersFromConfig created /replication: solr.ReplicationHandler
   [junit4]   2> 519096 T1681 oasc.RequestHandlers.initHandlersFromConfig created standard: solr.StandardRequestHandler
   [junit4]   2> 519096 T1681 oasc.RequestHandlers.initHandlersFromConfig created /get: solr.RealTimeGetHandler
   [junit4]   2> 519097 T1681 oasc.RequestHandlers.initHandlersFromConfig created dismax: solr.SearchHandler
   [junit4]   2> 519097 T1681 oasc.RequestHandlers.initHandlersFromConfig created mock: org.apache.solr.core.MockQuerySenderListenerReqHandler
   [junit4]   2> 519098 T1681 oasc.RequestHandlers.initHandlersFromConfig created /admin/: org.apache.solr.handler.admin.AdminHandlers
   [junit4]   2> 519098 T1681 oasc.RequestHandlers.initHandlersFromConfig created /admin/file: solr.admin.ShowFileRequestHandler
   [junit4]   2> 519099 T1681 oasc.RequestHandlers.initHandlersFromConfig created defaults: solr.StandardRequestHandler
   [junit4]   2> 519099 T1681 oasc.RequestHandlers.initHandlersFromConfig adding lazy requestHandler: solr.StandardRequestHandler
   [junit4]   2> 519099 T1681 oasc.RequestHandlers.initHandlersFromConfig created lazy: solr.StandardRequestHandler
   [junit4]   2> 519100 T1681 oasc.RequestHandlers.initHandlersFromConfig created /update: solr.UpdateRequestHandler
   [junit4]   2> 519100 T1681 oasc.RequestHandlers.initHandlersFromConfig created /terms: org.apache.solr.handler.component.SearchHandler
   [junit4]   2> 519101 T1681 oasc.RequestHandlers.initHandlersFromConfig created spellCheckCompRH: org.apache.solr.handler.component.SearchHandler
   [junit4]   2> 519101 T1681 oasc.RequestHandlers.initHandlersFromConfig created spellCheckCompRH_Direct: org.apache.solr.handler.component.SearchHandler
   [junit4]   2> 519102 T1681 oasc.RequestHandlers.initHandlersFromConfig created spellCheckWithWordbreak: org.apache.solr.handler.component.SearchHandler
   [junit4]   2> 519102 T1681 oasc.RequestHandlers.initHandlersFromConfig created spellCheckWithWordbreak_Direct: org.apache.solr.handler.component.SearchHandler
   [junit4]   2> 519103 T1681 oasc.RequestHandlers.initHandlersFromConfig created spellCheckCompRH1: org.apache.solr.handler.component.SearchHandler
   [junit4]   2> 519103 T1681 oasc.RequestHandlers.initHandlersFromConfig created mltrh: org.apache.solr.handler.component.SearchHandler
   [junit4]   2> 519104 T1681 oasc.RequestHandlers.initHandlersFromConfig created tvrh: org.apache.solr.handler.component.SearchHandler
   [junit4]   2> 519104 T1681 oasc.RequestHandlers.initHandlersFromConfig created /mlt: solr.MoreLikeThisHandler
   [junit4]   2> 519105 T1681 oasc.RequestHandlers.initHandlersFromConfig created /debug/dump: solr.DumpRequestHandler
   [junit4]   2> 519106 T1681 oashl.XMLLoader.init xsltCacheLifetimeSeconds=60
   [junit4]   2> 519107 T1681 oasc.SolrCore.initDeprecatedSupport WARN solrconfig.xml uses deprecated <admin/gettableFiles>, Please update your config to use the ShowFileRequestHandler.
   [junit4]   2> 519110 T1681 oasu.CommitTracker.<init> Hard AutoCommit: disabled
   [junit4]   2> 519110 T1681 oasu.CommitTracker.<init> Soft AutoCommit: disabled
   [junit4]   2> 519111 T1681 oasu.RandomMergePolicy.<init> RandomMergePolicy wrapping class org.apache.lucene.index.LogDocMergePolicy: [LogDocMergePolicy: minMergeSize=1000, mergeFactor=25, maxMergeSize=9223372036854775807, maxMergeSizeForForcedMerge=9223372036854775807, calibrateSizeByDeletes=true, maxMergeDocs=2147483647, maxCFSSegmentSizeMB=8.796093022207999E12, noCFSRatio=0.0]
   [junit4]   2> 519111 T1681 oasc.SolrDeletionPolicy.onInit SolrDeletionPolicy.onInit: commits: num=1
   [junit4]   2> 		commit{dir=RateLimitedDirectoryWrapper(MockDirectoryWrapper(org.apache.lucene.store.RAMDirectory@80c8d8d9 lockFactory=org.apache.lucene.store.SingleInstanceLockFactory@80a9f9c6)),segFN=segments_1,generation=1}
   [junit4]   2> 519112 T1681 oasc.SolrDeletionPolicy.updateCommits newest commit generation = 1
   [junit4]   2> 519112 T1681 oass.SolrIndexSearcher.<init> Opening Searcher@746e3fe5 main
   [junit4]   2> 519113 T1681 oashc.SpellCheckComponent.inform Initializing spell checkers
   [junit4]   2> 519116 T1681 oass.DirectSolrSpellChecker.init init: {name=direct,classname=DirectSolrSpellChecker,field=lowerfilt,minQueryLength=3}
   [junit4]   2> 519136 T1682 oasc.SolrCore.registerSearcher [collection1] Registered new searcher Searcher@746e3fe5 main{StandardDirectoryReader(segments_1:1:nrt)}
   [junit4]   2> 519142 T1681 oasc.CoreContainer.registerCore registering core: collection1
   [junit4]   2> 519142 T1659 oass.SolrDispatchFilter.init user.dir=/mnt/ssd/jenkins/workspace/Lucene-Solr-trunk-Linux/solr/build/solr-core/test/J1
   [junit4]   2> 519143 T1659 oass.SolrDispatchFilter.init SolrDispatchFilter.init() done
   [junit4]   2> ASYNC  NEW_CORE C1128 name=collection1 org.apache.solr.core.SolrCore@34c4402a
   [junit4]   2> 519363 T1668 C1128 oasup.LogUpdateProcessor.finish [collection1] webapp= path=/update params={wt=javabin&version=2} {add=[0 (1453289841845338112)]} 0 4
   [junit4]   2> ASYNC  NEW_CORE C1129 name=collection1 org.apache.solr.core.SolrCore@51c324ab
   [junit4]   2> 519371 T1678 C1129 oasup.LogUpdateProcessor.finish [collection1] webapp= path=/update params={wt=javabin&version=2} {add=[0 (1453289841855823872)]} 0 2
   [junit4]   2> 519376 T1666 C1128 oasup.LogUpdateProcessor.finish [collection1] webapp= path=/update params={version=2&wt=javabin} {add=[1 (1453289841860018176)]} 0 3
   [junit4]   2> 519380 T1679 C1129 oasup.LogUpdateProcessor.finish [collection1] webapp= path=/update params={version=2&wt=javabin} {add=[1 (1453289841865261056)]} 0 2
   [junit4]   2> 519384 T1667 C1128 oasup.LogUpdateProcessor.finish [collection1] webapp= path=/update params={version=2&wt=javabin} {add=[2 (1453289841870503936)]} 0 1
   [junit4]   2> 519388 T1680 C1129 oasup.LogUpdateProcessor.finish [collection1] webapp= path=/update params={version=2&wt=javabin} {add=[2 (1453289841874698240)]} 0 1
   [junit4]   2> 519392 T1665 C1128 oasup.LogUpdateProcessor.finish [collection1] webapp= path=/update params={version=2&wt=javabin} {add=[3 (1453289841878892544)]} 0 1
   [junit4]   2> 519396 T1677 C1129 oasup.LogUpdateProcessor.finish [collection1] webapp= path=/update params={wt=javabin&version=2} {add=[3 (1453289841883086848)]} 0 1
   [junit4]   2> 519399 T1668 C1128 oasup.LogUpdateProcessor.finish [collection1] webapp= path=/update params={wt=javabin&version=2} {add=[4 (1453289841886232576)]} 0 1
   [junit4]   2> 519401 T1678 C1129 oasup.LogUpdateProcessor.finish [collection1] webapp= path=/update params={version=2&wt=javabin} {add=[4 (1453289841889378304)]} 0 0
   [junit4]   2> 519404 T1666 C1128 oasup.LogUpdateProcessor.finish [collection1] webapp= path=/update params={version=2&wt=javabin} {add=[5 (1453289841892524032)]} 0 0
   [junit4]   2> 519408 T1679 C1129 oasup.LogUpdateProcessor.finish [collection1] webapp= path=/update params={wt=javabin&version=2} {add=[5 (1453289841895669760)]} 0 1
   [junit4]   2> 519412 T1667 C1128 oasup.LogUpdateProcessor.finish [collection1] webapp= path=/update params={version=2&wt=javabin} {add=[6 (1453289841899864064)]} 0 1
   [junit4]   2> 519414 T1680 C1129 oasup.LogUpdateProcessor.finish [collection1] webapp= path=/update params={version=2&wt=javabin} {add=[6 (1453289841903009792)]} 0 0
   [junit4]   2> 519417 T1665 C1128 oasup.LogUpdateProcessor.finish [collection1] webapp= path=/update params={version=2&wt=javabin} {add=[7 (1453289841905106944)]} 0 1
   [junit4]   2> 519419 T1679 C1129 oasup.LogUpdateProcessor.finish [collection1] webapp= path=/update params={wt=javabin&version=2} {add=[7 (1453289841908252672)]} 0 0
   [junit4]   2> 519422 T1668 C1128 oasup.LogUpdateProcessor.finish [collection1] webapp= path=/update params={wt=javabin&version=2} {add=[8 (1453289841910349824)]} 0 1
   [junit4]   2> 519424 T1677 C1129 oasup.LogUpdateProcessor.finish [collection1] webapp= path=/update params={version=2&wt=javabin} {add=[8 (1453289841913495552)]} 0 0
   [junit4]   2> 519427 T1666 C1128 oasup.LogUpdateProcessor.finish [collection1] webapp= path=/update params={wt=javabin&version=2} {add=[9 (1453289841916641280)]} 0 1
   [junit4]   2> 519430 T1680 C1129 oasup.LogUpdateProcessor.finish [collection1] webapp= path=/update params={version=2&wt=javabin} {add=[9 (1453289841918738432)]} 0 1
   [junit4]   2> 519433 T1667 C1128 oasu.DirectUpdateHandler2.commit start commit{,optimize=false,openSearcher=true,waitSearcher=true,expungeDeletes=false,softCommit=false,prepareCommit=false}
   [junit4]   2> 519435 T1667 C1128 oasc.SolrDeletionPolicy.onCommit SolrDeletionPolicy.onCommit: commits: num=2
   [junit4]   2> 		commit{dir=RateLimitedDirectoryWrapper(MockDirectoryWrapper(org.apache.lucene.store.RAMDirectory@c2a7b31b lockFactory=org.apache.lucene.store.SingleInstanceLockFactory@87563cb7)),segFN=segments_1,generation=1}
   [junit4]   2> 		commit{dir=RateLimitedDirectoryWrapper(MockDirectoryWrapper(org.apache.lucene.store.RAMDirectory@c2a7b31b lockFactory=org.apache.lucene.store.SingleInstanceLockFactory@87563cb7)),segFN=segments_2,generation=2}
   [junit4]   2> 519435 T1667 C1128 oasc.SolrDeletionPolicy.updateCommits newest commit generation = 2
   [junit4]   2> 519437 T1667 C1128 oass.SolrIndexSearcher.<init> Opening Searcher@8b442a34 main
   [junit4]   2> 519437 T1667 C1128 oasu.DirectUpdateHandler2.commit end_commit_flush
   [junit4]   2> 519439 T1670 oasc.SolrCore.registerSearcher [collection1] Registered new searcher Searcher@8b442a34 main{StandardDirectoryReader(segments_2:3:nrt _0(5.0):C10)}
   [junit4]   2> 519439 T1667 C1128 oasup.LogUpdateProcessor.finish [collection1] webapp= path=/update params={commit=true&wt=javabin&softCommit=false&waitSearcher=true&version=2} {commit=} 0 6
   [junit4]   2> 519441 T1678 C1129 oasu.DirectUpdateHandler2.commit start commit{,optimize=false,openSearcher=true,waitSearcher=true,expungeDeletes=false,softCommit=false,prepareCommit=false}
   [junit4]   2> 519445 T1678 C1129 oasc.SolrDeletionPolicy.onCommit SolrDeletionPolicy.onCommit: commits: num=2
   [junit4]   2> 		commit{dir=RateLimitedDirectoryWrapper(MockDirectoryWrapper(org.apache.lucene.store.RAMDirectory@80c8d8d9 lockFactory=org.apache.lucene.store.SingleInstanceLockFactory@80a9f9c6)),segFN=segments_1,generation=1}
   [junit4]   2> 		commit{dir=RateLimitedDirectoryWrapper(MockDirectoryWrapper(org.apache.lucene.store.RAMDirectory@80c8d8d9 lockFactory=org.apache.lucene.store.SingleInstanceLockFactory@80a9f9c6)),segFN=segments_2,generation=2}
   [junit4]   2> 519446 T1678 C1129 oasc.SolrDeletionPolicy.updateCommits newest commit generation = 2
   [junit4]   2> 519447 T1678 C1129 oass.SolrIndexSearcher.<init> Opening Searcher@20572f5d main
   [junit4]   2> 519449 T1678 C1129 oasu.DirectUpdateHandler2.commit end_commit_flush
   [junit4]   2> 519450 T1682 oasc.SolrCore.registerSearcher [collection1] Registered new searcher Searcher@20572f5d main{StandardDirectoryReader(segments_2:3:nrt _0(5.0):C10)}
   [junit4]   2> 519450 T1678 C1129 oasup.LogUpdateProcessor.finish [collection1] webapp= path=/update params={version=2&wt=javabin&softCommit=false&commit=true&waitSearcher=true} {commit=} 0 9
   [junit4]   2> 519459 T1665 C1128 oasc.SolrCore.execute [collection1] webapp= path=/select params={tv=true&wt=javabin&q=id:0&distrib=false&qt=tvrh&sort=id+desc&tv.tf=true&version=2&shards.qt=tvrh} hits=1 status=0 QTime=6 
   [junit4]   2> 519464 T1677 C1129 oasc.SolrCore.execute [collection1] webapp= path=/select params={rows=10&NOW=1385965196565&tv.tf=true&fl=id&isShard=true&sort=id+desc&q=id:0&distrib=false&wt=javabin&version=2&shard.url=127.0.0.1:50096/|[ff01::213]:33332/|[ff01::083]:33332/&shards.qt=tvrh&qt=tvrh&start=0&fsv=true&tv=true} hits=1 status=0 QTime=0 
   [junit4]   2> 519468 T1680 C1129 oasc.SolrCore.execute [collection1] webapp= path=/select params={tv=true&q=id:0&distrib=false&wt=javabin&ids=0&qt=tvrh&version=2&shard.url=127.0.0.1:50096/|[ff01::213]:33332/|[ff01::083]:33332/&shards.qt=tvrh&NOW=1385965196565&isShard=true&tv.tf=true} status=0 QTime=0 
   [junit4]   2> 519469 T1679 C1129 oasc.SolrCore.execute [collection1] webapp= path=/select params={wt=javabin&q=id:0&tv=true&tv.tf=true&shards.qt=tvrh&version=2&shards=127.0.0.1:50096/|[ff01::213]:33332/|[ff01::083]:33332/&sort=id+desc&qt=tvrh} hits=1 status=0 QTime=7 
   [junit4]   2> 519473 T1668 C1128 oasc.SolrCore.execute [collection1] webapp= path=/select params={version=2&tv.fl=test_basictv,test_offtv&shards.qt=tvrh&tv.tf=true&fl=*,score&qt=tvrh&sort=id+asc&q=id:0&distrib=false&wt=javabin&tv=true} hits=1 status=0 QTime=0 
   [junit4]   2> 519492 T1677 C1129 oasc.SolrCore.execute [collection1] webapp= path=/select params={sort=id+asc&tv.fl=test_basictv,test_offtv&rows=10&NOW=1385965196579&tv.tf=true&fl=id,score&isShard=true&q=id:0&distrib=false&wt=javabin&qt=tvrh&version=2&shard.url=[ff01::114]:33332/|127.0.0.1:50096/|[ff01::213]:33332/&shards.qt=tvrh&tv=true&start=0&fsv=true} hits=1 status=0 QTime=0 
   [junit4]   2> 519495 T1680 C1129 oasc.SolrCore.execute [collection1] webapp= path=/select params={version=2&shard.url=[ff01::114]:33332/|127.0.0.1:50096/|[ff01::213]:33332/&shards.qt=tvrh&qt=tvrh&ids=0&tv=true&tv.fl=test_basictv,test_offtv&tv.tf=true&fl=*,score&isShard=true&NOW=1385965196579&q=id:0&distrib=false&wt=javabin} status=0 QTime=0 
   [junit4]   2> 519496 T1678 C1129 oasc.SolrCore.execute [collection1] webapp= path=/select params={sort=id+asc&qt=tvrh&tv.tf=true&fl=*,score&shards.qt=tvrh&version=2&shards=[ff01::114]:33332/|127.0.0.1:50096/|[ff01::213]:33332/&tv.fl=test_basictv,test_offtv&tv=true&wt=javabin&q=id:0} hits=1 status=0 QTime=20 
   [junit4]   2> 519497 T1659 oas.BaseDistributedSearchTestCase.compareSolrResponses ERROR Mismatched responses:
   [junit4]   2> 	{responseHeader={status=0,QTime=20},response={numFound=1,start=0,maxScore=2.609438,docs=[SolrDocument{id=0, range_facet_si=0, range_facet_l=[0], range_facet_sl=[0], test_posofftv=[This is a title and another title], test_basictv=[This is a title and another title], test_notv=[This is a title and another title], test_postv=[This is a title and another title], test_offtv=[This is a title and another title], _version_=1453289841855823872, intDefault=42, timestamp=Mon Dec 02 11:49:56 IST 2013, multiDefault=[muLti-Default], score=2.609438}]},termVectors={uniqueKeyFieldName=id,0={uniqueKey=0,test_basictv={anoth={tf=1},titl={tf=2}},test_offtv={anoth={tf=1},titl={tf=2}}}}}
   [junit4]   2> 	{responseHeader={status=0,QTime=0},response={numFound=1,start=0,maxScore=2.609438,docs=[SolrDocument{id=0, range_facet_si=0, range_facet_l=[0], range_facet_sl=[0], test_posofftv=[This is a title and another title], test_basictv=[This is a title and another title], test_notv=[This is a title and another title], test_postv=[This is a title and another title], test_offtv=[This is a title and another title], _version_=1453289841845338112, intDefault=42, timestamp=Mon Dec 02 11:49:56 IST 2013, multiDefault=[muLti-Default], score=2.609438}]},termVectors={uniqueKeyFieldName=id,0={uniqueKey=0,test_offtv={anoth={tf=1},titl={tf=2}},test_basictv={anoth={tf=1},titl={tf=2}}}}}
   [junit4]   2> 519518 T1659 oasc.CoreContainer.shutdown Shutting down CoreContainer instance=580703382
   [junit4]   2> 519519 T1659 oasc.SolrCore.close [collection1]  CLOSING SolrCore org.apache.solr.core.SolrCore@34c4402a
   [junit4]   2> 519527 T1659 oasu.DirectUpdateHandler2.close closing DirectUpdateHandler2{commits=1,autocommits=0,soft autocommits=0,optimizes=0,rollbacks=0,expungeDeletes=0,docsPending=0,adds=0,deletesById=0,deletesByQuery=0,errors=0,cumulative_adds=10,cumulative_deletesById=0,cumulative_deletesByQuery=0,cumulative_errors=0,transaction_logs_total_size=1285,transaction_logs_total_number=1}
   [junit4]   2> 519528 T1659 oasu.SolrCoreState.decrefSolrCoreState Closing SolrCoreState
   [junit4]   2> 519528 T1659 oasu.DefaultSolrCoreState.closeIndexWriter SolrCoreState ref count has reached 0 - closing IndexWriter
   [junit4]   2> 519529 T1659 oasu.DefaultSolrCoreState.closeIndexWriter closing IndexWriter with IndexWriterCloser
   [junit4]   2> 519530 T1659 oasc.SolrCore.closeSearcher [collection1] Closing main searcher on request.
   [junit4]   2> 519531 T1659 oasc.CachingDirectoryFactory.close Closing MockDirectoryFactory - 2 directories currently being tracked
   [junit4]   2> 519531 T1659 oasc.CachingDirectoryFactory.closeCacheValue looking to close ./org.apache.solr.handler.component.TermVectorComponentDistributedTest-1385965195098/control/data [CachedDir<<refCount=0;path=./org.apache.solr.handler.component.TermVectorComponentDistributedTest-1385965195098/control/data;done=false>>]
   [junit4]   2> 519532 T1659 oasc.CachingDirectoryFactory.close Closing directory: ./org.apache.solr.handler.component.TermVectorComponentDistributedTest-1385965195098/control/data
   [junit4]   2> 519532 T1659 oasc.CachingDirectoryFactory.closeCacheValue looking to close ./org.apache.solr.handler.component.TermVectorComponentDistributedTest-1385965195098/control/data/index [CachedDir<<refCount=0;path=./org.apache.solr.handler.component.TermVectorComponentDistributedTest-1385965195098/control/data/index;done=false>>]
   [junit4]   2> 519533 T1659 oasc.CachingDirectoryFactory.close Closing directory: ./org.apache.solr.handler.component.TermVectorComponentDistributedTest-1385965195098/control/data/index
   [junit4]   2> 519534 T1659 oejsh.ContextHandler.doStop stopped o.e.j.s.ServletContextHandler{/,null}
   [junit4]   2> 519607 T1659 oasc.CoreContainer.shutdown Shutting down CoreContainer instance=246908116
   [junit4]   2> 519608 T1659 oasc.SolrCore.close [collection1]  CLOSING SolrCore org.apache.solr.core.SolrCore@51c324ab
   [junit4]   2> 519619 T1659 oasu.DirectUpdateHandler2.close closing DirectUpdateHandler2{commits=1,autocommits=0,soft autocommits=0,optimizes=0,rollbacks=0,expungeDeletes=0,docsPending=0,adds=0,deletesById=0,deletesByQuery=0,errors=0,cumulative_adds=10,cumulative_deletesById=0,cumulative_deletesByQuery=0,cumulative_errors=0,transaction_logs_total_size=1285,transaction_logs_total_number=1}
   [junit4]   2> 519620 T1659 oasu.SolrCoreState.decrefSolrCoreState Closing SolrCoreState
   [junit4]   2> 519620 T1659 oasu.DefaultSolrCoreState.closeIndexWriter SolrCoreState ref count has reached 0 - closing IndexWriter
   [junit4]   2> 519621 T1659 oasu.DefaultSolrCoreState.closeIndexWriter closing IndexWriter with IndexWriterCloser
   [junit4]   2> 519622 T1659 oasc.SolrCore.closeSearcher [collection1] Closing main searcher on request.
   [junit4]   2> 519623 T1659 oasc.CachingDirectoryFactory.close Closing MockDirectoryFactory - 2 directories currently being tracked
   [junit4]   2> 519623 T1659 oasc.CachingDirectoryFactory.closeCacheValue looking to close ./org.apache.solr.handler.component.TermVectorComponentDistributedTest-1385965195098/shard0/data [CachedDir<<refCount=0;path=./org.apache.solr.handler.component.TermVectorComponentDistributedTest-1385965195098/shard0/data;done=false>>]
   [junit4]   2> 519624 T1659 oasc.CachingDirectoryFactory.close Closing directory: ./org.apache.solr.handler.component.TermVectorComponentDistributedTest-1385965195098/shard0/data
   [junit4]   2> 519625 T1659 oasc.CachingDirectoryFactory.closeCacheValue looking to close ./org.apache.solr.handler.component.TermVectorComponentDistributedTest-1385965195098/shard0/data/index [CachedDir<<refCount=0;path=./org.apache.solr.handler.component.TermVectorComponentDistributedTest-1385965195098/shard0/data/index;done=false>>]
   [junit4]   2> 519625 T1659 oasc.CachingDirectoryFactory.close Closing directory: ./org.apache.solr.handler.component.TermVectorComponentDistributedTest-1385965195098/shard0/data/index
   [junit4]   2> 519626 T1659 oejsh.ContextHandler.doStop stopped o.e.j.s.ServletContextHandler{/,null}
   [junit4]   2> 519685 T1659 oas.SolrTestCaseJ4.tearDown ###Ending testDistribSearch
   [junit4]   2> NOTE: reproduce with: ant test  -Dtestcase=TermVectorComponentDistributedTest -Dtests.method=testDistribSearch -Dtests.seed=B3B55E2FE3804A8D -Dtests.multiplier=3 -Dtests.slow=true -Dtests.locale=gu -Dtests.timezone=Asia/Colombo -Dtests.file.encoding=ISO-8859-1
   [junit4] FAILURE 1.71s J1 | TermVectorComponentDistributedTest.testDistribSearch <<<
   [junit4]    > Throwable #1: junit.framework.AssertionFailedError: .termVectors.0.test_basictv!=test_offtv (unordered or missing)
   [junit4]    > 	at __randomizedtesting.SeedInfo.seed([B3B55E2FE3804A8D:3253D03794DF2AB1]:0)
   [junit4]    > 	at junit.framework.Assert.fail(Assert.java:50)
   [junit4]    > 	at org.apache.solr.BaseDistributedSearchTestCase.compareSolrResponses(BaseDistributedSearchTestCase.java:816)
   [junit4]    > 	at org.apache.solr.BaseDistributedSearchTestCase.compareResponses(BaseDistributedSearchTestCase.java:835)
   [junit4]    > 	at org.apache.solr.BaseDistributedSearchTestCase.query(BaseDistributedSearchTestCase.java:538)
   [junit4]    > 	at org.apache.solr.BaseDistributedSearchTestCase.query(BaseDistributedSearchTestCase.java:515)
   [junit4]    > 	at org.apache.solr.handler.component.TermVectorComponentDistributedTest.doTest(TermVectorComponentDistributedTest.java:127)
   [junit4]    > 	at org.apache.solr.BaseDistributedSearchTestCase.testDistribSearch(BaseDistributedSearchTestCase.java:849)
   [junit4]    > 	at java.lang.Thread.run(Thread.java:780)
   [junit4]   2> 519699 T1659 oas.SolrTestCaseJ4.deleteCore ###deleteCore
   [junit4]   2> NOTE: test params are: codec=CheapBastard, sim=DefaultSimilarity, locale=gu, timezone=Asia/Colombo
   [junit4]   2> NOTE: Linux 3.8.0-33-generic x86/IBM Corporation 1.7.0 (32-bit)/cpus=8,threads=1,free=114659680,total=187039744
   [junit4]   2> NOTE: All tests run in this JVM: [OutputWriterTest, TestAnalyzeInfixSuggestions, ZkSolrClientTest, TestRandomFaceting, TestSchemaNameResource, TriLevelCompositeIdRoutingTest, TestStressLucene, FullSolrCloudDistribCmdsTest, BadCopyFieldTest, RequestHandlersTest, CoreMergeIndexesAdminHandlerTest, CoreContainerCoreInitFailuresTest, PathHierarchyTokenizerFactoryTest, DebugComponentTest, BadIndexSchemaTest, SpellingQueryConverterTest, ChaosMonkeyNothingIsSafeTest, RequiredFieldsTest, TestUpdate, OpenCloseCoreStressTest, FieldAnalysisRequestHandlerTest, TestLazyCores, TestCoreDiscovery, TestOmitPositions, TestFastLRUCache, TestDistribDocBasedVersion, HdfsBasicDistributedZk2Test, XsltUpdateRequestHandlerTest, TestMultiCoreConfBootstrap, NoFacetTest, IndexSchemaRuntimeFieldTest, TestImplicitCoreProperties, HdfsChaosMonkeySafeLeaderTest, TestFieldTypeResource, TestWordDelimiterFilterFactory, TestComponentsName, NoCacheHeaderTest, SuggesterWFSTTest, DirectUpdateHandlerTest, IndexBasedSpellCheckerTest, TestSolrDeletionPolicy2, NotRequiredUniqueKeyTest, ConvertedLegacyTest, TestCollationField, TestSolrQueryParserDefaultOperatorResource, TestUniqueKeyFieldResource, ShardRoutingCustomTest, EnumFieldTest, JSONWriterTest, TestRangeQuery, TermVectorComponentDistributedTest]
   [junit4] Completed on J1 in 1.75s, 1 test, 1 failure <<< FAILURES!

[...truncated 56 lines...]
   [junit4] Suite: org.apache.solr.handler.component.DistributedQueryElevationComponentTest
   [junit4]   2> 565342 T1445 oas.BaseDistributedSearchTestCase.initHostContext Setting hostContext system property: /bh_st/
   [junit4]   2> 565345 T1445 oas.SolrTestCaseJ4.setUp ###Starting testDistribSearch
   [junit4]   2> 565346 T1445 oejs.Server.doStart jetty-8.1.10.v20130312
   [junit4]   2> 565348 T1445 oejs.AbstractConnector.doStart Started SelectChannelConnector@127.0.0.1:59014
   [junit4]   2> 565349 T1445 oass.SolrDispatchFilter.init SolrDispatchFilter.init()
   [junit4]   2> 565350 T1445 oasc.SolrResourceLoader.locateSolrHome JNDI not configured for solr (NoInitialContextEx)
   [junit4]   2> 565350 T1445 oasc.SolrResourceLoader.locateSolrHome using system property solr.solr.home: /mnt/ssd/jenkins/workspace/Lucene-Solr-trunk-Linux/solr/build/solr-core/test-files/solr
   [junit4]   2> 565351 T1445 oasc.SolrResourceLoader.<init> new SolrResourceLoader for directory: '/mnt/ssd/jenkins/workspace/Lucene-Solr-trunk-Linux/solr/build/solr-core/test-files/solr/'
   [junit4]   2> 565359 T1445 oasc.ConfigSolr.fromFile Loading container configuration from /mnt/ssd/jenkins/workspace/Lucene-Solr-trunk-Linux/solr/build/solr-core/test-files/solr/solr.xml
   [junit4]   2> 565390 T1445 oasc.CoreContainer.<init> New CoreContainer 607738836
   [junit4]   2> 565391 T1445 oasc.CoreContainer.load Loading cores into CoreContainer [instanceDir=/mnt/ssd/jenkins/workspace/Lucene-Solr-trunk-Linux/solr/build/solr-core/test-files/solr/]
   [junit4]   2> 565392 T1445 oashc.HttpShardHandlerFactory.getParameter Setting socketTimeout to: 90000
   [junit4]   2> 565393 T1445 oashc.HttpShardHandlerFactory.getParameter Setting urlScheme to: http://
   [junit4]   2> 565394 T1445 oashc.HttpShardHandlerFactory.getParameter Setting connTimeout to: 15000
   [junit4]   2> 565394 T1445 oashc.HttpShardHandlerFactory.getParameter Setting maxConnectionsPerHost to: 20
   [junit4]   2> 565395 T1445 oashc.HttpShardHandlerFactory.getParameter Setting corePoolSize to: 0
   [junit4]   2> 565395 T1445 oashc.HttpShardHandlerFactory.getParameter Setting maximumPoolSize to: 2147483647
   [junit4]   2> 565396 T1445 oashc.HttpShardHandlerFactory.getParameter Setting maxThreadIdleTime to: 5
   [junit4]   2> 565396 T1445 oashc.HttpShardHandlerFactory.getParameter Setting sizeOfQueue to: -1
   [junit4]   2> 565397 T1445 oashc.HttpShardHandlerFactory.getParameter Setting fairnessPolicy to: false
   [junit4]   2> 565403 T1445 oasl.LogWatcher.createWatcher SLF4J impl is org.slf4j.impl.Log4jLoggerFactory
   [junit4]   2> 565404 T1445 oasl.LogWatcher.newRegisteredLogWatcher Registering Log Listener [Log4j (org.slf4j.impl.Log4jLoggerFactory)]
   [junit4]   2> 565405 T1445 oasc.CoreContainer.load Host Name: 127.0.0.1
   [junit4]   2> 565409 T1455 oasc.CoreContainer.create Creating SolrCore 'collection1' using instanceDir: /mnt/ssd/jenkins/workspace/Lucene-Solr-trunk-Linux/solr/build/solr-core/test-files/solr/collection1
   [junit4]   2> 565409 T1455 oasc.SolrResourceLoader.<init> new SolrResourceLoader for directory: '/mnt/ssd/jenkins/workspace/Lucene-Solr-trunk-Linux/solr/build/solr-core/test-files/solr/collection1/'
   [junit4]   2> 565410 T1455 oasc.SolrResourceLoader.replaceClassLoader Adding 'file:/mnt/ssd/jenkins/workspace/Lucene-Solr-trunk-Linux/solr/build/solr-core/test-files/solr/collection1/lib/classes/' to classloader
   [junit4]   2> 565410 T1455 oasc.SolrResourceLoader.replaceClassLoader Adding 'file:/mnt/ssd/jenkins/workspace/Lucene-Solr-trunk-Linux/solr/build/solr-core/test-files/solr/collection1/lib/README' to classloader
   [junit4]   2> 565439 T1455 oasc.SolrConfig.<init> Using Lucene MatchVersion: LUCENE_50
   [junit4]   2> 565485 T1455 oasc.SolrConfig.<init> Loaded SolrConfig: solrconfig-elevate.xml
   [junit4]   2> 565486 T1455 oass.IndexSchema.readSchema Reading Solr Schema from schema11.xml
   [junit4]   2> 565490 T1455 oass.IndexSchema.readSchema [collection1] Schema name=example
   [junit4]   2> 565607 T1455 oass.IndexSchema.readSchema default search field in schema is text
   [junit4]   2> 565608 T1455 oass.IndexSchema.readSchema unique key field: id
   [junit4]   2> 565612 T1455 oasc.SolrCore.initDirectoryFactory org.apache.solr.core.MockDirectoryFactory
   [junit4]   2> 565612 T1455 oasc.SolrCore.<init> [collection1] Opening new SolrCore at /mnt/ssd/jenkins/workspace/Lucene-Solr-trunk-Linux/solr/build/solr-core/test-files/solr/collection1/, dataDir=./org.apache.solr.handler.component.DistributedQueryElevationComponentTest-1385965242420/control/data/
   [junit4]   2> 565612 T1455 oasc.JmxMonitoredMap.<init> JMX monitoring is enabled. Adding Solr mbeans to JMX Server: com.sun.jmx.mbeanserver.JmxMBeanServer@da1797c
   [junit4]   2> 565613 T1455 oasc.CachingDirectoryFactory.get return new directory for ./org.apache.solr.handler.component.DistributedQueryElevationComponentTest-1385965242420/control/data
   [junit4]   2> 565614 T1455 oasc.SolrCore.getNewIndexDir New index directory detected: old=null new=./org.apache.solr.handler.component.DistributedQueryElevationComponentTest-1385965242420/control/data/index/
   [junit4]   2> 565614 T1455 oasc.SolrCore.initIndex WARN [collection1] Solr index directory './org.apache.solr.handler.component.DistributedQueryElevationComponentTest-1385965242420/control/data/index' doesn't exist. Creating new index...
   [junit4]   2> 565614 T1455 oasc.CachingDirectoryFactory.get return new directory for ./org.apache.solr.handler.component.DistributedQueryElevationComponentTest-1385965242420/control/data/index
   [junit4]   2> 565615 T1455 oasu.RandomMergePolicy.<init> RandomMergePolicy wrapping class org.apache.lucene.index.MockRandomMergePolicy: org.apache.lucene.index.MockRandomMergePolicy@35bb850a
   [junit4]   2> 565616 T1455 oasc.SolrDeletionPolicy.onCommit SolrDeletionPolicy.onCommit: commits: num=1
   [junit4]   2> 		commit{dir=MockDirectoryWrapper(org.apache.lucene.store.RAMDirectory@efb1bd39 lockFactory=org.apache.lucene.store.SingleInstanceLockFactory@aa20dd51),segFN=segments_1,generation=1}
   [junit4]   2> 565616 T1455 oasc.SolrDeletionPolicy.updateCommits newest commit generation = 1
   [junit4]   2> 565618 T1455 oasc.SolrCore.loadUpdateProcessorChains no updateRequestProcessorChain defined as default, creating implicit default
   [junit4]   2> 565619 T1455 oasc.RequestHandlers.initHandlersFromConfig created /update: solr.UpdateRequestHandler
   [junit4]   2> 565619 T1455 oasc.RequestHandlers.initHandlersFromConfig created /elevate: org.apache.solr.handler.component.SearchHandler
   [junit4]   2> 565620 T1455 oasc.RequestHandlers.initHandlersFromConfig created /dataElevate: org.apache.solr.handler.component.SearchHandler
   [junit4]   2> 565621 T1455 oashl.XMLLoader.init xsltCacheLifetimeSeconds=60
   [junit4]   2> 565621 T1455 oasc.RequestHandlers.initHandlersFromConfig WARN no default request handler is registered (either '/select' or 'standard')
   [junit4]   2> 565622 T1455 oasc.SolrCore.initDeprecatedSupport WARN solrconfig.xml uses deprecated <admin/gettableFiles>, Please update your config to use the ShowFileRequestHandler.
   [junit4]   2> 565624 T1455 oasc.SolrCore.initDeprecatedSupport WARN adding ShowFileRequestHandler with hidden files: [SOLRCONFIG-DELPOLICY2.XML, BAD-SCHEMA-NOT-INDEXED-BUT-TF.XML, BAD-SCHEMA-UNIQUEKEY-USES-DEFAULT.XML, SCHEMA-POSTINGSHIGHLIGHT.XML, SCHEMA-REST-LUCENE-MATCH-VERSION.XML, TRIVIAL.UPDATEPROCESSOR0.JS, SOLRCONFIG-INFOSTREAM-LOGGING.XML, SCHEMA-CLASS-NAME-SHORTENING-ON-SERIALIZATION.XML, REGEX-BOOST-PROCESSOR-TEST.TXT, SCHEMA-TFIDF.XML, SOLRCONFIG-XINCLUDE.XML, SOLRCONFIG-ADD-SCHEMA-FIELDS-UPDATE-PROCESSOR-CHAINS.XML, BAD-SOLRCONFIG-MISSING-SCRIPTFILE.XML, SCHEMA-LMDIRICHLET.XML, OPEN-EXCHANGE-RATES.JSON, HYPHENATION.DTD, COMPOUNDDICTIONARY.TXT, BAD-SOLRCONFIG-MULTIPLE-DIRFACTORY.XML, BAD-SCHEMA-NOT-INDEXED-BUT-NORMS.XML, SOLRCONFIG-QUERYSENDER.XML, SOLRCONFIG-HIGHLIGHT.XML, BAD-SCHEMA-CURRENCY-FT-BOGUS-CODE-IN-XML.XML, FRENCHARTICLES.TXT, SOLRCONFIG-ELEVATE.XML, SCHEMA-ID-AND-VERSION-FIELDS-ONLY.XML, SCHEMA-CUSTOM-FIELD.XML, PROTWORDS.TXT, STOPTYPES-1.TXT, SOLRCONFIG-MASTER1-KEEPONEBACKUP.XML, THROW.ERROR.ON.ADD.UPDATEPROCESSOR.JS, SCHEMA-NOT-REQUIRED-UNIQUE-KEY.XML, SCHEMA-COPYFIELD-TEST.XML, BAD-SCHEMA-SIM-GLOBAL-VS-FT-MISMATCH.XML, BAD-SCHEMA-OMIT-TF-BUT-NOT-POS.XML, CURRENCY.XML, SOLRCONFIG-MERGEPOLICY-DEFAULTS.XML, SCHEMA-STOP-KEEP.XML, BAD-SOLRCONFIG-SCHEMA-MUTABLE-BUT-NOT-MANAGED.XML, SOLRCONFIG-MERGEPOLICY-LEGACY.XML, SOLRCONFIG-SUGGESTERCOMPONENT.XML, SCHEMA-TRIE.XML, SOLRCONFIG-LAZYWRITER.XML, BAD-SCHEMA-DUP-FIELDTYPE.XML, STEMDICT.TXT, SCHEMA-DOCVALUES.XML, SOLRCONFIG-REPEATER.XML, SCHEMA-SWEETSPOT.XML, SOLRCONFIG-POSTINGSHIGHLIGHT.XML, HUNSPELL-TEST.AFF, SCHEMA-SIMPLEQPPLUGIN.XML, SCHEMA-LUCENEMATCHVERSION.XML, MISSING.FUNCTIONS.UPDATEPROCESSOR.JS, SCHEMA-SYNONYM-TOKENIZER.XML, SCHEMA-DISTRIBUTED-MISSING-SORT.XML, SOLRCONFIG-UPDATE-PROCESSOR-CHAINS.XML, BAD-SCHEMA-CURRENCY-FT-OER-NORATES.XML, SCHEMA-DOCVALUESMISSING.XML, CONDITIONAL.UPDATEPROCESSOR.JS, BAD-SCHEMA-CURRENCY-FT-BOGUS-DEFAULT-CODE.XML, SOLRCONFIG-CACHING.XML, SCHEMA-DFR.XML, BAD-SCHEMA-ANALYZER-CLASS-AND-NESTED.XML, XSLT, SCHEMA-ONE-FIELD-NO-DYNAMIC-FIELD.XML, SOLRCONFIG-NOOPREGEN.XML, SOLRCONFIG-SOLCOREPROPERTIES.XML, BAD-SCHEMA-CODEC-GLOBAL-VS-FT-MISMATCH.XML, SCHEMA-IB.XML, DA_UTF8.XML, BAD-SOLRCONFIG-WARMER-NO-REOPEN.XML, BAD-SCHEMA-CURRENCY-DYNAMIC-MULTIVALUED.XML, SOLRCONFIG-MINIMAL.XML, BAD-SOLRCONFIG-INVALID-SCRIPTFILE.XML, SOLRCONFIG-COLLAPSEQPARSER.XML, SCHEMA-FOLDING.XML, SOLRCONFIG-QUERYSENDER-NOQUERY.XML, SOLRCONFIG-INDEXCONFIG.XML, SOLRCONFIG-TRANSFORMERS.XML, SOLRCONFIG_PERF.XML, SOLRCONFIG-WARMER.XML, BAD-SCHEMA-NONTEXT-ANALYZER.XML, BAD-SOLRCONFIG-BOGUS-SCRIPTENGINE-NAME.XML, SOLRCONFIG-DEFAULTS.XML, BAD-SCHEMA-NON-GLOB-COPYFIELD-SOURCE-MATCHING-NOTHING-SHOULD-FAIL-TEST.XML, SOLRCONFIG-FUNCTIONQUERY.XML, FUZZYSUGGEST.TXT, SCHEMA-SNIPPET-TYPES.INCL, BAD-SCHEMA-MISPLACED-ASTERISK-COPYFIELD-SOURCE-SHOULD-FAIL-TEST.XML, SCHEMA-REPLICATION2.XML, BAD-SCHEMA-UNSUPPORTED-DOCVALUES.XML, BAD-SCHEMA-SWEETSPOT-BOTH-TF.XML, SOLRCONFIG.SNIPPET.RANDOMINDEXCONFIG.XML, SOLRCONFIG-MASTER3.XML, SOLRCONFIG-SCRIPT-UPDATEPROCESSOR.XML, JASUGGEST.TXT, SOLRCONFIG-COMPONENTS-NAME.XML, BAD-SCHEMA-BOGUS-FIELD-PARAMETERS.XML, SCHEMA-BEHAVIOR.XML, SOLRCONFIG-SOLR-749.XML, SOLRCONFIG-NOCACHE.XML, BAD-SCHEMA-UNIQUEKEY-IS-COPYFIELD-DEST.XML, BAD-CURRENCY.XML, BAD-MP-SOLRCONFIG.XML, WDFTYPES.TXT, SCHEMA-ADD-SCHEMA-FIELDS-UPDATE-PROCESSOR.XML, SOLRCONFIG-TLOG.XML, SOLRCONFIG-REQHANDLER.INCL, STOP-SNOWBALL.TXT, BAD-SCHEMA-DYNAMICFIELD-DEFAULT-VAL.XML, SOLRCONFIG-LOGMERGEPOLICY.XML, SOLRCONFIG-SLAVE1.XML, BAD-SCHEMA-SWEETSPOT-PARTIAL-HYPERBOLIC.XML, SCHEMA-EFF.XML, STOPWORDS.TXT, SOLRCONFIG-PARSING-UPDATE-PROCESSOR-CHAINS.XML, SOLRCONFIG-PHRASESUGGEST.XML, SCHEMA-SPELLCHECKER.XML, STOP-2.TXT, SOLRCONFIG-SPELLCHECKCOMPONENT.XML, STOPTYPES-2.TXT, STOPWORDSWRONGENCODING.TXT, SCHEMA-MINIMAL.XML, TRIVIAL.UPDATEPROCESSOR1.JS, STOP-1.TXT, SCHEMA-DOCVALUESFACETING.XML, BAD-SCHEMA-EXTERNAL-FILEFIELD.XML, SOLRCONFIG-MASTER2.XML, SCHEMA12.XML, BAD_SOLRCONFIG.XML, SOLRCONFIG-IMPLICITPROPERTIES.XML, ELEVATE.XML, SCHEMA11.XML, ENUMSCONFIG.XML, KEEP-2.TXT, SOLRCONFIG-RESPONSE-LOG-COMPONENT.XML, SOLRCONFIG-BASIC.XML, SCHEMA-ENUMS.XML, SCHEMA15.XML, SCHEMA-ANALYTICS.XML, SOLRCONFIG-MASTER1.XML, BAD-SCHEMA-NOT-INDEXED-BUT-POS.XML, BAD-SOLRCONFIG-MULTIPLE-CFS.XML, BAD-SOLRCONFIG-MULTIPLE-INDEXCONFIGS.XML, BAD-SCHEMA-CURRENCY-MULTIVALUED.XML, BAD-SCHEMA-SWEETSPOT-PARTIAL-BASELINE.XML, BAD-SCHEMA-MULTIPLE-ASTERISK-COPYFIELD-SOURCE-SHOULD-FAIL-TEST.XML, SCHEMA-BINARYFIELD.XML, BAD-SCHEMA-BOGUS-ANALYSIS-PARAMETERS.XML, MISSLEADING.EXTENSION.UPDATEPROCESSOR.JS.TXT, HUNSPELL-TEST.DIC, BAD-SCHEMA-SWEETSPOT-PARTIAL-NORMS.XML, DA_COMPOUNDDICTIONARY.TXT, ANALYZINGINFIXSUGGEST.TXT, SYNONYMS.TXT, SCHEMASURROUND.XML, BAD-SCHEMA-MULTIPLE-ASTERISK-COPYFIELD-DEST-SHOULD-FAIL-TEST.XML, BAD-SCHEMA-CURRENCY-FT-MULTIVALUED.XML, SOLRCONFIG-TEST-MISC.XML, BAD-SCHEMA-UNIQUEKEY-MULTIVALUED.XML, SOLRCONFIG-SPELLCHECKER.XML, BAD-SCHEMA-DUP-DYNAMICFIELD.XML, OLD_SYNONYMS.TXT, BAD-SCHEMA-DYNAMICFIELD-REQUIRED.XML, SCHEMA-REST.XML, PHRASESUGGEST.TXT, SCHEMA-XINCLUDE.XML, SCHEMA-REQUIRED-FIELDS.XML, SCHEMA_CODEC.XML, SCHEMA-TINY.XML, BAD-SCHEMA-DUP-FIELD.XML, STOPWITHBOM.TXT, SOLRCONFIG-MANAGED-SCHEMA.XML, ADDFIELDS.UPDATEPROCESSOR.JS, SOLRCONFIG-SNIPPET-PROCESSOR.XML, SCHEMA-SIM.XML, SCHEMA-SNIPPET-TYPE.XML, MAPPING-ISOLATIN1ACCENT.TXT, SCHEMA-DOCVALUESMULTI.XML, SCHEMA-ONE-FIELD-NO-DYNAMIC-FIELD-UNIQUE-KEY.XML, SOLRCONFIG-SLAVE.XML, SCHEMA-REVERSED.XML, SCHEMA-COLLATE.XML, SCHEMA-SNIPPET-FIELD.XML, SOLRCONFIG_CODEC.XML, BAD-SOLRCONFIG-MANAGED-SCHEMA-NAMED-SCHEMA.XML.XML, SOLRCONFIG-MASTER.XML, SCHEMA-SPATIAL.XML, SOLRCONFIG-ALTDIRECTORY.XML, SCHEMA-CHARFILTERS.XML, SCHEMA-REPLICATION1.XML, BAD-SOLRCONFIG-UNEXPECTED-SCHEMA-ATTRIBUTE.XML, SCHEMA-COLLATE-DV.XML, SCHEMA-NUMERIC.XML, SOLRCONFIG-EXTERNALVERSIONCONSTRAINT.XML, SCHEMA-BM25.XML, KEEP-1.TXT, BAD-SCHEMA-MISPLACED-ASTERISK-COPYFIELD-DEST-SHOULD-FAIL-TEST.XML, SCHEMA-PHRASESUGGEST.XML, SCHEMA-LMJELINEKMERCER.XML, SOLRCONFIG-TIEREDMERGEPOLICY.XML, SOLRCONFIG-DELPOLICY1.XML]
   [junit4]   2> 565625 T1455 oasu.CommitTracker.<init> Hard AutoCommit: disabled
   [junit4]   2> 565625 T1455 oasu.CommitTracker.<init> Soft AutoCommit: disabled
   [junit4]   2> 565626 T1455 oasu.RandomMergePolicy.<in

[...truncated too long message...]

ble name="mean">28.91</double>
   [junit4]    >     <double name="median">24.5</double>
   [junit4]    >     <double name="su">2927.0</double>
   [junit4]    >     <double name="sum">2891.0</double>
   [junit4]    >     <long name="unique">36</long>
   [junit4]    >   </lst>
   [junit4]    >   <lst name="csr">
   [junit4]    >     <str name="cs1">this is the first</str>
   [junit4]    >     <str name="cs2">this is the second</str>
   [junit4]    >     <str name="cs3">this is the third</str>
   [junit4]    >   </lst>
   [junit4]    > </lst>
   [junit4]    > </response>
   [junit4]    > 	at __randomizedtesting.SeedInfo.seed([B3B55E2FE3804A8D:D8344051D68E7CE3]:0)
   [junit4]    > 	at org.apache.solr.analytics.AbstractAnalyticsStatsTest.getStatResult(AbstractAnalyticsStatsTest.java:113)
   [junit4]    > 	at org.apache.solr.analytics.expression.ExpressionTest.multiplyTest(ExpressionTest.java:92)
   [junit4]    > 	at java.lang.Thread.run(Thread.java:780)
   [junit4]   2> 1376345 T3731 oas.SolrTestCaseJ4.setUp ###Starting divideTest
   [junit4]   2> 1376350 T3731 oas.SolrTestCaseJ4.tearDown ###Ending divideTest
   [junit4]   2> 1376353 T3731 oas.SolrTestCaseJ4.deleteCore ###deleteCore
   [junit4]   2> 1376353 T3731 oasc.CoreContainer.shutdown Shutting down CoreContainer instance=-1367163707
   [junit4]   2> 1376354 T3731 oasc.SolrCore.close [collection1]  CLOSING SolrCore org.apache.solr.core.SolrCore@c77b5e8a
   [junit4]   2> 1376354 T3731 oasu.DirectUpdateHandler2.close closing DirectUpdateHandler2{commits=1,autocommits=0,soft autocommits=0,optimizes=0,rollbacks=0,expungeDeletes=0,docsPending=0,adds=0,deletesById=0,deletesByQuery=0,errors=0,cumulative_adds=100,cumulative_deletesById=0,cumulative_deletesByQuery=1,cumulative_errors=0}
   [junit4]   2> 1376355 T3731 oasu.SolrCoreState.decrefSolrCoreState Closing SolrCoreState
   [junit4]   2> 1376355 T3731 oasu.DefaultSolrCoreState.closeIndexWriter SolrCoreState ref count has reached 0 - closing IndexWriter
   [junit4]   2> 1376355 T3731 oasu.DefaultSolrCoreState.closeIndexWriter closing IndexWriter with IndexWriterCloser
   [junit4]   2> 1376356 T3731 oasc.SolrCore.closeSearcher [collection1] Closing main searcher on request.
   [junit4]   2> 1376356 T3731 oasc.CachingDirectoryFactory.close Closing MockDirectoryFactory - 2 directories currently being tracked
   [junit4]   2> 1376357 T3731 oasc.CachingDirectoryFactory.closeCacheValue looking to close /mnt/ssd/jenkins/workspace/Lucene-Solr-trunk-Linux/solr/build/solr-core/test/J1/./solrtest-ExpressionTest-1385966052481 [CachedDir<<refCount=0;path=/mnt/ssd/jenkins/workspace/Lucene-Solr-trunk-Linux/solr/build/solr-core/test/J1/./solrtest-ExpressionTest-1385966052481;done=false>>]
   [junit4]   2> 1376357 T3731 oasc.CachingDirectoryFactory.close Closing directory: /mnt/ssd/jenkins/workspace/Lucene-Solr-trunk-Linux/solr/build/solr-core/test/J1/./solrtest-ExpressionTest-1385966052481
   [junit4]   2> 1376358 T3731 oasc.CachingDirectoryFactory.closeCacheValue looking to close /mnt/ssd/jenkins/workspace/Lucene-Solr-trunk-Linux/solr/build/solr-core/test/J1/./solrtest-ExpressionTest-1385966052481/index [CachedDir<<refCount=0;path=/mnt/ssd/jenkins/workspace/Lucene-Solr-trunk-Linux/solr/build/solr-core/test/J1/./solrtest-ExpressionTest-1385966052481/index;done=false>>]
   [junit4]   2> 1376358 T3731 oasc.CachingDirectoryFactory.close Closing directory: /mnt/ssd/jenkins/workspace/Lucene-Solr-trunk-Linux/solr/build/solr-core/test/J1/./solrtest-ExpressionTest-1385966052481/index
   [junit4]   2> NOTE: test params are: codec=Lucene46: {date_dtd=PostingsFormat(name=NestedPulsing), long_ld=PostingsFormat(name=SimpleText), id=PostingsFormat(name=SimpleText), int_id=PostingsFormat(name=NestedPulsing), double_dd=PostingsFormat(name=MockSep), string_sd=PostingsFormat(name=NestedPulsing), float_fd=PostingsFormat(name=NestedPulsing)}, docValues:{doubledv=DocValuesFormat(name=Lucene45), floatdv=DocValuesFormat(name=SimpleText), date_dtd=DocValuesFormat(name=Lucene45), stringdvm=DocValuesFormat(name=SimpleText), string_sd=DocValuesFormat(name=Memory), float_fd=DocValuesFormat(name=Memory), stringdv=DocValuesFormat(name=Lucene45), longdv=DocValuesFormat(name=SimpleText), long_ld=DocValuesFormat(name=Lucene45), int_id=DocValuesFormat(name=Memory), double_dd=DocValuesFormat(name=SimpleText), datedv=DocValuesFormat(name=Disk), intdv=DocValuesFormat(name=Memory)}, sim=DefaultSimilarity, locale=gu_IN, timezone=Asia/Phnom_Penh
   [junit4]   2> NOTE: Linux 3.8.0-33-generic x86/IBM Corporation 1.7.0 (32-bit)/cpus=8,threads=1,free=36155136,total=189071360
   [junit4]   2> NOTE: All tests run in this JVM: [OutputWriterTest, TestAnalyzeInfixSuggestions, ZkSolrClientTest, TestRandomFaceting, TestSchemaNameResource, TriLevelCompositeIdRoutingTest, TestStressLucene, FullSolrCloudDistribCmdsTest, BadCopyFieldTest, RequestHandlersTest, CoreMergeIndexesAdminHandlerTest, CoreContainerCoreInitFailuresTest, PathHierarchyTokenizerFactoryTest, DebugComponentTest, BadIndexSchemaTest, SpellingQueryConverterTest, ChaosMonkeyNothingIsSafeTest, RequiredFieldsTest, TestUpdate, OpenCloseCoreStressTest, FieldAnalysisRequestHandlerTest, TestLazyCores, TestCoreDiscovery, TestOmitPositions, TestFastLRUCache, TestDistribDocBasedVersion, HdfsBasicDistributedZk2Test, XsltUpdateRequestHandlerTest, TestMultiCoreConfBootstrap, NoFacetTest, IndexSchemaRuntimeFieldTest, TestImplicitCoreProperties, HdfsChaosMonkeySafeLeaderTest, TestFieldTypeResource, TestWordDelimiterFilterFactory, TestComponentsName, NoCacheHeaderTest, SuggesterWFSTTest, DirectUpdateHandlerTest, IndexBasedSpellCheckerTest, TestSolrDeletionPolicy2, NotRequiredUniqueKeyTest, ConvertedLegacyTest, TestCollationField, TestSolrQueryParserDefaultOperatorResource, TestUniqueKeyFieldResource, ShardRoutingCustomTest, EnumFieldTest, JSONWriterTest, TestRangeQuery, TermVectorComponentDistributedTest, TestSolrCoreProperties, UniqFieldsUpdateProcessorFactoryTest, BasicDistributedZk2Test, PrimUtilsTest, TestStressReorder, SolrCoreCheckLockOnStartupTest, SolrCmdDistributorTest, BasicZkTest, AbstractAnalyticsFacetTest, ZkNodePropsTest, TimeZoneUtilsTest, DirectSolrConnectionTest, SpellCheckComponentTest, LeaderElectionIntegrationTest, TestRecoveryHdfs, DocumentAnalysisRequestHandlerTest, TestSolrQueryParserResource, AbstractAnalyticsStatsTest, TestRecovery, DocValuesMultiTest, TestFastWriter, TestFastOutputStream, TestDFRSimilarityFactory, TestCSVResponseWriter, TestDistributedSearch, TestHighFrequencyDictionaryFactory, HdfsCollectionsAPIDistributedZkTest, FieldFacetExtrasTest, MinimalSchemaTest, TestFiltering, DocValuesMissingTest, TestFieldTypeCollectionResource, TestZkChroot, RAMDirectoryFactoryTest, SyncSliceTest, ZkCLITest, TestDistributedGrouping, TestFaceting, TestHashPartitioner, DistributedSpellCheckComponentTest, ZkControllerTest, TestReload, HardAutoCommitTest, SimpleFacetsTest, SolrCoreTest, TestGroupingSearch, SimplePostToolTest, AnalysisAfterCoreReloadTest, SignatureUpdateProcessorFactoryTest, SuggesterFSTTest, SolrRequestParserTest, TestCSVLoader, FieldMutatingUpdateProcessorTest, DirectUpdateHandlerOptimizeTest, DefaultValueUpdateProcessorTest, SortByFunctionTest, DisMaxRequestHandlerTest, StandardRequestHandlerTest, TestWriterPerf, TestReversedWildcardFilterFactory, PrimitiveFieldTypeTest, FileBasedSpellCheckerTest, XmlUpdateRequestHandlerTest, TestValueSourceCache, TestIndexingPerformance, TestArbitraryIndexDir, RegexBoostProcessorTest, IndexSchemaTest, MBeansHandlerTest, TestAnalyzedSuggestions, JsonLoaderTest, TestPHPSerializedResponseWriter, CSVRequestHandlerTest, TestBinaryResponseWriter, TestQuerySenderListener, AlternateDirectoryTest, TestSolrIndexConfig, SolrIndexConfigTest, TestMergePolicyConfig, MultiTermTest, TestBinaryField, NumericFieldsTest, TestFuzzyAnalyzedSuggestions, TestLuceneMatchVersion, TestPhraseSuggestions, TestCharFilters, TestCodecSupport, SynonymTokenizerTest, TestXIncludeConfig, EchoParamsTest, TestSweetSpotSimilarityFactory, TestPerFieldSimilarity, TestNumberUtils, TestLMJelinekMercerSimilarityFactory, TestIBSimilarityFactory, TestBM25SimilarityFactory, TestDefaultSimilarityFactory, LegacyHTMLStripCharFilterTest, TestJmxMonitoredMap, ResourceLoaderTest, ScriptEngineTest, OpenExchangeRatesOrgProviderTest, PluginInfoTest, DateMathParserTest, PreAnalyzedFieldTest, DateFieldTest, TestSolrJ, TestLRUCache, TestUtils, SliceStateTest, FileUtilsTest, TestRTGBase, SolrTestCaseJ4Test, TestDistributedMissingSort, ExpressionTest]
   [junit4] Completed on J1 in 1.02s, 12 tests, 1 failure <<< FAILURES!

[...truncated 172 lines...]
BUILD FAILED
/mnt/ssd/jenkins/workspace/Lucene-Solr-trunk-Linux/build.xml:420: The following error occurred while executing this line:
/mnt/ssd/jenkins/workspace/Lucene-Solr-trunk-Linux/build.xml:413: The following error occurred while executing this line:
/mnt/ssd/jenkins/workspace/Lucene-Solr-trunk-Linux/build.xml:39: The following error occurred while executing this line:
/mnt/ssd/jenkins/workspace/Lucene-Solr-trunk-Linux/extra-targets.xml:37: The following error occurred while executing this line:
/mnt/ssd/jenkins/workspace/Lucene-Solr-trunk-Linux/solr/build.xml:189: The following error occurred while executing this line:
/mnt/ssd/jenkins/workspace/Lucene-Solr-trunk-Linux/solr/common-build.xml:491: The following error occurred while executing this line:
/mnt/ssd/jenkins/workspace/Lucene-Solr-trunk-Linux/lucene/common-build.xml:1275: The following error occurred while executing this line:
/mnt/ssd/jenkins/workspace/Lucene-Solr-trunk-Linux/lucene/common-build.xml:908: There were test failures: 357 suites, 1570 tests, 5 failures, 34 ignored (6 assumptions)

Total time: 57 minutes 3 seconds
Build step 'Invoke Ant' marked build as failure
Description set: Java: 32bit/ibm-j9-jdk7 -Xjit:exclude={org/apache/lucene/util/fst/FST.pack(IIF)Lorg/apache/lucene/util/fst/FST;}
Archiving artifacts
Recording test results
Email was triggered for: Failure
Sending email for trigger: Failure



Mime
View raw message