lucene-dev mailing list archives

Site index · List index
Message view « Date » · « Thread »
Top « Date » · « Thread »
From Policeman Jenkins Server <jenk...@thetaphi.de>
Subject [JENKINS] Lucene-Solr-trunk-Linux (32bit/jdk1.8.0-ea-b117) - Build # 8542 - Still Failing!
Date Mon, 02 Dec 2013 10:30:46 GMT
Build: http://jenkins.thetaphi.de/job/Lucene-Solr-trunk-Linux/8542/
Java: 32bit/jdk1.8.0-ea-b117 -server -XX:+UseParallelGC

2 tests failed.
FAILED:  org.apache.solr.client.solrj.request.TestCoreAdmin.testErrorCases

Error Message:
Test abandoned because suite timeout was reached.

Stack Trace:
java.lang.Exception: Test abandoned because suite timeout was reached.
	at __randomizedtesting.SeedInfo.seed([26470E3C15D56D3D]:0)


FAILED:  junit.framework.TestSuite.org.apache.solr.client.solrj.request.TestCoreAdmin

Error Message:
Suite timeout exceeded (>= 7200000 msec).

Stack Trace:
java.lang.Exception: Suite timeout exceeded (>= 7200000 msec).
	at __randomizedtesting.SeedInfo.seed([26470E3C15D56D3D]:0)




Build Log:
[...truncated 11684 lines...]
   [junit4] Suite: org.apache.solr.client.solrj.request.TestCoreAdmin
   [junit4]   2> 12854 T60 oasc.SolrResourceLoader.<init> new SolrResourceLoader for directory: '/mnt/ssd/jenkins/workspace/Lucene-Solr-trunk-Linux/solr/solrj/src/test-files/solrj/solr/shared/'
   [junit4]   2> 12886 T60 oasc.ConfigSolr.fromFile Loading container configuration from /mnt/ssd/jenkins/workspace/Lucene-Solr-trunk-Linux/solr/build/solr-solrj/test/J0/./solrtest-TestCoreAdmin-1385973020936/solr.xml
   [junit4]   2> 12913 T60 oasc.CoreContainer.<init> New CoreContainer 6222273
   [junit4]   2> 12913 T60 oasc.CoreContainer.load Loading cores into CoreContainer [instanceDir=/mnt/ssd/jenkins/workspace/Lucene-Solr-trunk-Linux/solr/solrj/src/test-files/solrj/solr/shared/]
   [junit4]   2> 12913 T60 oashc.HttpShardHandlerFactory.getParameter Setting socketTimeout to: 0
   [junit4]   2> 12914 T60 oashc.HttpShardHandlerFactory.getParameter Setting urlScheme to: http://
   [junit4]   2> 12914 T60 oashc.HttpShardHandlerFactory.getParameter Setting connTimeout to: 0
   [junit4]   2> 12914 T60 oashc.HttpShardHandlerFactory.getParameter Setting maxConnectionsPerHost to: 20
   [junit4]   2> 12914 T60 oashc.HttpShardHandlerFactory.getParameter Setting corePoolSize to: 0
   [junit4]   2> 12914 T60 oashc.HttpShardHandlerFactory.getParameter Setting maximumPoolSize to: 2147483647
   [junit4]   2> 12915 T60 oashc.HttpShardHandlerFactory.getParameter Setting maxThreadIdleTime to: 5
   [junit4]   2> 12915 T60 oashc.HttpShardHandlerFactory.getParameter Setting sizeOfQueue to: -1
   [junit4]   2> 12915 T60 oashc.HttpShardHandlerFactory.getParameter Setting fairnessPolicy to: false
   [junit4]   2> 12918 T60 oasl.LogWatcher.createWatcher SLF4J impl is org.slf4j.impl.Log4jLoggerFactory
   [junit4]   2> 12918 T60 oasl.LogWatcher.newRegisteredLogWatcher Registering Log Listener [Log4j (org.slf4j.impl.Log4jLoggerFactory)]
   [junit4]   2> 12919 T60 oasc.CoreContainer.load Host Name: 127.0.0.1
   [junit4]   2> 12925 T61 oasc.CoreContainer.create Creating SolrCore 'collection1' using instanceDir: /mnt/ssd/jenkins/workspace/Lucene-Solr-trunk-Linux/solr/solrj/src/test-files/solrj/solr/shared/.
   [junit4]   2> 12925 T62 oasc.CoreContainer.create Creating SolrCore 'core0' using instanceDir: /mnt/ssd/jenkins/workspace/Lucene-Solr-trunk-Linux/solr/solrj/src/test-files/solrj/solr/shared/.
   [junit4]   2> 12926 T61 oasc.SolrResourceLoader.<init> new SolrResourceLoader for directory: '/mnt/ssd/jenkins/workspace/Lucene-Solr-trunk-Linux/solr/solrj/src/test-files/solrj/solr/shared/./'
   [junit4]   2> 12926 T63 oasc.CoreContainer.create Creating SolrCore 'core1' using instanceDir: /mnt/ssd/jenkins/workspace/Lucene-Solr-trunk-Linux/solr/solrj/src/test-files/solrj/solr/shared/.
   [junit4]   2> 12926 T62 oasc.SolrResourceLoader.<init> new SolrResourceLoader for directory: '/mnt/ssd/jenkins/workspace/Lucene-Solr-trunk-Linux/solr/solrj/src/test-files/solrj/solr/shared/./'
   [junit4]   2> 12927 T63 oasc.SolrResourceLoader.<init> new SolrResourceLoader for directory: '/mnt/ssd/jenkins/workspace/Lucene-Solr-trunk-Linux/solr/solrj/src/test-files/solrj/solr/shared/./'
   [junit4]   2> 12949 T61 oasc.SolrConfig.<init> Using Lucene MatchVersion: LUCENE_50
   [junit4]   2> 12961 T62 oasc.SolrConfig.<init> Using Lucene MatchVersion: LUCENE_50
   [junit4]   2> 12963 T63 oasc.SolrConfig.<init> Using Lucene MatchVersion: LUCENE_50
   [junit4]   2> 12972 T61 oasc.SolrConfig.<init> Loaded SolrConfig: solrconfig.xml
   [junit4]   2> 12973 T61 oass.IndexSchema.readSchema Reading Solr Schema from schema.xml
   [junit4]   2> 12976 T62 oasc.SolrConfig.<init> Loaded SolrConfig: solrconfig.xml
   [junit4]   2> 12976 T62 oass.IndexSchema.readSchema Reading Solr Schema from schema.xml
   [junit4]   2> 12977 T63 oasc.SolrConfig.<init> Loaded SolrConfig: solrconfig.xml
   [junit4]   2> 12977 T63 oass.IndexSchema.readSchema Reading Solr Schema from schema.xml
   [junit4]   2> 12979 T61 oass.IndexSchema.readSchema [collection1] Schema name=example core 
   [junit4]   2> 12981 T62 oass.IndexSchema.readSchema [core0] Schema name=example core EN
   [junit4]   2> 12995 T63 oass.IndexSchema.readSchema [core1] Schema name=example core FR
   [junit4]   2> 13012 T63 oass.IndexSchema.readSchema default search field in schema is name
   [junit4]   2> 13012 T61 oass.IndexSchema.readSchema default search field in schema is name
   [junit4]   2> 13012 T63 oass.IndexSchema.readSchema query parser default operator is OR
   [junit4]   2> 13013 T61 oass.IndexSchema.readSchema query parser default operator is OR
   [junit4]   2> 13013 T61 oass.IndexSchema.readSchema unique key field: id
   [junit4]   2> 13017 T63 oass.IndexSchema.readSchema unique key field: id
   [junit4]   2> 13019 T63 oasc.SolrCore.initDirectoryFactory org.apache.solr.core.MockDirectoryFactory
   [junit4]   2> 13019 T63 oasc.SolrCore.<init> [core1] Opening new SolrCore at /mnt/ssd/jenkins/workspace/Lucene-Solr-trunk-Linux/solr/solrj/src/test-files/solrj/solr/shared/./, dataDir=/mnt/ssd/jenkins/workspace/Lucene-Solr-trunk-Linux/solr/build/solr-solrj/test/J0/./solrtest-TestCoreAdmin-1385973020936/data2/
   [junit4]   2> 13019 T63 oasc.SolrCore.<init> JMX monitoring not detected for core: core1
   [junit4]   2> 13020 T62 oass.IndexSchema.readSchema default search field in schema is name
   [junit4]   2> 13020 T63 oasc.CachingDirectoryFactory.get return new directory for /mnt/ssd/jenkins/workspace/Lucene-Solr-trunk-Linux/solr/build/solr-solrj/test/J0/./solrtest-TestCoreAdmin-1385973020936/data2
   [junit4]   2> 13021 T63 oasc.SolrCore.getNewIndexDir New index directory detected: old=null new=/mnt/ssd/jenkins/workspace/Lucene-Solr-trunk-Linux/solr/build/solr-solrj/test/J0/./solrtest-TestCoreAdmin-1385973020936/data2/index/
   [junit4]   2> 13021 T63 oasc.SolrCore.initIndex WARN [core1] Solr index directory '/mnt/ssd/jenkins/workspace/Lucene-Solr-trunk-Linux/solr/build/solr-solrj/test/J0/./solrtest-TestCoreAdmin-1385973020936/data2/index' doesn't exist. Creating new index...
   [junit4]   2> 13021 T62 oass.IndexSchema.readSchema query parser default operator is OR
   [junit4]   2> 13023 T61 oasc.SolrCore.initDirectoryFactory org.apache.solr.core.MockDirectoryFactory
   [junit4]   2> 13023 T62 oass.IndexSchema.readSchema unique key field: id
   [junit4]   2> 13023 T61 oasc.SolrCore.<init> [collection1] Opening new SolrCore at /mnt/ssd/jenkins/workspace/Lucene-Solr-trunk-Linux/solr/solrj/src/test-files/solrj/solr/shared/./, dataDir=/mnt/ssd/jenkins/workspace/Lucene-Solr-trunk-Linux/solr/build/solr-solrj/test/J0/./solrtest-TestCoreAdmin-1385973020936/data/-/
   [junit4]   2> 13024 T61 oasc.SolrCore.<init> JMX monitoring not detected for core: collection1
   [junit4]   2> 13025 T63 oasc.CachingDirectoryFactory.get return new directory for /mnt/ssd/jenkins/workspace/Lucene-Solr-trunk-Linux/solr/build/solr-solrj/test/J0/./solrtest-TestCoreAdmin-1385973020936/data2/index
   [junit4]   2> 13026 T61 oasc.CachingDirectoryFactory.get return new directory for /mnt/ssd/jenkins/workspace/Lucene-Solr-trunk-Linux/solr/build/solr-solrj/test/J0/./solrtest-TestCoreAdmin-1385973020936/data/-
   [junit4]   2> 13026 T61 oasc.SolrCore.getNewIndexDir New index directory detected: old=null new=/mnt/ssd/jenkins/workspace/Lucene-Solr-trunk-Linux/solr/build/solr-solrj/test/J0/./solrtest-TestCoreAdmin-1385973020936/data/-/index/
   [junit4]   2> 13028 T61 oasc.SolrCore.initIndex WARN [collection1] Solr index directory '/mnt/ssd/jenkins/workspace/Lucene-Solr-trunk-Linux/solr/build/solr-solrj/test/J0/./solrtest-TestCoreAdmin-1385973020936/data/-/index' doesn't exist. Creating new index...
   [junit4]   2> 13029 T62 oasc.SolrCore.initDirectoryFactory org.apache.solr.core.MockDirectoryFactory
   [junit4]   2> 13030 T62 oasc.SolrCore.<init> [core0] Opening new SolrCore at /mnt/ssd/jenkins/workspace/Lucene-Solr-trunk-Linux/solr/solrj/src/test-files/solrj/solr/shared/./, dataDir=/mnt/ssd/jenkins/workspace/Lucene-Solr-trunk-Linux/solr/build/solr-solrj/test/J0/./solrtest-TestCoreAdmin-1385973020936/data1/
   [junit4]   2> 13030 T62 oasc.SolrCore.<init> JMX monitoring not detected for core: core0
   [junit4]   2> 13030 T61 oasc.CachingDirectoryFactory.get return new directory for /mnt/ssd/jenkins/workspace/Lucene-Solr-trunk-Linux/solr/build/solr-solrj/test/J0/./solrtest-TestCoreAdmin-1385973020936/data/-/index
   [junit4]   2> 13031 T63 oasc.SolrDeletionPolicy.onCommit SolrDeletionPolicy.onCommit: commits: num=1
   [junit4]   2> 		commit{dir=MockDirectoryWrapper(org.apache.lucene.store.RAMDirectory@1160b87 lockFactory=org.apache.lucene.store.NativeFSLockFactory@3e674b),segFN=segments_1,generation=1}
   [junit4]   2> 13031 T63 oasc.SolrDeletionPolicy.updateCommits newest commit generation = 1
   [junit4]   2> 13031 T62 oasc.CachingDirectoryFactory.get return new directory for /mnt/ssd/jenkins/workspace/Lucene-Solr-trunk-Linux/solr/build/solr-solrj/test/J0/./solrtest-TestCoreAdmin-1385973020936/data1
   [junit4]   2> 13032 T62 oasc.SolrCore.getNewIndexDir New index directory detected: old=null new=/mnt/ssd/jenkins/workspace/Lucene-Solr-trunk-Linux/solr/build/solr-solrj/test/J0/./solrtest-TestCoreAdmin-1385973020936/data1/index/
   [junit4]   2> 13032 T62 oasc.SolrCore.initIndex WARN [core0] Solr index directory '/mnt/ssd/jenkins/workspace/Lucene-Solr-trunk-Linux/solr/build/solr-solrj/test/J0/./solrtest-TestCoreAdmin-1385973020936/data1/index' doesn't exist. Creating new index...
   [junit4]   2> 13032 T63 oasc.SolrCore.loadUpdateProcessorChains no updateRequestProcessorChain defined as default, creating implicit default
   [junit4]   2> 13032 T62 oasc.CachingDirectoryFactory.get return new directory for /mnt/ssd/jenkins/workspace/Lucene-Solr-trunk-Linux/solr/build/solr-solrj/test/J0/./solrtest-TestCoreAdmin-1385973020936/data1/index
   [junit4]   2> 13033 T61 oasc.SolrDeletionPolicy.onCommit SolrDeletionPolicy.onCommit: commits: num=1
   [junit4]   2> 		commit{dir=MockDirectoryWrapper(org.apache.lucene.store.RAMDirectory@1330c48 lockFactory=org.apache.lucene.store.NativeFSLockFactory@129725e),segFN=segments_1,generation=1}
   [junit4]   2> 13033 T61 oasc.SolrDeletionPolicy.updateCommits newest commit generation = 1
   [junit4]   2> 13035 T61 oasc.SolrCore.loadUpdateProcessorChains no updateRequestProcessorChain defined as default, creating implicit default
   [junit4]   2> 13038 T62 oasc.SolrDeletionPolicy.onCommit SolrDeletionPolicy.onCommit: commits: num=1
   [junit4]   2> 		commit{dir=MockDirectoryWrapper(org.apache.lucene.store.RAMDirectory@19ca763 lockFactory=org.apache.lucene.store.NativeFSLockFactory@181e1bd),segFN=segments_1,generation=1}
   [junit4]   2> 13038 T62 oasc.SolrDeletionPolicy.updateCommits newest commit generation = 1
   [junit4]   2> 13038 T63 oasc.RequestHandlers.initHandlersFromConfig created standard: solr.StandardRequestHandler
   [junit4]   2> 13039 T61 oasc.RequestHandlers.initHandlersFromConfig created standard: solr.StandardRequestHandler
   [junit4]   2> 13039 T63 oasc.RequestHandlers.initHandlersFromConfig created /update: solr.UpdateRequestHandler
   [junit4]   2> 13039 T63 oasc.RequestHandlers.initHandlersFromConfig created /admin/: org.apache.solr.handler.admin.AdminHandlers
   [junit4]   2> 13040 T62 oasc.SolrCore.loadUpdateProcessorChains no updateRequestProcessorChain defined as default, creating implicit default
   [junit4]   2> 13040 T62 oasc.RequestHandlers.initHandlersFromConfig created standard: solr.StandardRequestHandler
   [junit4]   2> 13040 T62 oasc.RequestHandlers.initHandlersFromConfig created /update: solr.UpdateRequestHandler
   [junit4]   2> 13040 T62 oasc.RequestHandlers.initHandlersFromConfig created /admin/: org.apache.solr.handler.admin.AdminHandlers
   [junit4]   2> 13042 T63 oashl.XMLLoader.init xsltCacheLifetimeSeconds=60
   [junit4]   2> 13042 T62 oashl.XMLLoader.init xsltCacheLifetimeSeconds=60
   [junit4]   2> 13039 T61 oasc.RequestHandlers.initHandlersFromConfig created /update: solr.UpdateRequestHandler
   [junit4]   2> 13042 T61 oasc.RequestHandlers.initHandlersFromConfig created /admin/: org.apache.solr.handler.admin.AdminHandlers
   [junit4]   2> 13044 T63 oasu.CommitTracker.<init> Hard AutoCommit: disabled
   [junit4]   2> 13045 T61 oashl.XMLLoader.init xsltCacheLifetimeSeconds=60
   [junit4]   2> 13044 T62 oasu.CommitTracker.<init> Hard AutoCommit: disabled
   [junit4]   2> 13045 T63 oasu.CommitTracker.<init> Soft AutoCommit: disabled
   [junit4]   2> 13046 T62 oasu.CommitTracker.<init> Soft AutoCommit: disabled
   [junit4]   2> 13046 T61 oasu.CommitTracker.<init> Hard AutoCommit: disabled
   [junit4]   2> 13047 T61 oasu.CommitTracker.<init> Soft AutoCommit: disabled
   [junit4]   2> 13047 T62 oasc.SolrDeletionPolicy.onInit SolrDeletionPolicy.onInit: commits: num=1
   [junit4]   2> 		commit{dir=MockDirectoryWrapper(org.apache.lucene.store.RAMDirectory@19ca763 lockFactory=org.apache.lucene.store.NativeFSLockFactory@181e1bd),segFN=segments_1,generation=1}
   [junit4]   2> 13047 T62 oasc.SolrDeletionPolicy.updateCommits newest commit generation = 1
   [junit4]   2> 13047 T61 oasc.SolrDeletionPolicy.onInit SolrDeletionPolicy.onInit: commits: num=1
   [junit4]   2> 		commit{dir=MockDirectoryWrapper(org.apache.lucene.store.RAMDirectory@1330c48 lockFactory=org.apache.lucene.store.NativeFSLockFactory@129725e),segFN=segments_1,generation=1}
   [junit4]   2> 13047 T62 oass.SolrIndexSearcher.<init> Opening Searcher@e69fb9 main
   [junit4]   2> 13047 T61 oasc.SolrDeletionPolicy.updateCommits newest commit generation = 1
   [junit4]   2> 13048 T61 oass.SolrIndexSearcher.<init> Opening Searcher@db23b6 main
   [junit4]   2> 13048 T62 oasc.CoreContainer.registerCore registering core: core0
   [junit4]   2> 13048 T64 oasc.SolrCore.registerSearcher [core0] Registered new searcher Searcher@e69fb9 main{StandardDirectoryReader(segments_1:1:nrt)}
   [junit4]   2> 13049 T61 oasc.CoreContainer.registerCore registering core: collection1
   [junit4]   2> 13049 T66 oasc.SolrCore.registerSearcher [collection1] Registered new searcher Searcher@db23b6 main{StandardDirectoryReader(segments_1:1:nrt)}
   [junit4]   2> 13049 T63 oasc.SolrDeletionPolicy.onInit SolrDeletionPolicy.onInit: commits: num=1
   [junit4]   2> 		commit{dir=MockDirectoryWrapper(org.apache.lucene.store.RAMDirectory@1160b87 lockFactory=org.apache.lucene.store.NativeFSLockFactory@3e674b),segFN=segments_1,generation=1}
   [junit4]   2> 13050 T63 oasc.SolrDeletionPolicy.updateCommits newest commit generation = 1
   [junit4]   2> 13051 T63 oass.SolrIndexSearcher.<init> Opening Searcher@18c457 main
   [junit4]   2> 13052 T65 oasc.SolrCore.registerSearcher [core1] Registered new searcher Searcher@18c457 main{StandardDirectoryReader(segments_1:1:nrt)}
   [junit4]   2> 13052 T63 oasc.CoreContainer.registerCore registering core: core1
   [junit4]   2> 13054 T60 oascsr.TestCoreAdmin.testCustomUlogDir Creating cores underneath ./solrtest-TestCoreAdmin-1385973021153
   [junit4]   2> ASYNC  NEW_CORE C4 name=core0 org.apache.solr.core.SolrCore@3728aa
   [junit4]   2> 13104 T60 C4 oasc.CoreContainer.create Creating SolrCore 'newcore' using instanceDir: /mnt/ssd/jenkins/workspace/Lucene-Solr-trunk-Linux/solr/build/solr-solrj/test/J0/./solrtest-TestCoreAdmin-1385973021153/testCustomUlogDir1385973021154-instance/newcore
   [junit4]   2> 13105 T60 C4 oasc.SolrResourceLoader.<init> new SolrResourceLoader for directory: '/mnt/ssd/jenkins/workspace/Lucene-Solr-trunk-Linux/solr/build/solr-solrj/test/J0/./solrtest-TestCoreAdmin-1385973021153/testCustomUlogDir1385973021154-instance/newcore/'
   [junit4]   2> 13130 T60 C4 oasc.SolrConfig.<init> Using Lucene MatchVersion: LUCENE_50
   [junit4]   2> 13136 T60 C4 oasc.SolrConfig.<init> Loaded SolrConfig: solrconfig.xml
   [junit4]   2> 13137 T60 C4 oass.IndexSchema.readSchema Reading Solr Schema from schema.xml
   [junit4]   2> 13141 T60 C4 oass.IndexSchema.readSchema [newcore] Schema name=example core 
   [junit4]   2> 13160 T60 C4 oass.IndexSchema.readSchema default search field in schema is name
   [junit4]   2> 13165 T60 C4 oass.IndexSchema.readSchema query parser default operator is OR
   [junit4]   2> 13166 T60 C4 oass.IndexSchema.readSchema unique key field: id
   [junit4]   2> 13174 T60 C4 oasc.SolrCore.initDirectoryFactory org.apache.solr.core.MockDirectoryFactory
   [junit4]   2> 13175 T60 C4 oasc.SolrCore.<init> [newcore] Opening new SolrCore at /mnt/ssd/jenkins/workspace/Lucene-Solr-trunk-Linux/solr/build/solr-solrj/test/J0/./solrtest-TestCoreAdmin-1385973021153/testCustomUlogDir1385973021154-instance/newcore/, dataDir=/mnt/ssd/jenkins/workspace/Lucene-Solr-trunk-Linux/solr/build/solr-solrj/test/J0/./solrtest-TestCoreAdmin-1385973021153/testCustomUlogDir1385973021154-data/
   [junit4]   2> 13175 T60 C4 oasc.SolrCore.<init> JMX monitoring not detected for core: newcore
   [junit4]   2> 13176 T60 C4 oasc.CachingDirectoryFactory.get return new directory for /mnt/ssd/jenkins/workspace/Lucene-Solr-trunk-Linux/solr/build/solr-solrj/test/J0/./solrtest-TestCoreAdmin-1385973021153/testCustomUlogDir1385973021154-data
   [junit4]   2> 13188 T60 C4 oasc.SolrCore.getNewIndexDir New index directory detected: old=null new=/mnt/ssd/jenkins/workspace/Lucene-Solr-trunk-Linux/solr/build/solr-solrj/test/J0/./solrtest-TestCoreAdmin-1385973021153/testCustomUlogDir1385973021154-data/index/
   [junit4]   2> 13189 T60 C4 oasc.SolrCore.initIndex WARN [newcore] Solr index directory '/mnt/ssd/jenkins/workspace/Lucene-Solr-trunk-Linux/solr/build/solr-solrj/test/J0/./solrtest-TestCoreAdmin-1385973021153/testCustomUlogDir1385973021154-data/index' doesn't exist. Creating new index...
   [junit4]   2> 13191 T60 C4 oasc.CachingDirectoryFactory.get return new directory for /mnt/ssd/jenkins/workspace/Lucene-Solr-trunk-Linux/solr/build/solr-solrj/test/J0/./solrtest-TestCoreAdmin-1385973021153/testCustomUlogDir1385973021154-data/index
   [junit4]   2> 13193 T60 C4 oasc.SolrDeletionPolicy.onCommit SolrDeletionPolicy.onCommit: commits: num=1
   [junit4]   2> 		commit{dir=MockDirectoryWrapper(org.apache.lucene.store.RAMDirectory@c96775 lockFactory=org.apache.lucene.store.NativeFSLockFactory@1831155),segFN=segments_1,generation=1}
   [junit4]   2> 13194 T60 C4 oasc.SolrDeletionPolicy.updateCommits newest commit generation = 1
   [junit4]   2> 13196 T60 C4 oasc.SolrCore.loadUpdateProcessorChains no updateRequestProcessorChain defined as default, creating implicit default
   [junit4]   2> 13196 T60 C4 oasc.RequestHandlers.initHandlersFromConfig created standard: solr.StandardRequestHandler
   [junit4]   2> 13197 T60 C4 oasc.RequestHandlers.initHandlersFromConfig created /update: solr.UpdateRequestHandler
   [junit4]   2> 13198 T60 C4 oasc.RequestHandlers.initHandlersFromConfig created /admin/: org.apache.solr.handler.admin.AdminHandlers
   [junit4]   2> 13201 T60 C4 oashl.XMLLoader.init xsltCacheLifetimeSeconds=60
   [junit4]   2> 13203 T60 C4 oasu.CommitTracker.<init> Hard AutoCommit: disabled
   [junit4]   2> 13203 T60 C4 oasu.CommitTracker.<init> Soft AutoCommit: disabled
   [junit4]   2> 13204 T60 C4 oasc.SolrDeletionPolicy.onInit SolrDeletionPolicy.onInit: commits: num=1
   [junit4]   2> 		commit{dir=MockDirectoryWrapper(org.apache.lucene.store.RAMDirectory@c96775 lockFactory=org.apache.lucene.store.NativeFSLockFactory@1831155),segFN=segments_1,generation=1}
   [junit4]   2> 13205 T60 C4 oasc.SolrDeletionPolicy.updateCommits newest commit generation = 1
   [junit4]   2> 13205 T60 C4 oass.SolrIndexSearcher.<init> Opening Searcher@87d7e8 main
   [junit4]   2> 13206 T60 C4 oasc.SolrCores.putTransientCore Opening transient core newcore
   [junit4]   2> 13207 T60 C4 oasc.CoreContainer.registerCore registering core: newcore
   [junit4]   2> 13207 T60 C4 oasc.SolrCore.execute [core0] webapp=null path=/admin/cores params={action=CREATE&name=newcore&instanceDir=%2Fmnt%2Fssd%2Fjenkins%2Fworkspace%2FLucene-Solr-trunk-Linux%2Fsolr%2Fbuild%2Fsolr-solrj%2Ftest%2FJ0%2F.%2Fsolrtest-TestCoreAdmin-1385973021153%2FtestCustomUlogDir1385973021154-instance%2Fnewcore&dataDir=%2Fmnt%2Fssd%2Fjenkins%2Fworkspace%2FLucene-Solr-trunk-Linux%2Fsolr%2Fbuild%2Fsolr-solrj%2Ftest%2FJ0%2F.%2Fsolrtest-TestCoreAdmin-1385973021153%2FtestCustomUlogDir1385973021154-data&ulogDir=%2Fmnt%2Fssd%2Fjenkins%2Fworkspace%2FLucene-Solr-trunk-Linux%2Fsolr%2Fbuild%2Fsolr-solrj%2Ftest%2FJ0%2F.%2Fsolrtest-TestCoreAdmin-1385973021153%2FtestCustomUlogDir1385973021154-data%2Fulog&transient=true&loadOnStartup=false} status=0 QTime=108 
   [junit4]   2> 13208 T60 oasc.CoreContainer.shutdown Shutting down CoreContainer instance=6222273
   [junit4]   2> 13209 T60 oasc.SolrCore.close [core0]  CLOSING SolrCore org.apache.solr.core.SolrCore@3728aa
   [junit4]   2> 13209 T60 oasu.DirectUpdateHandler2.close closing DirectUpdateHandler2{commits=0,autocommits=0,soft autocommits=0,optimizes=0,rollbacks=0,expungeDeletes=0,docsPending=0,adds=0,deletesById=0,deletesByQuery=0,errors=0,cumulative_adds=0,cumulative_deletesById=0,cumulative_deletesByQuery=0,cumulative_errors=0,transaction_logs_total_size=0,transaction_logs_total_number=0}
   [junit4]   2> 13209 T60 oasu.SolrCoreState.decrefSolrCoreState Closing SolrCoreState
   [junit4]   2> 13210 T60 oasu.DefaultSolrCoreState.closeIndexWriter SolrCoreState ref count has reached 0 - closing IndexWriter
   [junit4]   2> 13210 T60 oasu.DefaultSolrCoreState.closeIndexWriter closing IndexWriter with IndexWriterCloser
   [junit4]   2> 13211 T68 oasc.SolrCore.registerSearcher [newcore] Registered new searcher Searcher@87d7e8 main{StandardDirectoryReader(segments_1:1:nrt)}
   [junit4]   2> 13212 T60 oasc.SolrCore.closeSearcher [core0] Closing main searcher on request.
   [junit4]   2> 13212 T60 oasc.CachingDirectoryFactory.close Closing MockDirectoryFactory - 2 directories currently being tracked
   [junit4]   2> 13213 T60 oasc.CachingDirectoryFactory.closeCacheValue looking to close /mnt/ssd/jenkins/workspace/Lucene-Solr-trunk-Linux/solr/build/solr-solrj/test/J0/./solrtest-TestCoreAdmin-1385973020936/data1/index [CachedDir<<refCount=0;path=/mnt/ssd/jenkins/workspace/Lucene-Solr-trunk-Linux/solr/build/solr-solrj/test/J0/./solrtest-TestCoreAdmin-1385973020936/data1/index;done=false>>]
   [junit4]   2> 13213 T60 oasc.CachingDirectoryFactory.close Closing directory: /mnt/ssd/jenkins/workspace/Lucene-Solr-trunk-Linux/solr/build/solr-solrj/test/J0/./solrtest-TestCoreAdmin-1385973020936/data1/index
   [junit4]   2> 13213 T60 oasc.CachingDirectoryFactory.closeCacheValue looking to close /mnt/ssd/jenkins/workspace/Lucene-Solr-trunk-Linux/solr/build/solr-solrj/test/J0/./solrtest-TestCoreAdmin-1385973020936/data1 [CachedDir<<refCount=0;path=/mnt/ssd/jenkins/workspace/Lucene-Solr-trunk-Linux/solr/build/solr-solrj/test/J0/./solrtest-TestCoreAdmin-1385973020936/data1;done=false>>]
   [junit4]   2> 13214 T60 oasc.CachingDirectoryFactory.close Closing directory: /mnt/ssd/jenkins/workspace/Lucene-Solr-trunk-Linux/solr/build/solr-solrj/test/J0/./solrtest-TestCoreAdmin-1385973020936/data1
   [junit4]   2> 13214 T60 oasc.SolrCore.close [collection1]  CLOSING SolrCore org.apache.solr.core.SolrCore@f411d3
   [junit4]   2> 13214 T60 oasu.DirectUpdateHandler2.close closing DirectUpdateHandler2{commits=0,autocommits=0,soft autocommits=0,optimizes=0,rollbacks=0,expungeDeletes=0,docsPending=0,adds=0,deletesById=0,deletesByQuery=0,errors=0,cumulative_adds=0,cumulative_deletesById=0,cumulative_deletesByQuery=0,cumulative_errors=0,transaction_logs_total_size=0,transaction_logs_total_number=0}
   [junit4]   2> 13215 T60 oasu.SolrCoreState.decrefSolrCoreState Closing SolrCoreState
   [junit4]   2> 13215 T60 oasu.DefaultSolrCoreState.closeIndexWriter SolrCoreState ref count has reached 0 - closing IndexWriter
   [junit4]   2> 13215 T60 oasu.DefaultSolrCoreState.closeIndexWriter closing IndexWriter with IndexWriterCloser
   [junit4]   2> 13224 T60 oasc.SolrCore.closeSearcher [collection1] Closing main searcher on request.
   [junit4]   2> 13225 T60 oasc.CachingDirectoryFactory.close Closing MockDirectoryFactory - 2 directories currently being tracked
   [junit4]   2> 13225 T60 oasc.CachingDirectoryFactory.closeCacheValue looking to close /mnt/ssd/jenkins/workspace/Lucene-Solr-trunk-Linux/solr/build/solr-solrj/test/J0/./solrtest-TestCoreAdmin-1385973020936/data/- [CachedDir<<refCount=0;path=/mnt/ssd/jenkins/workspace/Lucene-Solr-trunk-Linux/solr/build/solr-solrj/test/J0/./solrtest-TestCoreAdmin-1385973020936/data/-;done=false>>]
   [junit4]   2> 13226 T60 oasc.CachingDirectoryFactory.close Closing directory: /mnt/ssd/jenkins/workspace/Lucene-Solr-trunk-Linux/solr/build/solr-solrj/test/J0/./solrtest-TestCoreAdmin-1385973020936/data/-
   [junit4]   2> 13226 T60 oasc.CachingDirectoryFactory.closeCacheValue looking to close /mnt/ssd/jenkins/workspace/Lucene-Solr-trunk-Linux/solr/build/solr-solrj/test/J0/./solrtest-TestCoreAdmin-1385973020936/data/-/index [CachedDir<<refCount=0;path=/mnt/ssd/jenkins/workspace/Lucene-Solr-trunk-Linux/solr/build/solr-solrj/test/J0/./solrtest-TestCoreAdmin-1385973020936/data/-/index;done=false>>]
   [junit4]   2> 13226 T60 oasc.CachingDirectoryFactory.close Closing directory: /mnt/ssd/jenkins/workspace/Lucene-Solr-trunk-Linux/solr/build/solr-solrj/test/J0/./solrtest-TestCoreAdmin-1385973020936/data/-/index
   [junit4]   2> 13227 T60 oasc.SolrCore.close [core1]  CLOSING SolrCore org.apache.solr.core.SolrCore@15e427b
   [junit4]   2> 13227 T60 oasu.DirectUpdateHandler2.close closing DirectUpdateHandler2{commits=0,autocommits=0,soft autocommits=0,optimizes=0,rollbacks=0,expungeDeletes=0,docsPending=0,adds=0,deletesById=0,deletesByQuery=0,errors=0,cumulative_adds=0,cumulative_deletesById=0,cumulative_deletesByQuery=0,cumulative_errors=0,transaction_logs_total_size=0,transaction_logs_total_number=0}
   [junit4]   2> 13228 T60 oasu.SolrCoreState.decrefSolrCoreState Closing SolrCoreState
   [junit4]   2> 13228 T60 oasu.DefaultSolrCoreState.closeIndexWriter SolrCoreState ref count has reached 0 - closing IndexWriter
   [junit4]   2> 13228 T60 oasu.DefaultSolrCoreState.closeIndexWriter closing IndexWriter with IndexWriterCloser
   [junit4]   2> 13234 T60 oasc.SolrCore.closeSearcher [core1] Closing main searcher on request.
   [junit4]   2> 13235 T60 oasc.CachingDirectoryFactory.close Closing MockDirectoryFactory - 2 directories currently being tracked
   [junit4]   2> 13235 T60 oasc.CachingDirectoryFactory.closeCacheValue looking to close /mnt/ssd/jenkins/workspace/Lucene-Solr-trunk-Linux/solr/build/solr-solrj/test/J0/./solrtest-TestCoreAdmin-1385973020936/data2 [CachedDir<<refCount=0;path=/mnt/ssd/jenkins/workspace/Lucene-Solr-trunk-Linux/solr/build/solr-solrj/test/J0/./solrtest-TestCoreAdmin-1385973020936/data2;done=false>>]
   [junit4]   2> 13235 T60 oasc.CachingDirectoryFactory.close Closing directory: /mnt/ssd/jenkins/workspace/Lucene-Solr-trunk-Linux/solr/build/solr-solrj/test/J0/./solrtest-TestCoreAdmin-1385973020936/data2
   [junit4]   2> 13236 T60 oasc.CachingDirectoryFactory.closeCacheValue looking to close /mnt/ssd/jenkins/workspace/Lucene-Solr-trunk-Linux/solr/build/solr-solrj/test/J0/./solrtest-TestCoreAdmin-1385973020936/data2/index [CachedDir<<refCount=0;path=/mnt/ssd/jenkins/workspace/Lucene-Solr-trunk-Linux/solr/build/solr-solrj/test/J0/./solrtest-TestCoreAdmin-1385973020936/data2/index;done=false>>]
   [junit4]   2> 13236 T60 oasc.CachingDirectoryFactory.close Closing directory: /mnt/ssd/jenkins/workspace/Lucene-Solr-trunk-Linux/solr/build/solr-solrj/test/J0/./solrtest-TestCoreAdmin-1385973020936/data2/index
   [junit4]   2> 13236 T60 oasc.SolrCore.close [newcore]  CLOSING SolrCore org.apache.solr.core.SolrCore@aedb50
   [junit4]   2> 13237 T60 oasu.DirectUpdateHandler2.close closing DirectUpdateHandler2{commits=0,autocommits=0,soft autocommits=0,optimizes=0,rollbacks=0,expungeDeletes=0,docsPending=0,adds=0,deletesById=0,deletesByQuery=0,errors=0,cumulative_adds=0,cumulative_deletesById=0,cumulative_deletesByQuery=0,cumulative_errors=0,transaction_logs_total_size=0,transaction_logs_total_number=0}
   [junit4]   2> 13237 T60 oasu.SolrCoreState.decrefSolrCoreState Closing SolrCoreState
   [junit4]   2> 13237 T60 oasu.DefaultSolrCoreState.closeIndexWriter SolrCoreState ref count has reached 0 - closing IndexWriter
   [junit4]   2> 13238 T60 oasu.DefaultSolrCoreState.closeIndexWriter closing IndexWriter with IndexWriterCloser
   [junit4]   2> 13238 T60 oasc.SolrCore.closeSearcher [newcore] Closing main searcher on request.
   [junit4]   2> 13239 T60 oasc.CachingDirectoryFactory.close Closing MockDirectoryFactory - 2 directories currently being tracked
   [junit4]   2> 13239 T60 oasc.CachingDirectoryFactory.closeCacheValue looking to close /mnt/ssd/jenkins/workspace/Lucene-Solr-trunk-Linux/solr/build/solr-solrj/test/J0/./solrtest-TestCoreAdmin-1385973021153/testCustomUlogDir1385973021154-data [CachedDir<<refCount=0;path=/mnt/ssd/jenkins/workspace/Lucene-Solr-trunk-Linux/solr/build/solr-solrj/test/J0/./solrtest-TestCoreAdmin-1385973021153/testCustomUlogDir1385973021154-data;done=false>>]
   [junit4]   2> 13240 T60 oasc.CachingDirectoryFactory.close Closing directory: /mnt/ssd/jenkins/workspace/Lucene-Solr-trunk-Linux/solr/build/solr-solrj/test/J0/./solrtest-TestCoreAdmin-1385973021153/testCustomUlogDir1385973021154-data
   [junit4]   2> 13240 T60 oasc.CachingDirectoryFactory.closeCacheValue looking to close /mnt/ssd/jenkins/workspace/Lucene-Solr-trunk-Linux/solr/build/solr-solrj/test/J0/./solrtest-TestCoreAdmin-1385973021153/testCustomUlogDir1385973021154-data/index [CachedDir<<refCount=0;path=/mnt/ssd/jenkins/workspace/Lucene-Solr-trunk-Linux/solr/build/solr-solrj/test/J0/./solrtest-TestCoreAdmin-1385973021153/testCustomUlogDir1385973021154-data/index;done=false>>]
   [junit4]   2> 13240 T60 oasc.CachingDirectoryFactory.close Closing directory: /mnt/ssd/jenkins/workspace/Lucene-Solr-trunk-Linux/solr/build/solr-solrj/test/J0/./solrtest-TestCoreAdmin-1385973021153/testCustomUlogDir1385973021154-data/index
   [junit4]   2> 13241 T60 oasc.CoreContainer.shutdown Shutting down CoreContainer instance=6222273
   [junit4]   1> Solr home: /mnt/ssd/jenkins/workspace/Lucene-Solr-trunk-Linux/solr/solrj/src/test-files/solrj/solr/shared
   [junit4]   2> 13250 T60 oasc.SolrResourceLoader.<init> new SolrResourceLoader for directory: '/mnt/ssd/jenkins/workspace/Lucene-Solr-trunk-Linux/solr/solrj/src/test-files/solrj/solr/shared/'
   [junit4]   2> 13261 T60 oasc.ConfigSolr.fromFile Loading container configuration from /mnt/ssd/jenkins/workspace/Lucene-Solr-trunk-Linux/solr/build/solr-solrj/test/J0/./solrtest-TestCoreAdmin-1385973021348/solr.xml
   [junit4]   2> 13275 T60 oasc.CoreContainer.<init> New CoreContainer 8962007
   [junit4]   2> 13275 T60 oasc.CoreContainer.load Loading cores into CoreContainer [instanceDir=/mnt/ssd/jenkins/workspace/Lucene-Solr-trunk-Linux/solr/solrj/src/test-files/solrj/solr/shared/]
   [junit4]   2> 13276 T60 oashc.HttpShardHandlerFactory.getParameter Setting socketTimeout to: 0
   [junit4]   2> 13276 T60 oashc.HttpShardHandlerFactory.getParameter Setting urlScheme to: http://
   [junit4]   2> 13276 T60 oashc.HttpShardHandlerFactory.getParameter Setting connTimeout to: 0
   [junit4]   2> 13276 T60 oashc.HttpShardHandlerFactory.getParameter Setting maxConnectionsPerHost to: 20
   [junit4]   2> 13277 T60 oashc.HttpShardHandlerFactory.getParameter Setting corePoolSize to: 0
   [junit4]   2> 13277 T60 oashc.HttpShardHandlerFactory.getParameter Setting maximumPoolSize to: 2147483647
   [junit4]   2> 13277 T60 oashc.HttpShardHandlerFactory.getParameter Setting maxThreadIdleTime to: 5
   [junit4]   2> 13278 T60 oashc.HttpShardHandlerFactory.getParameter Setting sizeOfQueue to: -1
   [junit4]   2> 13278 T60 oashc.HttpShardHandlerFactory.getParameter Setting fairnessPolicy to: false
   [junit4]   2> 13283 T60 oasl.LogWatcher.createWatcher SLF4J impl is org.slf4j.impl.Log4jLoggerFactory
   [junit4]   2> 13283 T60 oasl.LogWatcher.newRegisteredLogWatcher Registering Log Listener [Log4j (org.slf4j.impl.Log4jLoggerFactory)]
   [junit4]   2> 13283 T60 oasc.CoreContainer.load Host Name: 127.0.0.1
   [junit4]   2> 13293 T69 oasc.CoreContainer.create Creating SolrCore 'collection1' using instanceDir: /mnt/ssd/jenkins/workspace/Lucene-Solr-trunk-Linux/solr/solrj/src/test-files/solrj/solr/shared/.
   [junit4]   2> 13293 T69 oasc.SolrResourceLoader.<init> new SolrResourceLoader for directory: '/mnt/ssd/jenkins/workspace/Lucene-Solr-trunk-Linux/solr/solrj/src/test-files/solrj/solr/shared/./'
   [junit4]   2> 13299 T70 oasc.CoreContainer.create Creating SolrCore 'core0' using instanceDir: /mnt/ssd/jenkins/workspace/Lucene-Solr-trunk-Linux/solr/solrj/src/test-files/solrj/solr/shared/.
   [junit4]   2> 13299 T70 oasc.SolrResourceLoader.<init> new SolrResourceLoader for directory: '/mnt/ssd/jenkins/workspace/Lucene-Solr-trunk-Linux/solr/solrj/src/test-files/solrj/solr/shared/./'
   [junit4]   2> 13302 T71 oasc.CoreContainer.create Creating SolrCore 'core1' using instanceDir: /mnt/ssd/jenkins/workspace/Lucene-Solr-trunk-Linux/solr/solrj/src/test-files/solrj/solr/shared/.
   [junit4]   2> 13302 T71 oasc.SolrResourceLoader.<init> new SolrResourceLoader for directory: '/mnt/ssd/jenkins/workspace/Lucene-Solr-trunk-Linux/solr/solrj/src/test-files/solrj/solr/shared/./'
   [junit4]   2> 13325 T69 oasc.SolrConfig.<init> Using Lucene MatchVersion: LUCENE_50
   [junit4]   2> 13333 T69 oasc.SolrConfig.<init> Loaded SolrConfig: solrconfig.xml
   [junit4]   2> 13333 T69 oass.IndexSchema.readSchema Reading Solr Schema from schema.xml
   [junit4]   2> 13343 T69 oass.IndexSchema.readSchema [collection1] Schema name=example core 
   [junit4]   2> 13350 T70 oasc.SolrConfig.<init> Using Lucene MatchVersion: LUCENE_50
   [junit4]   2> 13353 T69 oass.IndexSchema.readSchema default search field in schema is name
   [junit4]   2> 13353 T69 oass.IndexSchema.readSchema query parser default operator is OR
   [junit4]   2> 13354 T69 oass.IndexSchema.readSchema unique key field: id
   [junit4]   2> 13356 T69 oasc.SolrCore.initDirectoryFactory org.apache.solr.core.MockDirectoryFactory
   [junit4]   2> 13356 T69 oasc.SolrCore.<init> [collection1] Opening new SolrCore at /mnt/ssd/jenkins/workspace/Lucene-Solr-trunk-Linux/solr/solrj/src/test-files/solrj/solr/shared/./, dataDir=/mnt/ssd/jenkins/workspace/Lucene-Solr-trunk-Linux/solr/build/solr-solrj/test/J0/./solrtest-TestCoreAdmin-1385973021348/data/-/
   [junit4]   2> 13356 T69 oasc.SolrCore.<init> JMX monitoring not detected for core: collection1
   [junit4]   2> 13362 T70 oasc.SolrConfig.<init> Loaded SolrConfig: solrconfig.xml
   [junit4]   2> 13362 T70 oass.IndexSchema.readSchema Reading Solr Schema from schema.xml
   [junit4]   2> 13381 T71 oasc.SolrConfig.<init> Using Lucene MatchVersion: LUCENE_50
   [junit4]   2> 13389 T71 oasc.SolrConfig.<init> Loaded SolrConfig: solrconfig.xml
   [junit4]   2> 13389 T71 oass.IndexSchema.readSchema Reading Solr Schema from schema.xml
   [junit4]   2> 13389 T69 oasc.CachingDirectoryFactory.get return new directory for /mnt/ssd/jenkins/workspace/Lucene-Solr-trunk-Linux/solr/build/solr-solrj/test/J0/./solrtest-TestCoreAdmin-1385973021348/data/-
   [junit4]   2> 13390 T69 oasc.SolrCore.getNewIndexDir New index directory detected: old=null new=/mnt/ssd/jenkins/workspace/Lucene-Solr-trunk-Linux/solr/build/solr-solrj/test/J0/./solrtest-TestCoreAdmin-1385973021348/data/-/index/
   [junit4]   2> 13390 T69 oasc.SolrCore.initIndex WARN [collection1] Solr index directory '/mnt/ssd/jenkins/workspace/Lucene-Solr-trunk-Linux/solr/build/solr-solrj/test/J0/./solrtest-TestCoreAdmin-1385973021348/data/-/index' doesn't exist. Creating new index...
   [junit4]   2> 13390 T70 oass.IndexSchema.readSchema [core0] Schema name=example core EN
   [junit4]   2> 13390 T69 oasc.CachingDirectoryFactory.get return new directory for /mnt/ssd/jenkins/workspace/Lucene-Solr-trunk-Linux/solr/build/solr-solrj/test/J0/./solrtest-TestCoreAdmin-1385973021348/data/-/index
   [junit4]   2> 13393 T69 oasc.SolrDeletionPolicy.onCommit SolrDeletionPolicy.onCommit: commits: num=1
   [junit4]   2> 		commit{dir=MockDirectoryWrapper(org.apache.lucene.store.RAMDirectory@101a4fd lockFactory=org.apache.lucene.store.NativeFSLockFactory@190cc52),segFN=segments_1,generation=1}
   [junit4]   2> 13393 T69 oasc.SolrDeletionPolicy.updateCommits newest commit generation = 1
   [junit4]   2> 13400 T70 oass.IndexSchema.readSchema default search field in schema is name
   [junit4]   2> 13400 T70 oass.IndexSchema.readSchema query parser default operator is OR
   [junit4]   2> 13400 T71 oass.IndexSchema.readSchema [core1] Schema name=example core FR
   [junit4]   2> 13401 T70 oass.IndexSchema.readSchema unique key field: id
   [junit4]   2> 13403 T70 oasc.SolrCore.initDirectoryFactory org.apache.solr.core.MockDirectoryFactory
   [junit4]   2> 13403 T70 oasc.SolrCore.<init> [core0] Opening new SolrCore at /mnt/ssd/jenkins/workspace/Lucene-Solr-trunk-Linux/solr/solrj/src/test-files/solrj/solr/shared/./, dataDir=/mnt/ssd/jenkins/workspace/Lucene-Solr-trunk-Linux/solr/build/solr-solrj/test/J0/./solrtest-TestCoreAdmin-1385973021348/data1/
   [junit4]   2> 13403 T70 oasc.SolrCore.<init> JMX monitoring not detected for core: core0
   [junit4]   2> 13410 T69 oasc.SolrCore.loadUpdateProcessorChains no updateRequestProcessorChain defined as default, creating implicit default
   [junit4]   2> 13411 T69 oasc.RequestHandlers.initHandlersFromConfig created standard: solr.StandardRequestHandler
   [junit4]   2> 13411 T69 oasc.RequestHandlers.initHandlersFromConfig created /update: solr.UpdateRequestHandler
   [junit4]   2> 13411 T69 oasc.RequestHandlers.initHandlersFromConfig created /admin/: org.apache.solr.handler.admin.AdminHandlers
   [junit4]   2> 13413 T69 oashl.XMLLoader.init xsltCacheLifetimeSeconds=60
   [junit4]   2> 13414 T71 oass.IndexSchema.readSchema default search field in schema is name
   [junit4]   2> 13414 T70 oasc.CachingDirectoryFactory.get return new directory for /mnt/ssd/jenkins/workspace/Lucene-Solr-trunk-Linux/solr/build/solr-solrj/test/J0/./solrtest-TestCoreAdmin-1385973021348/data1
   [junit4]   2> 13414 T71 oass.IndexSchema.readSchema query parser default operator is OR
   [junit4]   2> 13414 T70 oasc.SolrCore.getNewIndexDir New index directory detected: old=null new=/mnt/ssd/jenkins/workspace/Lucene-Solr-trunk-Linux/solr/build/solr-solrj/test/J0/./solrtest-TestCoreAdmin-1385973021348/data1/index/
   [junit4]   2> 13415 T71 oass.IndexSchema.readSchema unique key field: id
   [junit4]   2> 13415 T70 oasc.SolrCore.initIndex WARN [core0] Solr index directory '/mnt/ssd/jenkins/workspace/Lucene-Solr-trunk-Linux/solr/build/solr-solrj/test/J0/./solrtest-TestCoreAdmin-1385973021348/data1/index' doesn't exist. Creating new index...
   [junit4]   2> 13417 T71 oasc.SolrCore.initDirectoryFactory org.apache.solr.core.MockDirectoryFactory
   [junit4]   2> 13428 T70 oasc.CachingDirectoryFactory.get return new directory for /mnt/ssd/jenkins/workspace/Lucene-Solr-trunk-Linux/solr/build/solr-solrj/test/J0/./solrtest-TestCoreAdmin-1385973021348/data1/index
   [junit4]   2> 13428 T69 oasu.CommitTracker.<init> Hard AutoCommit: disabled
   [junit4]   2> 13428 T69 oasu.CommitTracker.<init> Soft AutoCommit: disabled
   [junit4]   2> 13428 T71 oasc.SolrCore.<init> [core1] Opening new SolrCore at /mnt/ssd/jenkins/workspace/Lucene-Solr-trunk-Linux/solr/solrj/src/test-files/solrj/solr/shared/./, dataDir=/mnt/ssd/jenkins/workspace/Lucene-Solr-trunk-Linux/solr/build/solr-solrj/test/J0/./solrtest-TestCoreAdmin-1385973021348/data2/
   [junit4]   2> 13429 T71 oasc.SolrCore.<init> JMX monitoring not detected for core: core1
   [junit4]   2> 13430 T70 oasc.SolrDeletionPolicy.onCommit SolrDeletionPolicy.onCommit: commits: num=1
   [junit4]   2> 		commit{dir=MockDirectoryWrapper(org.apache.lucene.store.RAMDirectory@1f0c19c lockFactory=org.apache.lucene.store.NativeFSLockFactory@56a608),segFN=segments_1,generation=1}
   [junit4]   2> 13430 T70 oasc.SolrDeletionPolicy.updateCommits newest commit generation = 1
   [junit4]   2> 13430 T71 oasc.CachingDirectoryFactory.get return new directory for /mnt/ssd/jenkins/workspace/Lucene-Solr-trunk-Linux/solr/build/solr-solrj/test/J0/./solrtest-TestCoreAdmin-1385973021348/data2
   [junit4]   2> 13431 T71 oasc.SolrCore.getNewIndexDir New index directory detected: old=null new=/mnt/ssd/jenkins/workspace/Lucene-Solr-trunk-Linux/solr/build/solr-solrj/test/J0/./solrtest-TestCoreAdmin-1385973021348/data2/index/
   [junit4]   2> 13431 T71 oasc.SolrCore.initIndex WARN [core1] Solr index directory '/mnt/ssd/jenkins/workspace/Lucene-Solr-trunk-Linux/solr/build/solr-solrj/test/J0/./solrtest-TestCoreAdmin-1385973021348/data2/index' doesn't exist. Creating new index...
   [junit4]   2> 13431 T70 oasc.SolrCore.loadUpdateProcessorChains no updateRequestProcessorChain defined as default, creating implicit default
   [junit4]   2> 13431 T70 oasc.RequestHandlers.initHandlersFromConfig created standard: solr.StandardRequestHandler
   [junit4]   2> 13431 T69 oasc.SolrDeletionPolicy.onInit SolrDeletionPolicy.onInit: commits: num=1
   [junit4]   2> 		commit{dir=MockDirectoryWrapper(org.apache.lucene.store.RAMDirectory@101a4fd lockFactory=org.apache.lucene.store.NativeFSLockFactory@190cc52),segFN=segments_1,generation=1}
   [junit4]   2> 13432 T69 oasc.SolrDeletionPolicy.updateCommits newest commit generation = 1
   [junit4]   2> 13432 T69 oass.SolrIndexSearcher.<init> Opening Searcher@11e5912 main
   [junit4]   2> 13432 T69 oasc.CoreContainer.registerCore registering core: collection1
   [junit4]   2> 13431 T71 oasc.CachingDirectoryFactory.get return new directory for /mnt/ssd/jenkins/workspace/Lucene-Solr-trunk-Linux/solr/build/solr-solrj/test/J0/./solrtest-TestCoreAdmin-1385973021348/data2/index
   [junit4]   2> 13433 T72 oasc.SolrCore.registerSearcher [collection1] Registered new searcher Searcher@11e5912 main{StandardDirectoryReader(segments_1:1:nrt)}
   [junit4]   2> 13432 T70 oasc.RequestHandlers.initHandlersFromConfig created /update: solr.UpdateRequestHandler
   [junit4]   2> 13433 T70 oasc.RequestHandlers.initHandlersFromConfig created /admin/: org.apache.solr.handler.admin.AdminHandlers
   [junit4]   2> 13435 T71 oasc.SolrDeletionPolicy.onCommit SolrDeletionPolicy.onCommit: commits: num=1
   [junit4]   2> 		commit{dir=MockDirectoryWrapper(org.apache.lucene.store.RAMDirectory@1f8d96e lockFactory=org.apache.lucene.store.NativeFSLockFactory@18d4d70),segFN=segments_1,generation=1}
   [junit4]   2> 13435 T71 oasc.SolrDeletionPolicy.updateCommits newest commit generation = 1
   [junit4]   2> 13435 T70 oashl.XMLLoader.init xsltCacheLifetimeSeconds=60
   [junit4]   2> 13436 T71 oasc.SolrCore.loadUpdateProcessorChains no updateRequestProcessorChain defined as default, creating implicit default
   [junit4]   2> 13436 T71 oasc.RequestHandlers.initHandlersFromConfig created standard: solr.StandardRequestHandler
   [junit4]   2> 13437 T70 oasu.CommitTracker.<init> Hard AutoCommit: disabled
   [junit4]   2> 13437 T71 oasc.RequestHandlers.initHandlersFromConfig created /update: solr.UpdateRequestHandler
   [junit4]   2> 13437 T70 oasu.CommitTracker.<init> Soft AutoCommit: disabled
   [junit4]   2> 13437 T71 oasc.RequestHandlers.initHandlersFromConfig created /admin/: org.apache.solr.handler.admin.AdminHandlers
   [junit4]   2> 13438 T70 oasc.SolrDeletionPolicy.onInit SolrDeletionPolicy.onInit: commits: num=1
   [junit4]   2> 		commit{dir=MockDirectoryWrapper(org.apache.lucene.store.RAMDirectory@1f0c19c lockFactory=org.apache.lucene.store.NativeFSLockFactory@56a608),segFN=segments_1,generation=1}
   [junit4]   2> 13440 T70 oasc.SolrDeletionPolicy.updateCommits newest commit generation = 1
   [junit4]   2> 13440 T70 oass.SolrIndexSearcher.<init> Opening Searcher@a103d6 main
   [junit4]   2> 13441 T73 oasc.SolrCore.registerSearcher [core0] Registered new searcher Searcher@a103d6 main{StandardDirectoryReader(segments_1:1:nrt)}
   [junit4]   2> 13442 T70 oasc.CoreContainer.registerCore registering core: core0
   [junit4]   2> 13442 T71 oashl.XMLLoader.init xsltCacheLifetimeSeconds=60
   [junit4]   2> 13443 T71 oasu.CommitTracker.<init> Hard AutoCommit: disabled
   [junit4]   2> 13443 T71 oasu.CommitTracker.<init> Soft AutoCommit: disabled
   [junit4]   2> 13444 T71 oasc.SolrDeletionPolicy.onInit SolrDeletionPolicy.onInit: commits: num=1
   [junit4]   2> 		commit{dir=MockDirectoryWrapper(org.apache.lucene.store.RAMDirectory@1f8d96e lockFactory=org.apache.lucene.store.NativeFSLockFactory@18d4d70),segFN=segments_1,generation=1}
   [junit4]   2> 13444 T71 oasc.SolrDeletionPolicy.updateCommits newest commit generation = 1
   [junit4]   2> 13444 T71 oass.SolrIndexSearcher.<init> Opening Searcher@172da33 main
   [junit4]   2> 13445 T71 oasc.CoreContainer.registerCore registering core: core1
   [junit4]   2> 13445 T74 oasc.SolrCore.registerSearcher [core1] Registered new searcher Searcher@172da33 main{StandardDirectoryReader(segments_1:1:nrt)}
   [junit4]   2> ASYNC  NEW_CORE C5 name=core0 org.apache.solr.core.SolrCore@1845b53
   [junit4]   2> 13447 T60 C5 oasc.SolrException.log ERROR org.apache.solr.common.SolrException: Unsupported operation: BADACTION
   [junit4]   2> 		at org.apache.solr.handler.admin.CoreAdminHandler.handleCustomAction(CoreAdminHandler.java:418)
   [junit4]   2> 		at org.apache.solr.handler.admin.CoreAdminHandler.handleRequestBody(CoreAdminHandler.java:146)
   [junit4]   2> 		at org.apache.solr.handler.RequestHandlerBase.handleRequest(RequestHandlerBase.java:135)
   [junit4]   2> 		at org.apache.solr.core.SolrCore.execute(SolrCore.java:1874)
   [junit4]   2> 		at org.apache.solr.client.solrj.embedded.EmbeddedSolrServer.request(EmbeddedSolrServer.java:150)
   [junit4]   2> 		at org.apache.solr.client.solrj.request.TestCoreAdmin.testErrorCases(TestCoreAdmin.java:129)
   [junit4]   2> 		at sun.reflect.NativeMethodAccessorImpl.invoke0(Native Method)
   [junit4]   2> 		at sun.reflect.NativeMethodAccessorImpl.invoke(NativeMethodAccessorImpl.java:62)
   [junit4]   2> 		at sun.reflect.DelegatingMethodAccessorImpl.invoke(DelegatingMethodAccessorImpl.java:43)
   [junit4]   2> 		at java.lang.reflect.Method.invoke(Method.java:483)
   [junit4]   2> 		at com.carrotsearch.randomizedtesting.RandomizedRunner.invoke(RandomizedRunner.java:1559)
   [junit4]   2> 		at com.carrotsearch.randomizedtesting.RandomizedRunner.access$600(RandomizedRunner.java:79)
   [junit4]   2> 		at com.carrotsearch.randomizedtesting.RandomizedRunner$6.evaluate(RandomizedRunner.java:737)
   [junit4]   2> 		at com.carrotsearch.randomizedtesting.RandomizedRunner$7.evaluate(RandomizedRunner.java:773)
   [junit4]   2> 		at com.carrotsearch.randomizedtesting.RandomizedRunner$8.evaluate(RandomizedRunner.java:787)
   [junit4]   2> 		at org.apache.lucene.util.TestRuleSetupTeardownChained$1.evaluate(TestRuleSetupTeardownChained.java:50)
   [junit4]   2> 		at org.apache.lucene.util.TestRuleFieldCacheSanity$1.evaluate(TestRuleFieldCacheSanity.java:51)
   [junit4]   2> 		at org.apache.lucene.util.AbstractBeforeAfterRule$1.evaluate(AbstractBeforeAfterRule.java:46)
   [junit4]   2> 		at com.carrotsearch.randomizedtesting.rules.SystemPropertiesInvariantRule$1.evaluate(SystemPropertiesInvariantRule.java:55)
   [junit4]   2> 		at org.apache.lucene.util.TestRuleThreadAndTestName$1.evaluate(TestRuleThreadAndTestName.java:49)
   [junit4]   2> 		at org.apache.lucene.util.TestRuleIgnoreAfterMaxFailures$1.evaluate(TestRuleIgnoreAfterMaxFailures.java:70)
   [junit4]   2> 		at org.apache.lucene.util.TestRuleMarkFailure$1.evaluate(TestRuleMarkFailure.java:48)
   [junit4]   2> 		at com.carrotsearch.randomizedtesting.rules.StatementAdapter.evaluate(StatementAdapter.java:36)
   [junit4]   2> 		at com.carrotsearch.randomizedtesting.ThreadLeakControl$StatementRunner.run(ThreadLeakControl.java:358)
   [junit4]   2> 		at com.carrotsearch.randomizedtesting.ThreadLeakControl.forkTimeoutingTask(ThreadLeakControl.java:782)
   [junit4]   2> 		at com.carrotsearch.randomizedtesting.ThreadLeakControl$3.evaluate(ThreadLeakControl.java:442)
   [junit4]   2> 		at com.carrotsearch.randomizedtesting.RandomizedRunner.runSingleTest(RandomizedRunner.java:746)
   [junit4]   2> 		at com.carrotsearch.randomizedtesting.RandomizedRunner$3.evaluate(RandomizedRunner.java:648)
   [junit4]   2> 		at com.carrotsearch.randomizedtesting.RandomizedRunner$4.evaluate(RandomizedRunner.java:682)
   [junit4]   2> 		at com.carrotsearch.randomizedtesting.RandomizedRunner$5.evaluate(RandomizedRunner.java:693)
   [junit4]   2> 		at org.apache.lucene.util.AbstractBeforeAfterRule$1.evaluate(AbstractBeforeAfterRule.java:46)
   [junit4]   2> 		at org.apache.lucene.util.TestRuleStoreClassName$1.evaluate(TestRuleStoreClassName.java:42)
   [junit4]   2> 		at com.carrotsearch.randomizedtesting.rules.SystemPropertiesInvariantRule$1.evaluate(SystemPropertiesInvariantRule.java:55)
   [junit4]   2> 		at com.carrotsearch.randomizedtesting.rules.NoShadowingOrOverridesOnMethodsRule$1.evaluate(NoShadowingOrOverridesOnMethodsRule.java:39)
   [junit4]   2> 		at com.carrotsearch.randomizedtesting.rules.NoShadowingOrOverridesOnMethodsRule$1.evaluate(NoShadowingOrOverridesOnMethodsRule.java:39)
   [junit4]   2> 		at com.carrotsearch.randomizedtesting.rules.StatementAdapter.evaluate(StatementAdapter.java:36)
   [junit4]   2> 		at org.apache.lucene.util.TestRuleAssertionsRequired$1.evaluate(TestRuleAssertionsRequired.java:43)
   [junit4]   2> 		at org.apache.lucene.util.TestRuleMarkFailure$1.evaluate(TestRuleMarkFailure.java:48)
   [junit4]   2> 		at org.apache.lucene.util.TestRuleIgnoreAfterMaxFailures$1.evaluate(TestRuleIgnoreAfterMaxFailures.java:70)
   [junit4]   2> 		at org.apache.lucene.util.TestRuleIgnoreTestSuites$1.evaluate(TestRuleIgnoreTestSuites.java:55)
   [junit4]   2> 		at com.carrotsearch.randomizedtesting.rules.StatementAdapter.evaluate(StatementAdapter.java:36)
   [junit4]   2> 		at com.carrotsearch.randomizedtesting.ThreadLeakControl$StatementRunner.run(ThreadLeakControl.java:358)
   [junit4]   2> 		at java.lang.Thread.run(Thread.java:744)
   [junit4]   2> 	
   [junit4]   2> 13448 T60 C5 oasc.SolrCore.execute [core0] webapp=null path=/admin/cores params={action=BADACTION&name=badactioncollection} status=400 QTime=3 
   [junit4]   2> 13449 T60 oasc.CoreContainer.shutdown Shutting down CoreContainer instance=8962007
   [junit4]   1> Solr home: /mnt/ssd/jenkins/workspace/Lucene-Solr-trunk-Linux/solr/solrj/src/test-files/solrj/solr/shared
   [junit4]   2> 7201365 T59 ccr.ThreadLeakControl$2.evaluate WARNING Suite execution timed out: org.apache.solr.client.solrj.request.TestCoreAdmin
   [junit4]   2> 	==== jstack at approximately timeout time ====
   [junit4]   2> 	"Thread-38" ID=75 WAITING on java.lang.Object@1c5e3ed
   [junit4]   2> 		at java.lang.Object.wait(Native Method)
   [junit4]   2> 		- waiting on java.lang.Object@1c5e3ed
   [junit4]   2> 		at java.lang.Object.wait(Object.java:502)
   [junit4]   2> 		at org.apache.solr.core.CloserThread.run(CoreContainer.java:1006)
   [junit4]   2> 	
   [junit4]   2> 	"searcherExecutor-40-thread-1" ID=74 WAITING on java.util.concurrent.locks.AbstractQueuedSynchronizer$ConditionObject@1bf4bae
   [junit4]   2> 		at sun.misc.Unsafe.park(Native Method)
   [junit4]   2> 		- waiting on java.util.concurrent.locks.AbstractQueuedSynchronizer$ConditionObject@1bf4bae
   [junit4]   2> 		at java.util.concurrent.locks.LockSupport.park(LockSupport.java:175)
   [junit4]   2> 		at java.util.concurrent.locks.AbstractQueuedSynchronizer$ConditionObject.await(AbstractQueuedSynchronizer.java:2039)
   [junit4]   2> 		at java.util.concurrent.LinkedBlockingQueue.take(LinkedBlockingQueue.java:442)
   [junit4]   2> 		at java.util.concurrent.ThreadPoolExecutor.getTask(ThreadPoolExecutor.java:1067)
   [junit4]   2> 		at java.util.concurrent.ThreadPoolExecutor.runWorker(ThreadPoolExecutor.java:1127)
   [junit4]   2> 		at java.util.concurrent.ThreadPoolExecutor$Worker.run(ThreadPoolExecutor.java:617)
   [junit4]   2> 		at java.lang.Thread.run(Thread.java:744)
   [junit4]   2> 	
   [junit4]   2> 	"searcherExecutor-39-thread-1" ID=73 WAITING on java.util.concurrent.locks.AbstractQueuedSynchronizer$ConditionObject@6ca2d6
   [junit4]   2> 		at sun.misc.Unsafe.park(Native Method)
   [junit4]   2> 		- waiting on java.util.concurrent.locks.AbstractQueuedSynchronizer$ConditionObject@6ca2d6
   [junit4]   2> 		at java.util.concurrent.locks.LockSupport.park(LockSupport.java:175)
   [junit4]   2> 		at java.util.concurrent.locks.AbstractQueuedSynchronizer$ConditionObject.await(AbstractQueuedSynchronizer.java:2039)
   [junit4]   2> 		at java.util.concurrent.LinkedBlockingQueue.take(LinkedBlockingQueue.java:442)
   [junit4]   2> 		at java.util.concurrent.ThreadPoolExecutor.getTask(ThreadPoolExecutor.java:1067)
   [junit4]   2> 		at java.util.concurrent.ThreadPoolExecutor.runWorker(ThreadPoolExecutor.java:1127)
   [junit4]   2> 		at java.util.concurrent.ThreadPoolExecutor$Worker.run(ThreadPoolExecutor.java:617)
   [junit4]   2> 		at java.lang.Thread.run(Thread.java:744)
   [junit4]   2> 	
   [junit4]   2> 	"searcherExecutor-38-thread-1" ID=72 WAITING on java.util.concurrent.locks.AbstractQueuedSynchronizer$ConditionObject@1fc543b
   [junit4]   2> 		at sun.misc.Unsafe.park(Native Method)
   [junit4]   2> 		- waiting on java.util.concurrent.locks.AbstractQueuedSynchronizer$ConditionObject@1fc543b
   [junit4]   2> 		at java.util.concurrent.locks.LockSupport.park(LockSupport.java:175)
   [junit4]   2> 		at java.util.concurrent.locks.AbstractQueuedSynchronizer$ConditionObject.await(AbstractQueuedSynchronizer.java:2039)
   [junit4]   2> 		at java.util.concurrent.LinkedBlockingQueue.take(LinkedBlockingQueue.java:442)
   [junit4]   2> 		at java.util.concurrent.ThreadPoolExecutor.getTask(ThreadPoolExecutor.java:1067)
   [junit4]   2> 		at java.util.concurrent.ThreadPoolExecutor.runWorker(ThreadPoolExecutor.java:1127)
   [junit4]   2> 		at java.util.concurrent.ThreadPoolExecutor$Worker.run(ThreadPoolExecutor.java:617)
   [junit4]   2> 		at java.lang.Thread.run(Thread.java:744)
   [junit4]   2> 	
   [junit4]   2> 	"TEST-TestCoreAdmin.testErrorCases-seed#[26470E3C15D56D3D]" ID=60 WAITING on org.apache.solr.core.CloserThread@1ea1ca2
   [junit4]   2> 		at java.lang.Object.wait(Native Method)
   [junit4]   2> 		- waiting on org.apache.solr.core.CloserThread@1ea1ca2
   [junit4]   2> 		at java.lang.Thread.join(Thread.java:1244)
   [junit4]   2> 		at java.lang.Thread.join(Thread.java:1318)
   [junit4]   2> 		at org.apache.solr.core.CoreContainer.shutdown(CoreContainer.java:376)
   [junit4]   2> 		at org.apache.solr.client.solrj.embedded.AbstractEmbeddedSolrServerTestCase.tearDown(AbstractEmbeddedSolrServerTestCase.java:75)
   [junit4]   2> 		at sun.reflect.NativeMethodAccessorImpl.invoke0(Native Method)
   [junit4]   2> 		at sun.reflect.NativeMethodAccessorImpl.invoke(NativeMethodAccessorImpl.java:62)
   [junit4]   2> 		at sun.reflect.DelegatingMethodAccessorImpl.invoke(DelegatingMethodAccessorImpl.java:43)
   [junit4]   2> 		at java.lang.reflect.Method.invoke(Method.java:483)
   [junit4]   2> 		at com.carrotsearch.randomizedtesting.RandomizedRunner.invoke(RandomizedRunner.java:1559)
   [junit4]   2> 		at com.carrotsearch.randomizedtesting.RandomizedRunner.access$600(RandomizedRunner.java:79)
   [junit4]   2> 		at com.carrotsearch.randomizedtesting.RandomizedRunner$8.evaluate(RandomizedRunner.java:795)
   [junit4]   2> 		at org.apache.lucene.util.TestRuleSetupTeardownChained$1.evaluate(TestRuleSetupTeardownChained.java:50)
   [junit4]   2> 		at org.apache.lucene.util.TestRuleFieldCacheSanity$1.evaluate(TestRuleFieldCacheSanity.java:51)
   [junit4]   2> 		at org.apache.lucene.util.AbstractBeforeAfterRule$1.evaluate(AbstractBeforeAfterRule.java:46)
   [junit4]   2> 		at com.carrotsearch.randomizedtesting.rules.SystemPropertiesInvariantRule$1.evaluate(SystemPropertiesInvariantRule.java:55)
   [junit4]   2> 		at org.apache.lucene.util.TestRuleThreadAndTestName$1.evaluate(TestRuleThreadAndTestName.java:49)
   [junit4]   2> 		at org.apache.lucene.util.TestRuleIgnoreAfterMaxFailures$1.evaluate(TestRuleIgnoreAfterMaxFailures.java:70)
   [junit4]   2> 		at org.apache.lucene.util.TestRuleMarkFailure$1.evaluate(TestRuleMarkFailure.java:48)
   [junit4]   2> 		at com.carrotsearch.randomizedtesting.rules.StatementAdapter.evaluate(StatementAdapter.java:36)
   [junit4]   2> 		at com.carrotsearch.randomizedtesting.ThreadLeakControl$StatementRunner.run(ThreadLeakControl.java:358)
   [junit4]   2> 		at com.carrotsearch.randomizedtesting.ThreadLeakControl.forkTimeoutingTask(ThreadLeakControl.java:782)
   [junit4]   2> 		at com.carrotsearch.randomizedtesting.ThreadLeakControl$3.evaluate(ThreadLeakControl.java:442)
   [junit4]   2> 		at com.carrotsearch.randomizedtesting.RandomizedRunner.runSingleTest(RandomizedRunner.java:746)
   [junit4]   2> 		at com.carrotsearch.randomizedtesting.RandomizedRunner$3.evaluate(RandomizedRunner.java:648)
   [junit4]   2> 		at com.carrotsearch.randomizedtesting.RandomizedRunner$4.evaluate(RandomizedRunner.java:682)
   [junit4]   2> 		at com.carrotsearch.randomizedtesting.RandomizedRunner$5.evaluate(RandomizedRunner.java:693)
   [junit4]   2> 		at org.apache.lucene.util.AbstractBeforeAfterRule$1.evaluate(AbstractBeforeAfterRule.java:46)
   [junit4]   2> 		at org.apache.lucene.util.TestRuleStoreClassName$1.evaluate(TestRuleStoreClassName.java:42)
   [junit4]   2> 		at com.carrotsearch.randomizedtesting.rules.SystemPropertiesInvariantRule$1.evaluate(SystemPropertiesInvariantRule.java:55)
   [junit4]   2> 		at com.carrotsearch.randomizedtesting.rules.NoShadowingOrOverridesOnMethodsRule$1.evaluate(NoShadowingOrOverridesOnMethodsRule.java:39)
   [junit4]   2> 		at com.carrotsearch.randomizedtesting.rules.NoShadowingOrOverridesOnMethodsRule$1.evaluate(NoShadowingOrOverridesOnMethodsRule.java:39)
   [junit4]   2> 		at com.carrotsearch.randomizedtesting.rules.StatementAdapter.evaluate(StatementAdapter.java:36)
   [junit4]   2> 		at org.apache.lucene.util.TestRuleAssertionsRequired$1.evaluate(TestRuleAssertionsRequired.java:43)
   [junit4]   2> 		at org.apache.lucene.util.TestRuleMarkFailure$1.evaluate(TestRuleMarkFailure.java:48)
   [junit4]   2> 		at org.apache.lucene.util.TestRuleIgnoreAfterMaxFailures$1.evaluate(TestRuleIgnoreAfterMaxFailures.java:70)
   [junit4]   2> 		at org.apache.lucene.util.TestRuleIgnoreTestSuites$1.evaluate(TestRuleIgnoreTestSuites.java:55)
   [junit4]   2> 		at com.carrotsearch.randomizedtesting.rules.StatementAdapter.evaluate(StatementAdapter.java:36)
   [junit4]   2> 		at com.carrotsearch.randomizedtesting.ThreadLeakControl$StatementRunner.run(ThreadLeakControl.java:358)
   [junit4]   2> 		at java.lang.Thread.run(Thread.java:744)
   [junit4]   2> 	
   [junit4]   2> 	"SUITE-TestCoreAdmin-seed#[26470E3C15D56D3D]" ID=59 RUNNABLE
   [junit4]   2> 		at sun.management.ThreadImpl.dumpThreads0(Native Method)
   [junit4]   2> 		at sun.management.ThreadImpl.dumpAllThreads(ThreadImpl.java:446)
   [junit4]   2> 		at com.carrotsearch.randomizedtesting.ThreadLeakControl.formatThreadStacksFull(ThreadLeakControl.java:655)
   [junit4]   2> 		at com.carrotsearch.randomizedtesting.ThreadLeakControl.access$800(ThreadLeakControl.java:60)
   [junit4]   2> 		at com.carrotsearch.randomizedtesting.ThreadLeakControl$2.evaluate(ThreadLeakControl.java:396)
   [junit4]   2> 		- locked java.lang.Object@c5c54a
   [junit4]   2> 		at com.carrotsearch.randomizedtesting.RandomizedRunner.runSuite(RandomizedRunner.java:556)
   [junit4]   2> 		at com.carrotsearch.randomizedtesting.RandomizedRunner.access$200(RandomizedRunner.java:79)
   [junit4]   2> 		at com.carrotsearch.randomizedtesting.RandomizedRunner$1.run(RandomizedRunner.java:492)
   [junit4]   2> 	
   [junit4]   2> 	"Signal Dispatcher" ID=4 RUNNABLE
   [junit4]   2> 	
   [junit4]   2> 	"Finalizer" ID=3 WAITING on java.lang.ref.ReferenceQueue$Lock@188b456
   [junit4]   2> 		at java.lang.Object.wait(Native Method)
   [junit4]   2> 		- waiting on java.lang.ref.ReferenceQueue$Lock@188b456
   [junit4]   2> 		at java.lang.ref.ReferenceQueue.remove(ReferenceQueue.java:142)
   [junit4]   2> 		at java.lang.ref.ReferenceQueue.remove(ReferenceQueue.java:158)
   [junit4]   2> 		at java.lang.ref.Finalizer$FinalizerThread.run(Finalizer.java:209)
   [junit4]   2> 	
   [junit4]   2> 	"Reference Handler" ID=2 WAITING on java.lang.ref.Reference$Lock@f87ad0
   [junit4]   2> 		at java.lang.Object.wait(Native Method)
   [junit4]   2> 		- waiting on java.lang.ref.Reference$Lock@f87ad0
   [junit4]   2> 		at java.lang.Object.wait(Object.java:502)
   [junit4]   2> 		at java.lang.ref.Reference$ReferenceHandler.run(Reference.java:157)
   [junit4]   2> 	
   [junit4]   2> 	"main" ID=1 WAITING on com.carrotsearch.randomizedtesting.RandomizedRunner$1@f8e9d6
   [junit4]   2> 		at java.lang.Object.wait(Native Method)
   [junit4]   2> 		- waiting on com.carrotsearch.randomizedtesting.RandomizedRunner$1@f8e9d6
   [junit4]   2> 		at java.lang.Thread.join(Thread.java:1244)
   [junit4]   2> 		at java.lang.Thread.join(Thread.java:1318)
   [junit4]   2> 		at com.carrotsearch.randomizedtesting.RandomizedRunner.runSuite(RandomizedRunner.java:502)
   [junit4]   2> 		at com.carrotsearch.randomizedtesting.RandomizedRunner.run(RandomizedRunner.java:399)
   [junit4]   2> 		at com.carrotsearch.ant.tasks.junit4.slave.SlaveMain.execute(SlaveMain.java:180)
   [junit4]   2> 		at com.carrotsearch.ant.tasks.junit4.slave.SlaveMain.main(SlaveMain.java:275)
   [junit4]   2> 		at com.carrotsearch.ant.tasks.junit4.slave.SlaveMainSafe.main(SlaveMainSafe.java:12)
   [junit4]   2> 	
   [junit4]   2> 	^^==============================================
   [junit4]   2> 	
   [junit4]   2> NOTE: reproduce with: ant test  -Dtestcase=TestCoreAdmin -Dtests.method=testErrorCases -Dtests.seed=26470E3C15D56D3D -Dtests.multiplier=3 -Dtests.slow=true -Dtests.locale=es_BO -Dtests.timezone=Australia/ACT -Dtests.file.encoding=US-ASCII
   [junit4] ERROR   7200s J0 | TestCoreAdmin.testErrorCases <<<
   [junit4]    > Throwable #1: java.lang.Exception: Test abandoned because suite timeout was reached.
   [junit4]    > 	at __randomizedtesting.SeedInfo.seed([26470E3C15D56D3D]:0)
   [junit4]   2> 7201398 T59 ccr.ThreadLeakControl.checkThreadLeaks WARNING Will linger awaiting termination of 5 leaked thread(s).
   [junit4]   2> 7221514 T59 ccr.ThreadLeakControl.checkThreadLeaks SEVERE 5 threads leaked from SUITE scope at org.apache.solr.client.solrj.request.TestCoreAdmin: 
   [junit4]   2> 	   1) Thread[id=73, name=searcherExecutor-39-thread-1, state=WAITING, group=TGRP-TestCoreAdmin]
   [junit4]   2> 	        at sun.misc.Unsafe.park(Native Method)
   [junit4]   2> 	        at java.util.concurrent.locks.LockSupport.park(LockSupport.java:175)
   [junit4]   2> 	        at java.util.concurrent.locks.AbstractQueuedSynchronizer$ConditionObject.await(AbstractQueuedSynchronizer.java:2039)
   [junit4]   2> 	        at java.util.concurrent.LinkedBlockingQueue.take(LinkedBlockingQueue.java:442)
   [junit4]   2> 	        at java.util.concurrent.ThreadPoolExecutor.getTask(ThreadPoolExecutor.java:1067)
   [junit4]   2> 	        at java.util.concurrent.ThreadPoolExecutor.runWorker(ThreadPoolExecutor.java:1127)
   [junit4]   2> 	        at java.util.concurrent.ThreadPoolExecutor$Worker.run(ThreadPoolExecutor.java:617)
   [junit4]   2> 	        at java.lang.Thread.run(Thread.java:744)
   [junit4]   2> 	   2) Thread[id=72, name=searcherExecutor-38-thread-1, state=WAITING, group=TGRP-TestCoreAdmin]
   [junit4]   2> 	        at sun.misc.Unsafe.park(Native Method)
   [junit4]   2> 	        at java.util.concurrent.locks.LockSupport.park(LockSupport.java:175)
   [junit4]   2> 	        at java.util.concurrent.locks.AbstractQueuedSynchronizer$ConditionObject.await(AbstractQueuedSynchronizer.java:2039)
   [junit4]   2> 	        at java.util.concurrent.LinkedBlockingQueue.take(LinkedBlockingQueue.java:442)
   [junit4]   2> 	        at java.util.concurrent.ThreadPoolExecutor.getTask(ThreadPoolExecutor.java:1067)
   [junit4]   2> 	        at java.util.concurrent.ThreadPoolExecutor.runWorker(ThreadPoolExecutor.java:1127)
   [junit4]   2> 	        at java.util.concurrent.ThreadPoolExecutor$Worker.run(ThreadPoolExecutor.java:617)
   [junit4]   2> 	        at java.lang.Thread.run(Thread.java:744)
   [junit4]   2> 	   3) Thread[id=60, name=TEST-TestCoreAdmin.testErrorCases-seed#[26470E3C15D56D3D], state=WAITING, group=TGRP-TestCoreAdmin]
   [junit4]   2> 	        at java.lang.Object.wait(Native Method)
   [junit4]   2> 	        at java.lang.Thread.join(Thread.java:1244)
   [junit4]   2> 	        at java.lang.Thread.join(Thread.java:1318)
   [junit4]   2> 	        at org.apache.solr.core.CoreContainer.shutdown(CoreContainer.java:376)
   [junit4]   2> 	        at org.apache.solr.client.solrj.embedded.AbstractEmbeddedSolrServerTestCase.tearDown(AbstractEmbeddedSolrServerTestCase.java:75)
   [junit4]   2> 	        at sun.reflect.NativeMethodAccessorImpl.invoke0(Native Method)
   [junit4]   2> 	        at sun.reflect.NativeMethodAccessorImpl.invoke(NativeMethodAccessorImpl.java:62)
   [junit4]   2> 	        at sun.reflect.DelegatingMethodAccessorImpl.invoke(DelegatingMethodAccessorImpl.java:43)
   [junit4]   2> 	        at java.lang.reflect.Method.invoke(Method.java:483)
   [junit4]   2> 	        at com.carrotsearch.randomizedtesting.RandomizedRunner.invoke(RandomizedRunner.java:1559)
   [junit4]   2> 	        at com.carrotsearch.randomizedtesting.RandomizedRunner.access$600(RandomizedRunner.java:79)
   [junit4]   2> 	        at com.carrotsearch.randomizedtesting.RandomizedRunner$8.evaluate(RandomizedRunner.java:795)
   [junit4]   2> 	        at org.apache.lucene.util.TestRuleSetupTeardownChained$1.evaluate(TestRuleSetupTeardownChained.java:50)
   [junit4]   2> 	        at org.apache.lucene.util.TestRuleFieldCacheSanity$1.evaluate(TestRuleFieldCacheSanity.java:51)
   [junit4]   2> 	        at org.apache.lucene.util.AbstractBeforeAfterRule$1.evaluate(AbstractBeforeAfterRule.java:46)
   [junit4]   2> 	        at com.carrotsearch.randomizedtesting.rules.SystemPropertiesInvariantRule$1.evaluate(SystemPropertiesInvariantRule.java:55)
   [junit4]   2> 	        at org.apache.lucene.util.TestRuleThreadAndTestName$1.evaluate(TestRuleThreadAndTestName.java:49)
   [junit4]   2> 	        at org.apache.lucene.util.TestRuleIgnoreAfterMaxFailures$1.evaluate(TestRuleIgnoreAfterMaxFailures.java:70)
   [junit4]   2> 	        at org.apache.lucene.util.TestRuleMarkFailure$1.evaluate(TestRuleMarkFailure.java:48)
   [junit4]   2> 	        at com.carrotsearch.randomizedtesting.rules.StatementAdapter.evaluate(StatementAdapter.java:36)
   [junit4]   2> 	        at com.carrotsearch.randomizedtesting.ThreadLeakControl$StatementRunner.run(ThreadLeakControl.java:358)
   [junit4]   2> 	        at com.carrotsearch.randomizedtesting.ThreadLeakControl.forkTimeoutingTask(ThreadLeakControl.java:782)
   [junit4]   2> 	        at com.carrotsearch.randomizedtesting.ThreadLeakControl$3.evaluate(ThreadLeakControl.java:442)
   [junit4]   2> 	        at com.carrotsearch.randomizedtesting.RandomizedRunner.runSingleTest(RandomizedRunner.java:746)
   [junit4]   2> 	        at com.carrotsearch.randomizedtesting.RandomizedRunner$3.evaluate(RandomizedRunner.java:648)
   [junit4]   2> 	        at com.carrotsearch.randomizedtesting.RandomizedRunner$4.evaluate(RandomizedRunner.java:682)
   [junit4]   2> 	        at com.carrotsearch.randomizedtesting.RandomizedRunner$5.evaluate(RandomizedRunner.java:693)
   [junit4]   2> 	        at org.apache.lucene.util.AbstractBeforeAfterRule$1.evaluate(AbstractBeforeAfterRule.java:46)
   [junit4]   2> 	        at org.apache.lucene.util.TestRuleStoreClassName$1.evaluate(TestRuleStoreClassName.java:42)
   [junit4]   2> 	        at com.carrotsearch.randomizedtesting.rules.SystemPropertiesInvariantRule$1.evaluate(SystemPropertiesInvariantRule.java:55)
   [junit4]   2> 	        at com.carrotsearch.randomizedtesting.rules.NoShadowingOrOverridesOnMethodsRule$1.evaluate(NoShadowingOrOverridesOnMethodsRule.java:39)
   [junit4]   2> 	        at com.carrotsearch.randomizedtesting.rules.NoShadowingOrOverridesOnMethodsRule$1.evaluate(NoShadowingOrOverridesOnMethodsRule.java:39)
   [junit4]   2> 	        at com.carrotsearch.randomizedtesting.rules.StatementAdapter.evaluate(StatementAdapter.java:36)
   [junit4]   2> 	        at org.apache.lucene.util.TestRuleAssertionsRequired$1.evaluate(TestRuleAssertionsRequired.java:43)
   [junit4]   2> 	        at org.apache.lucene.util.TestRuleMarkFailure$1.evaluate(TestRuleMarkFailure.java:48)
   [junit4]   2> 	        at org.apache.lucene.util.TestRuleIgnoreAfterMaxFailures$1.evaluate(TestRuleIgnoreAfterMaxFailures.java:70)
   [junit4]   2> 	        at org.apache.lucene.util.TestRuleIgnoreTestSuites$1.evaluate(TestRuleIgnoreTestSuites.java:55)
   [junit4]   2> 	        at com.carrotsearch.randomizedtesting.rules.StatementAdapter.evaluate(StatementAdapter.java:36)
   [junit4]   2> 	        at com.carrotsearch.randomizedtesting.ThreadLeakControl$StatementRunner.run(ThreadLeakControl.java:358)
   [junit4]   2> 	        at java.lang.Thread.run(Thread.java:744)
   [junit4]   2> 	   4) Thread[id=75, name=Thread-38, state=WAITING, group=TGRP-TestCoreAdmin]
   [junit4]   2> 	        at java.lang.Object.wait(Native Method)
   [junit4]   2> 	        at java.lang.Object.wait(Object.java:502)
   [junit4]   2> 	        at org.apache.solr.core.CloserThread.run(CoreContainer.java:1006)
   [junit4]   2> 	   5) Thread[id=74, name=searcherExecutor-40-thread-1, state=WAITING, group=TGRP-TestCoreAdmin]
   [junit4]   2> 	        at sun.misc.Unsafe.park(Native Method)
   [junit4]   2> 	        at java.util.concurrent.locks.LockSupport.park(LockSupport.java:175)
   [junit4]   2> 	        at java.util.concurrent.locks.AbstractQueuedSynchronizer$ConditionObject.await(AbstractQueuedSynchronizer.java:2039)
   [junit4]   2> 	        at java.util.concurrent.LinkedBlockingQueue.take(LinkedBlockingQueue.java:442)
   [junit4]   2> 	        at java.util.concurrent.ThreadPoolExecutor.getTask(ThreadPoolExecutor.java:1067)
   [junit4]   2> 	        at java.util.concurrent.ThreadPoolExecutor.runWorker(ThreadPoolExecutor.java:1127)
   [junit4]   2> 	        at java.util.concurrent.ThreadPoolExecutor$Worker.run(ThreadPoolExecutor.java:617)
   [junit4]   2> 	        at java.lang.Thread.run(Thread.java:744)
   [junit4]   2> 7221516 T59 ccr.ThreadLeakControl.tryToInterruptAll Starting to interrupt leaked threads:
   [junit4]   2> 	   1) Thread[id=73, name=searcherExecutor-39-thread-1, state=WAITING, group=TGRP-TestCoreAdmin]
   [junit4]   2> 	   2) Thread[id=72, name=searcherExecutor-38-thread-1, state=WAITING, group=TGRP-TestCoreAdmin]
   [junit4]   2> 	   3) Thread[id=60, name=TEST-TestCoreAdmin.testErrorCases-seed#[26470E3C15D56D3D], state=WAITING, group=TGRP-TestCoreAdmin]
   [junit4]   2> 	   4) Thread[id=75, name=Thread-38, state=WAITING, group=TGRP-TestCoreAdmin]
   [junit4]   2> 	   5) Thread[id=74, name=searcherExecutor-40-thread-1, state=WAITING, group=TGRP-TestCoreAdmin]
   [junit4]   2> 7232983 T60 oasc.SolrCore.close [collection1]  CLOSING SolrCore org.apache.solr.core.SolrCore@8c1bc7
   [junit4]   2> 7232983 T60 oasu.DirectUpdateHandler2.close closing DirectUpdateHandler2{commits=0,autocommits=0,soft autocommits=0,optimizes=0,rollbacks=0,expungeDeletes=0,docsPending=0,adds=0,deletesById=0,deletesByQuery=0,errors=0,cumulative_adds=0,cumulative_deletesById=0,cumulative_deletesByQuery=0,cumulative_errors=0,transaction_logs_total_size=0,transaction_logs_total_number=0}
   [junit4]   2> 7232984 T60 oasu.SolrCoreState.decrefSolrCoreState Closing SolrCoreState
   [junit4]   2> 7232984 T60 oasu.DefaultSolrCoreState.closeIndexWriter SolrCoreState ref count has reached 0 - closing IndexWriter
   [junit4]   2> 7232984 T60 oasu.DefaultSolrCoreState.closeIndexWriter closing IndexWriter with IndexWriterCloser
   [junit4]   2> 7232986 T60 oasc.SolrCore.closeSearcher [collection1] Closing main searcher on request.
   [junit4]   2> 7232986 T60 oasc.CachingDirectoryFactory.close Closing MockDirectoryFactory - 2 directories currently being tracked
   [junit4]   2> 7232986 T60 oasc.CachingDirectoryFactory.closeCacheValue looking to close /mnt/ssd/jenkins/workspace/Lucene-Solr-trunk-Linux/solr/build/solr-solrj/test/J0/./solrtest-TestCoreAdmin-1385973021348/data/-/index [CachedDir<<refCount=0;path=/mnt/ssd/jenkins/workspace/Lucene-Solr-trunk-Linux/solr/build/solr-solrj/test/J0/./solrtest-TestCoreAdmin-1385973021348/data/-/index;done=false>>]
   [junit4]   2> 7232987 T60 oasc.CachingDirectoryFactory.close Closing directory: /mnt/ssd/jenkins/workspace/Lucene-Solr-trunk-Linux/solr/build/solr-solrj/test/J0/./solrtest-TestCoreAdmin-1385973021348/data/-/index
   [junit4]   2> 7232987 T60 oasc.CachingDirectoryFactory.closeCacheValue looking to close /mnt/ssd/jenkins/workspace/Lucene-Solr-trunk-Linux/solr/build/solr-solrj/test/J0/./solrtest-TestCoreAdmin-1385973021348/data/- [CachedDir<<refCount=0;path=/mnt/ssd/jenkins/workspace/Lucene-Solr-trunk-Linux/solr/build/solr-solrj/test/J0/./solrtest-TestCoreAdmin-1385973021348/data/-;done=false>>]
   [junit4]   2> 7232988 T60 oasc.CachingDirectoryFactory.close Closing directory: /mnt/ssd/jenkins/workspace/Lucene-Solr-trunk-Linux/solr/build/solr-solrj/test/J0/./solrtest-TestCoreAdmin-1385973021348/data/-
   [junit4]   2> 7232988 T60 oasc.SolrCore.close [core0]  CLOSING SolrCore org.apache.solr.core.SolrCore@1845b53
   [junit4]   2> 7232988 T60 oasu.DirectUpdateHandler2.close closing DirectUpdateHandler2{commits=0,autocommits=0,soft autocommits=0,optimizes=0,rollbacks=0,expungeDeletes=0,docsPending=0,adds=0,deletesById=0,deletesByQuery=0,errors=0,cumulative_adds=0,cumulative_deletesById=0,cumulative_deletesByQuery=0,cumulative_errors=0,transaction_logs_total_size=0,transaction_logs_total_number=0}
   [junit4]   2> 7232988 T60 oasu.SolrCoreState.decrefSolrCoreState Closing SolrCoreState
   [junit4]   2> 7232989 T60 oasu.DefaultSolrCoreState.closeIndexWriter SolrCoreState ref count has reached 0 - closing IndexWriter
   [junit4]   2> 7232989 T60 oasu.DefaultSolrCoreState.closeIndexWriter closing IndexWriter with IndexWriterCloser
   [junit4]   2> 7232990 T60 oasc.SolrCore.closeSearcher [core0] Closing main searcher on request.
   [junit4]   2> 7232991 T60 oasc.CachingDirectoryFactory.close Closing MockDirectoryFactory - 2 directories currently being tracked
   [junit4]   2> 7232991 T60 oasc.CachingDirectoryFactory.closeCacheValue looking to close /mnt/ssd/jenkins/workspace/Lucene-Solr-trunk-Linux/solr/build/solr-solrj/test/J0/./solrtest-TestCoreAdmin-1385973021348/data1 [CachedDir<<refCount=0;path=/mnt/ssd/jenkins/workspace/Lucene-Solr-trunk-Linux/solr/build/solr-solrj/test/J0/./solrtest-TestCoreAdmin-1385973021348/data1;done=false>>]
   [junit4]   2> 7232991 T60 oasc.CachingDirectoryFactory.close Closing directory: /mnt/ssd/jenkins/workspace/Lucene-Solr-trunk-Linux/solr/build/solr-solrj/test/J0/./solrtest-TestCoreAdmin-1385973021348/data1
   [junit4]   2> 7232991 T60 oasc.CachingDirectoryFactory.closeCacheValue looking to close /mnt/ssd/jenkins/workspace/Lucene-Solr-trunk-Linux/solr/build/solr-solrj/test/J0/./solrtest-TestCoreAdmin-1385973021348/data1/index [CachedDir<<refCount=0;path=/mnt/ssd/jenkins/workspace/Lucene-Solr-trunk-Linux/solr/build/solr-solrj/test/J0/./solrtest-TestCoreAdmin-1385973021348/data1/index;done=false>>]
   [junit4]   2> 7232992 T60 oasc.CachingDirectoryFactory.close Closing directory: /mnt/ssd/jenkins/workspace/Lucene-Solr-trunk-Linux/solr/build/solr-solrj/test/J0/./solrtest-TestCoreAdmin-1385973021348/data1/index
   [junit4]   2> 7232992 T60 oasc.SolrCore.close [core1]  CLOSING SolrCore org.apache.solr.core.SolrCore@1ed35ac
   [junit4]   2> 7232992 T60 oasu.DirectUpdateHandler2.close closing DirectUpdateHandler2{commits=0,autocommits=0,soft autocommits=0,optimizes=0,rollbacks=0,expungeDeletes=0,docsPending=0,adds=0,deletesById=0,deletesByQuery=0,errors=0,cumulative_adds=0,cumulative_deletesById=0,cumulative_deletesByQuery=0,cumulative_errors=0,transaction_logs_total_size=0,transaction_logs_total_number=0}
   [junit4]   2> 7232993 T60 oasu.SolrCoreState.decrefSolrCoreState Closing SolrCoreState
   [junit4]   2> 7232993 T60 oasu.DefaultSolrCoreState.closeIndexWriter SolrCoreState ref count has reached 0 - closing IndexWriter
   [junit4]   2> 7232993 T60 oasu.DefaultSolrCoreState.closeIndexWriter closing IndexWriter with IndexWriterCloser
   [junit4]   2> 7232995 T60 oasc.SolrCore.closeSearcher [core1] Closing main searcher on request.
   [junit4]   2> 7232995 T60 oasc.CachingDirectoryFactory.close Closing MockDirectoryFactory - 2 directories currently being tracked
   [junit4]   2> 7232995 T60 oasc.CachingDirectoryFactory.closeCacheValue looking to close /mnt/ssd/jenkins/workspace/Lucene-Solr-trunk-Linux/solr/build/solr-solrj/test/J0/./solrtest-TestCoreAdmin-1385973021348/data2/index [CachedDir<<refCount=0;path=/mnt/ssd/jenkins/workspace/Lucene-Solr-trunk-Linux/solr/build/solr-solrj/test/J0/./solrtest-TestCoreAdmin-1385973021348/data2/index;done=false>>]
   [junit4]   2> 7232996 T60 oasc.CachingDirectoryFactory.close Closing directory: /mnt/ssd/jenkins/workspace/Lucene-Solr-trunk-Linux/solr/build/solr-solrj/test/J0/./solrtest-TestCoreAdmin-1385973021348/data2/index
   [junit4]   2> 7232996 T60 oasc.CachingDirectoryFactory.closeCacheValue looking to close /mnt/ssd/jenkins/workspace/Lucene-Solr-trunk-Linux/solr/build/solr-solrj/test/J0/./solrtest-TestCoreAdmin-1385973021348/data2 [CachedDir<<refCount=0;path=/mnt/ssd/jenkins/workspace/Lucene-Solr-trunk-Linux/solr/build/solr-solrj/test/J0/./solrtest-TestCoreAdmin-1385973021348/data2;done=false>>]
   [junit4]   2> 7232996 T60 oasc.CachingDirectoryFactory.close Closing directory: /mnt/ssd/jenkins/workspace/Lucene-Solr-trunk-Linux/solr/build/solr-solrj/test/J0/./solrtest-TestCoreAdmin-1385973021348/data2
   [junit4]   2> 7221534 T59 ccr.ThreadLeakControl.tryToInterruptAll All leaked threads terminated.
   [junit4]   2> NOTE: test params are: codec=Asserting, sim=RandomSimilarityProvider(queryNorm=true,coord=yes): {}, locale=es_BO, timezone=Australia/ACT
   [junit4]   2> NOTE: Linux 3.8.0-33-generic i386/Oracle Corporation 1.8.0-ea (32-bit)/cpus=8,threads=1,free=144318952,total=215744512
   [junit4]   2> NOTE: All tests run in this JVM: [SolrExampleXMLTest, LargeVolumeBinaryJettyTest, TestCoreAdmin]
   [junit4]   2> NOTE: reproduce with: ant test  -Dtestcase=TestCoreAdmin -Dtests.seed=26470E3C15D56D3D -Dtests.multiplier=3 -Dtests.slow=true -Dtests.locale=es_BO -Dtests.timezone=Australia/ACT -Dtests.file.encoding=US-ASCII
   [junit4] ERROR   0.00s J0 | TestCoreAdmin (suite) <<<
   [junit4]    > Throwable #1: java.lang.Exception: Suite timeout exceeded (>= 7200000 msec).
   [junit4]    > 	at __randomizedtesting.SeedInfo.seed([26470E3C15D56D3D]:0)
   [junit4] Completed on J0 in 7220.20s, 2 tests, 2 errors <<< FAILURES!

[...truncated 38 lines...]
BUILD FAILED
/mnt/ssd/jenkins/workspace/Lucene-Solr-trunk-Linux/build.xml:420: The following error occurred while executing this line:
/mnt/ssd/jenkins/workspace/Lucene-Solr-trunk-Linux/build.xml:400: The following error occurred while executing this line:
/mnt/ssd/jenkins/workspace/Lucene-Solr-trunk-Linux/build.xml:39: The following error occurred while executing this line:
/mnt/ssd/jenkins/workspace/Lucene-Solr-trunk-Linux/extra-targets.xml:37: The following error occurred while executing this line:
/mnt/ssd/jenkins/workspace/Lucene-Solr-trunk-Linux/solr/build.xml:202: The following error occurred while executing this line:
/mnt/ssd/jenkins/workspace/Lucene-Solr-trunk-Linux/solr/common-build.xml:491: The following error occurred while executing this line:
/mnt/ssd/jenkins/workspace/Lucene-Solr-trunk-Linux/lucene/common-build.xml:1275: The following error occurred while executing this line:
/mnt/ssd/jenkins/workspace/Lucene-Solr-trunk-Linux/lucene/common-build.xml:908: There were test failures: 46 suites, 275 tests, 1 suite-level error, 1 error

Total time: 168 minutes 26 seconds
Build step 'Invoke Ant' marked build as failure
Description set: Java: 32bit/jdk1.8.0-ea-b117 -server -XX:+UseParallelGC
Archiving artifacts
Recording test results
Email was triggered for: Failure
Sending email for trigger: Failure



Mime
View raw message